{"text_format":"1","workbook":"xlsx","n_sheets":6,"sheets":["Kold","Kold2","Brand","Brand2","Firsidig","Makro"],"not_rendered":{"charts":5,"images":4,"macros":1,"external_links":0,"defined_names":5,"comments":4,"pivot_tables":0},"unopened":[],"bounds":{"document_bytes":16777216,"sheet_cells":100000,"rows_first":2000,"rows_last":500,"rows_between":2000,"halvings":0,"cell_chars":16384,"cell_head_chars":4096},"cells_cut":0,"cells_raw":0,"read":"whole","date_system":"1900"}

{"sheet":"Kold","index":0,"n_rows":141,"n_cols":90,"rows_kept":141,"cut":false,"hidden":false,"merged":[[30,17,31,20],[33,17,33,20],[28,5,28,7],[28,2,28,4],[1,3,1,10],[2,11,5,15],[1,11,1,12],[1,13,1,15],[2,9,2,10],[3,9,3,10],[4,9,4,10],[2,3,2,7],[4,3,4,7],[3,3,3,7]]}
[]
[null,"Bruger:",null,{"$f":"Makro!D20","v":0},null,null,null,null,null,null,null,"Bjælkeberegning",null," Betonelement-Foreningen feb 2019"]
[null,"Sagsnavn:",null,"Betonelementhuset",null,null,null,null,"Sag nr.:","23 - 4545",null,{"$f":"BF16","v":"For ny bruger: Klik på knappen 'angiv nyt brugernavn' for ibrugtagning."}]
[null,"Bygningsdel:",null,"Bjælke i modul D-E/12, stueetage",null,null,null,null,"Dato:","2008-03-01"]
[null,"Emne:",null,"Normale lastkombinationer",null,null,null,null,"Init:","JFJ"]
[]
[null,null,null,null,null,null,null,null,null,null,null,"Spændvidde",null,"Tværsnit","h",700]
[null,null,null,null,null,null,null,null,null,null,null,"L",5,null,"b",300,null,null,null,null,null,null,null,null,null,null,null,null,null,null,null,null,null,null,null,null,null,null,null,null,null,null,null,null,null,null,null,null,null,"Anvendelsestilstand, tøjninger, spændinger og revnevidder",null,null,null,null,null,null,null,null,null,null,null,"BRUDLAST, MOMENTKAPACITET"]
[null,null,null,null,null,null,null,null,null,null,null,"Længdearmering                c' =",null,40,"beff",{"$f":"MIN(P8,2.0001*(P8-2*N9))","v":300},null,null,null,null,null,null,null,null,null,null,null,null,null,null,null,null,null,null,null,null,null,null,null,null,null,null,null,null,null,"A_1",{"$f":"P11*0.25*PI()*N11^2","v":1608.4954386379741},"mm2",null,null,null,null,null,"e_0","s_o","s_2","s_3","s_m","w",null,null,"L","h","b","fck","fcd","Ecd","Ac","ac","Esc","fyd_c","At","at","Est","fyd_t","At","at","Est","fyd_t","Modenhed","1+f","uterm","   emax","e1","k","Tilstand:","Nf"]
[null,null,null,null,null,null,null,null,null,null,null,null,null,"d (mm)","c (mm)","antal",null,null,null,null,null,null,null,null,null,null,null,null,null,null,null,null,null,null,null,null,null,null,null,null,null,null,null,null,null,"A_2",{"$f":"P12*0.25*PI()*N12^2","v":0},"mm2",null,"Langtid",null,null,null,{"$f":"BK79","v":2.4493291552436399E-5},{"$f":"BR79","v":11.983628888659256},{"$f":"BV79","v":25.173183629152437},{"$f":"BT79","v":29.154270684632266},{"$f":"(BE10*AU11+BD10*AU10)/(AU10+AU11)","v":29.154270684632266},{"$f":"BT141","v":0},null,null,"(m)","(m)","(m)","(Mpa)","(Mpa)","(Mpa)","(m2)","(m)","(Mpa)","(Mpa)","(m2)","(m)","(Mpa)","(Mpa)","(m2)","(m)","(Mpa)","(Mpa)","(døgn)",null,"(m)"]
[null,null,null,null,null,null,null,null,null,null,null,"Tryklag   t",null,16,40,8,null,null,null,null,null,null,null,null,null,null,null,null,null,null,null,null,null,null,null,null,null,null,null,null,null,null,null,null,null,"A_3",{"$f":"P13*0.25*PI()*N13^2","v":1608.4954386379741},"mm2",null,"Korttid",null,null,null,{"$f":"BK102","v":4.4417320686335707E-5},{"$f":"BR102","v":6.6084396683932605},{"$f":"BV102","v":25.241902895841072},{"$f":"BT102","v":28.654439599151889},{"$f":"(BE11*AU11+BD11*AU10)/(AU10+AU11)","v":28.654439599151889},null,null,null,{"$f":"M8","v":5},{"$f":"P7/1000","v":0.7},{"$f":"P9/1000","v":0.3},{"$f":"M21","v":35},{"$f":"BM11/M18","v":25},{"$f":"22000*((BM11+8)/10)^0.3/M18","v":24340.818713706667},{"$f":"AU9/1000000","v":1.6084954386379742E-3},{"$f":"O11/1000","v":0.04},200000,{"$f":"P18/M19","v":416.66666666666669},{"$f":"AU11/1000000","v":1.6084954386379742E-3},{"$f":"O13/1000","v":0.04},200000,{"$f":"P18/M19","v":416.66666666666669},{"$f":"AU10/1000000","v":0},{"$f":"O12/1000","v":0.1},200000,{"$f":"P19","v":416.66666666666669},null,1,0,{"$f":"0.0035","v":3.5000000000000001E-3},{"$f":"0.7*($M$21+8)^(0.31)/1000","v":2.246328469196467E-3},{"$f":"1.05*BO11*CF11/BN11","v":2.2964539096862753},1,{"$f":"0+0.000001","v":9.9999999999999995E-7}]
[null,null,null,null,null,null,null,null,null,null,null,"Træklag 1",null,14,100,0,null,null,null,null,null,null,null,null,null,null,null,null,null,null,null,null,null,null,null,null,null,null,null,null,null,null,null,null,null,"E_sk",200000,"Mpa",null,"Kar. last",null,null,null,{"$f":"BB11+BB10","v":6.8910612238772106E-5},{"$f":"BC11+BC10","v":18.592068557052517},{"$f":"BD11+BD10","v":50.415086524993512},{"$f":"BE11+BE10","v":57.808710283784151},{"$f":"BF11+BF10","v":57.808710283784151},{"$f":"BS141","v":0},null,null,"hc","e0","a'","b'","N'","tN'","t'","Nc","sac","Nac","sat","Nat","sat","Nat","Mtot","N","N","A","B1","B2","B2'","B3","C1","C2","C2'"]
[null,null,null,null,null,null,null,null,null,null,null,"Træklag 2",null,16,40,8,null,null,null,null,null,null,null,null,null,null,null,null,null,null,null,null,null,null,null,null,null,null,null,null,null,null,null,null,null,"E_sd",{"$f":"AU12/M19","v":166666.66666666669},"MPa"]
[null,null,null,null,null,null,null,null,null,null,null,"Bøjler",null,"d (mm)","a (mm)","cotq",null,null,null,null,null,null,null,null,null,null,null,null,null,null,null,null,null,null,null,null,null,null,null,null,null,null,null,null,null,"d",{"$f":"P7-(AU10*O12+AU11*O13)/(AU10+AU11)","v":660},"mm",null,null,null,null,null,null,null,null,null,null,null,null,null,{"$f":"0.5*(-(CB14+CC14+CD14+CE14)+SQRT(MAX((CB14+CC14+CD14+CE14)^2+4*CA14*(CF14+CG14+CH14),0)))/CA14","v":0.1736713274900655},{"$f":"0.025*$CE$11","v":8.7500000000000013E-5},{"$f":"IF($CH$11=1,BK14/($CG$11*$CF$11),2^(1/3)*$CF$11/BK14)","v":1.6961999978345084E-2},{"$f":"IF($CH$11=1,-($CG$11-2)*BK14/$CF$11,3*($CF$11/BK14)^2)","v":-1.1547606440133831E-2},{"$f":"IF(CH$11=1,0.5*(CG$11*BK14*BN$11/CF$11)*(1-CI13^2+(BL14-BM14)*(BM14^2*(1-CI13^2)+2*BM14*(1-CI13)+2*LN((1-BM14)/(1-BM14*CI13)))/(BM14^3)),BN$11*BM14*(LN((1-BL14+BL14^2)/(1+BL14)^2)/(6*BL14)+ATAN((2-BL14)/(BL14*3^0.5))/(BL14*3^0.5)-LN((CI13^2-BL14*CI13+BL14^2)/(CI13+BL14)^2)/(6*BL14)-ATAN((2*CI13-BL14)/(BL14*3^0.5))/(BL14*3^0.5)))","v":1.0970866021360473},{"$f":"IF(CH$11=1,(CG$11*BK14*BN$11/CF$11)*(1-CI13^3-(BL14-BM14)*(-2*BM14^3*(1-CI13^3)-3*BM14^2*(1-CI13^2)-6*BM14*(1-CI13)-6*LN((1-BM14)/(1-BM14*CI13)))/(2*BM14^4))/3,BN$11*BM14*(LN((1+BL14^3)/(BL14^3+CI13^3)))/3)","v":0.72964431803516983},{"$f":"BO14/BN14","v":0.66507449513515093},{"$f":"BN14*BJ14*BL$11","v":5.7159745969359792E-2},{"$f":"MAX(MIN(BS$11,CC$11*BR$11*BK14*(BJ14-BQ$11)/BJ14),-BS$11)","v":13.469397999563045},{"$f":"BR14*BP$11","v":2.166546524349661E-2},{"$f":"MIN(BW$11,CC$11*BV$11*BK14*(BK$11-BJ14-BU$11)/BJ14)","v":49.004933007209807},{"$f":"BT14*BT$11","v":7.8824211212856474E-2},{"$f":"MIN($CA$11,CC$11*$BZ$11*BK14*(BK$11-BJ14-$BY$11)/BJ14)","v":42.959030006554372},{"$f":"BV14*$BX$11","v":0},{"$f":"(0.5*BK$11-BJ14+BP14*BJ14)*BQ14+(0.5*BK$11-BQ$11)*BS14+(0.5*BK$11-BU$11)*BU14+(0.5*BK$11-BY$11)*BW14","v":4.7832902302519242E-2},{"$f":"BQ14+BS14-BU14-BW14","v":9.9999999993161115E-7},{"$f":"$CI$11","v":9.9999999999999995E-7},{"$f":"BN14*BL$11","v":0.32912598064081416},{"$f":"IF(BR13<BS$11,CC$11*BK14*BP$11*BR$11,BP$11*BS$11)","v":2.8148670176164552E-2},{"$f":"IF(BT13<BW$11,CC$11*BK14*BT$11*BV$11,-BT$11*BW$11)","v":2.8148670176164552E-2},{"$f":"IF(BV13<CA$11,CC$11*BK14*$BX$11*$BZ$11,-$BX$11*CA$11)","v":0},{"$f":"-BZ14","v":-9.9999999999999995E-7},{"$f":"IF(BR13<BS$11,BQ$11*CC$11*BK14*BP$11*BR$11,0)","v":1.1259468070465822E-3},{"$f":"IF(BT13<BW$11,(BK$11-BU$11)*CC$11*BK14*BT$11*BV$11,0)","v":1.8578122316268601E-2},{"$f":"IF(BV13<CA$11,(BK$11-$BY$11)*CC$11*BK14*$BX$11*$BZ$11,0)","v":0},{"$f":"IF(BX14>BX13,BK14,CI13)","v":8.7500000000000013E-5},{"$f":"IF(BX14>BX13,BR14,CJ13)","v":13.469397999563045},{"$f":"IF(BX14>BX13,BT14,CK13)","v":49.004933007209807},{"$f":"IF(BX14>BX13,BV14,CL13)","v":42.959030006554372}]
[null,null,null,null,null,null,null,null,null,null,null,"Type 1",null,6,150,2,null,null,null,null,null,null,null,null,null,null,null,null,null,null,null,null,null,null,null,null,null,null,null,null,null,null,null,null,null,"c_w",{"$f":"(AU11*O13+AU10*O12)/(AU10+AU11)","v":40},null,null,null,null,null,null,null,null,null,null,null,null,null,null,{"$f":"0.5*(-(CB15+CC15+CD15+CE15)+SQRT(MAX((CB15+CC15+CD15+CE15)^2+4*CA15*(CF15+CG15+CH15),0)))/CA15","v":0.17478095117896406},{"$f":"0.025*$CE$11+BK14","v":1.7500000000000003E-4},3.3923999956690168E-2,-2.3095212880267661E-2,2.1527499503302794,1.4282744933027924,{"$f":"BO15/BN15","v":0.66346511497243954},0.11287790519075815,26.989973789726704,4.3413249729733878E-2,97.165432469509454,0.15629015492049206,85.150393154099504,{"$f":"BV15*$BX$11","v":0},9.4775856595223834E-2,{"$f":"BQ15+BS15-BU15-BW15","v":9.9999999997324451E-7},{"$f":"$CI$11","v":9.9999999999999995E-7},0.64582498509908381,{"$f":"IF(2*BR14-BR13<BS$11,CC$11*BK15*BP$11*BR$11,BP$11*BS$11)","v":5.6297340352329105E-2},{"$f":"IF(2*BT14-BT13<BW$11,CC$11*BK15*BT$11*BV$11,-BT$11*BW$11)","v":5.6297340352329105E-2},{"$f":"IF(2*BV14-BV13<CA$11,CC$11*BK15*$BX$11*$BZ$11,-$BX$11*CA$11)","v":0},{"$f":"-BZ15","v":-9.9999999999999995E-7},{"$f":"IF(2*BR14-BR13<BS$11,BQ$11*CC$11*BK15*BP$11*BR$11,0)","v":2.2518936140931644E-3},{"$f":"IF(2*BT14-BT13<BW$11,(BK$11-BU$11)*CC$11*BK15*BT$11*BV$11,0)","v":3.7156244632537201E-2},{"$f":"IF(2*BV14-BV13<CA$11,(BK$11-$BY$11)*CC$11*BK15*$BX$11*$BZ$11,0)","v":0},1.7500000000000003E-4,26.989973789726704,97.165432469509454,{"$f":"IF(BX15>BX14,BV15,CL14)","v":85.150393154099504}]
[null,null,null,null,null,null,null,null,null,null,null,"Type 2",null,6,150,{"$f":"P15","v":2},null,null,null,null,null,null,null,null,null,null,null,null,null,null,null,null,null,null,null,null,null,null,null,null,null,null,null,null,null,null,null,null,null,"Fejltabel",null,null,null,null,null,null,"Fejl",{"$f":"IF(BG46=1,BF46,BF17&BF18&BF19&BF20&BF21&BF22&BF23&BF24&BF25&BF26&BF27&BF28&BF29&BF30&BF31&BF32&BF33&BF34&BF35&BF36&BF37&BF38&BF39&BF40&BF41&BF42&BF43&BF44&BF45)","v":"For ny bruger: Klik på knappen 'angiv nyt brugernavn' for ibrugtagning."},"NB'er",null,null,0.17589563114599757,2.6250000000000004E-4,5.0885999935035259E-2,-3.4642819320401488E-2,3.1680355011116279,2.0967250263059412,{"$f":"BO16/BN16","v":0.6618376042724976},{"$f":"BN16*BJ16*BL$11","v":0.16717308118828694},40.561101993733153,6.5242347543049417E-2,144.49181710340306,0.23241442873133625,126.58347009400278,0,0.14084050886855015,1.0000000001120224E-6,9.9999999999999995E-7,0.95041065033348837,{"$f":"IF(2*BR15-BR14<BS$11,CC$11*BK16*BP$11*BR$11,BP$11*BS$11)","v":8.4446010528493654E-2},{"$f":"IF(2*BT15-BT14<BW$11,CC$11*BK16*BT$11*BV$11,-BT$11*BW$11)","v":8.4446010528493654E-2},{"$f":"IF(2*BV15-BV14<CA$11,CC$11*BK16*$BX$11*$BZ$11,-$BX$11*CA$11)","v":0},-9.9999999999999995E-7,{"$f":"IF(2*BR15-BR14<BS$11,BQ$11*CC$11*BK16*BP$11*BR$11,0)","v":3.3778404211397463E-3},{"$f":"IF(2*BT15-BT14<BW$11,(BK$11-BU$11)*CC$11*BK16*BT$11*BV$11,0)","v":5.5734366948805812E-2},{"$f":"IF(2*BV15-BV14<CA$11,(BK$11-$BY$11)*CC$11*BK16*$BX$11*$BZ$11,0)","v":0},2.6250000000000004E-4,40.561101993733153,144.49181710340306,126.58347009400278]
[null,null,null,null,null,null,null,null,null,null,null,"Partialkoefficienter",null,"Længdearmering",null,null,null,null,null,null,null,null,null,null,null,null,null,null,null,null,null,null,null,null,null,null,null,null,null,null,null,null,null,null,null,"h_int",{"$f":"P7-BJ56*(1-BP56)*1000-(AU10*O12+AU11*O13)/(AU10+AU11)","v":635.56278048584659},"mm",null,"Negative inddata accepteres ikke; ",null,null,null,null,null,null,{"$f":"IF(MIN(M8,P7:P9,N9,N11:P13,N15:P15,N16:O16,M18:M19,P18,P21,M21,P24,P25,C22:K28)<0,1,0)","v":0},{"$f":"IF(BE17=1,AX17,\"\")","v":""}," ",null,null,0.17701529954837564,3.5000000000000005E-4,6.7847999913380336E-2,-4.6190425760535322E-2,4.1439515901301416,2.7357995658667913,0.66019100521897578,0.22006284961225636,54.182158225058956,8.7151754360568323E-2,190.99438928652739,0.30721360397282488,167.26762662411582,0,0.18603817193595357,9.9999999980671106E-7,9.9999999999999995E-7,1.2431854770390425,0.11259468070465821,0.11259468070465821,0,-9.9999999999999995E-7,4.5037872281863288E-3,7.4312489265074402E-2,0,3.5000000000000005E-4,54.182158225058956,190.99438928652739,167.26762662411582]
[null,null,null,null,null,null,null,null,null,null,null,"gc",1.4,null,"fyk",500,null,null,null,null,null,null,null,null,null,null,null,null,null,null,null,null,null,null,null,null,null,null,null,null,null,null,null,null,null,"Min arm",{"$f":"CEILING(MAX(0.26*0.3*M21^(2/3)*P9*AU14/P18,0.0013*P9*AU14),1)","v":331},"mm2",null,{"$f":"\"Bøjleafstand, a_1 skal være <  \"&CEILING(MIN(2*(N15^2*PI()/4)*P21/(0.063*P9*SQRT(M21)),0.75*AU14*MIN(1,P15)),1)&\" mm; \"","v":"Bøjleafstand, a_1 skal være <  208 mm; "},null,null,null,null,null,null,0,{"$f":"IF(BG18=1,AX18,\"\")","v":""},{"$f":"IF(O15>MIN(5*2*(N15^2*PI()/4)*P21/(P9*SQRT(10*M21)/10),0.75*AU14*MIN(1,P15)),1,0)","v":0},null,null,0.17814009130143221,4.3750000000000006E-4,8.4809999891725427E-2,-5.773803220066915E-2,5.0814711295875377,3.346272361962503,0.65852432821636819,0.27156411929109475,67.852541786466134,0.10914050396352332,236.68306052330911,0.38070362325461826,207.21187320300828,0,0.2303797380353122,9.9999999980671106E-7,9.9999999999999995E-7,1.5244413388762612,0.14074335088082277,0.14074335088082277,0,-9.9999999999999995E-7,5.6297340352329103E-3,9.2890611581342999E-2,0,4.3750000000000006E-4,67.852541786466134,236.68306052330911,207.21187320300828]
[null,null,{"$f":"\"=\"&IF(AU23>M30,\" \"&TEXT(AU23,\"0,0\")&\" kNm > \",\" \"&TEXT(AU23,\"0,0\")&\" kNm < \")","v":"= 0,0 kNm < "},{"$f":"IF(AU23>M30,\"!\",\" \")","v":" "},null,null,null,null,null,null,null,"gs",1.2,null,"fyd",{"$f":"P18/M19","v":416.66666666666669},null,null,null,null,null,null,null,null,null,null,null,null,null,null,null,null,null,null,null,null,null,null,null,null,null,null,null,null,null,"Max arm",{"$f":"0.04*P7*P9","v":8400},"mm2",null,{"$f":"\"Bøjleafstand, a_2 skal være <  \"&CEILING(MIN(2*(N16^2*PI()/4)*P21/(0.063*P9*SQRT(M21)),0.75*AU14*MIN(1,P15)),1)&\" mm; \"","v":"Bøjleafstand, a_2 skal være <  208 mm; "},null,null,null,null,null,null,0,{"$f":"IF(BG19=1,AX19,\"\")","v":""},{"$f":"IF(O16>MIN(5*2*(N16^2*PI()/4)*P21/(P9*SQRT(10*M21)/10),0.75*AU14*MIN(1,P15)),1,0)","v":0},null,null,0.17927017711508514,5.2500000000000008E-4,0.10177199987007052,-6.9285638640802977E-2,5.9815332110002553,3.9288896321122668,0.65683654901169775,0.32169315544673388,81.571674845260247,0.13120766691066107,281.567365053206,0.45289982235739518,246.42487732109637,0,0.27387569365166364,9.9999999975119991E-7,9.9999999999999995E-7,1.7944599633000766,0.16889202105698731,0.16889202105698731,0,-9.9999999999999995E-7,6.7556808422794927E-3,0.11146873389761162,0,5.2500000000000008E-4,81.571674845260247,281.567365053206,246.42487732109637]
[null,null,null,null,null,null,null,null,null,null,null,"Beton",null,"Bøjlearmering",null,null,null,null,null,null,null,null,null,null,null,null,null,null,null,null,null,null,null,null,null,null,null,null,null,null,null,null,null,null,null,"Akt. arm",{"$f":"CEILING((N12^2*P12+N13^2*P13)*PI()/4,1)","v":1609},"mm2",null,"20 MPa < f_ck < 50 MPa; ",null,null,null,null,null,null,{"$f":"IF(OR(M21<20,M21>50),1,0)","v":0},{"$f":"IF(BE20=1,AX20,\"\")","v":""}," ",null,null,0.18040573980417693,6.1250000000000009E-4,0.11873399984841559,-8.0833245080936811E-2,6.8450446193417349,4.484370852885462,0.65512660651096077,0.3704656015634839,95.339001656384383,0.15335234928859254,325.65647266965772,0.52381695085207658,284.9149751542343,0,0.31653613350757925,9.9999999980671106E-7,9.9999999999999995E-7,2.0535133858025203,0.19704069123315188,0.19704069123315188,0,-9.9999999999999995E-7,7.8816276493260742E-3,0.13004685621388021,0,6.1250000000000009E-4,95.339001656384383,325.65647266965772,284.9149751542343]
[null,"Lastparametre:","gk [kN/m]","qk [kN/m]","e [mm]","x1 [m]","x2 [m]","ϒg","ϒq","ψ1","ψ2","fck",35,null,"fyk ",410,null,null,null,null,null,null,null,null,null,null,null,null,null,null,null,null,null,null,null,null,null,null,null,null,null,null,null,null,null,"M_L",{"$f":"MAX(Kold2!P31:BG31)","v":0},"kNm","Langtid","x_2 skal være større end x_1; ",null,null,null,null,null,null,{"$f":"IF(OR(Kold2!D91>Kold2!D92,Kold2!E91>Kold2!E92,Kold2!F91>Kold2!F92),1,0)","v":0},""," ",null,null,0.18154696851029131,7.000000000000001E-4,0.13569599982676067,-9.2380851521070645E-2,7.6728812644467776,5.0134099784116755,0.65339340016141212,0.41789649998991696,109.15398783052359,0.17557369153454214,368.95920079636119,0.59346919152445943,322.69018254214654,0,0.35837077374102716,9.9999999969568876E-7,9.9999999999999995E-7,2.3018643793340332,0.22518936140931642,0.22518936140931642,0,-9.9999999999999995E-7,9.0075744563726575E-3,0.1486249785301488,0,7.000000000000001E-4,109.15398783052359,368.95920079636119,322.69018254214654]
[null,"p1",5,0,25,{"$f":"0","v":0},{"$f":"M8","v":5},1.1000000000000001,0,0,0,"fcd",{"$f":"M21/M18","v":25},null,"fyd ",{"$f":"P21/M19","v":341.66666666666669},null,null,null,null,null,null,null,null,null,null,null,null,null,null,null,null,null,null,null,null,null,null,null,null,null,null,null,null,null,"M_k",{"$f":"MAX(Kold2!P32:BG32)","v":0},"kNm","Kar.","x_2 skal være mindre end L; ",null,null,null,null,null,null,{"$f":"IF(OR(Kold2!D92>M8,Kold2!E92>M8,Kold2!F92>M8),1,0)","v":0},""," ",null,null,0.18269405690748156,7.8750000000000011E-4,0.15265799980510578,-0.10392845796120447,8.4658895349523995,5.5166765918941536,0.65163578725164306,0.46400031134131381,123.01611964482024,0.19787086732763665,411.48402586046643,0.66187017866895048,359.75820532769677,0,0.39938896432628551,9.9999999991773336E-7,9.9999999999999995E-7,2.5397668604857198,0.25333803158548096,0.25333803158548096,0,-9.9999999999999995E-7,1.0133521263419239E-2,0.16720310084641743,0,7.8750000000000011E-4,123.01611964482024,411.48402586046643,359.75820532769677]
[null,"p2",6,3,15,1,3,1.1000000000000001,1.65,0.6,0.5,"Nedbøjninger",null,"Krybetal",null,null,null,null,null,null,null,null,null,null,null,null,null,null,null,null,null,null,null,null,null,null,null,null,null,null,null,null,null,null,null,"M_d",{"$f":"MAX(Kold2!P33:BG33)","v":0},"kNm",null,"x_1 skal være mindre end L; ",null,null,null,null,null,null,{"$f":"IF(OR(Kold2!H91>M8,Kold2!I91>M8,Kold2!J91>M8),1,0)","v":0},""," ",null,null,0.16510311821287432,8.7500000000000013E-4,0.16961999978345085,-0.1154760644013383,9.2248875797446335,5.9948169940143581,0.64985258001163726,0.45691731137371627,132.60225442275046,0.21329012139210626,416.66666666666669,0.67020643276582259,416.66666666666669,0,0.40739040412533034,9.9999999991773336E-7,9.9999999999999995E-7,2.76746627392339,0.28148670176164553,-0.67020643276582259,0,-9.9999999999999995E-7,1.1259468070465821E-2,0,0,8.7500000000000013E-4,132.60225442275046,416.66666666666669,416.66666666666669]
[null,"p3",3,7,25,2,4,1.1000000000000001,1.65,0.6,0.5,"uL ",{"$f":"IF(OR(BG28=1,BG29=1,BG30=1),\"\",BO141)","v":0},null,"RH",0.55000000000000004,null,null,null,null,null,null,null,null,null,null,null,null,null,null,null,null,null,null,null,null,null,null,null,null,null,null,null,null,null,"maks V_d",{"$f":"MAX(Kold2!P56:BD56)","v":2.7500000000000001E-5},"kN",null,{"$f":"\"Trækarmering, \"&AU20&\" mm^2 opfylder ikke minimumskrav: \"&AU18&\" mm^2; \"","v":"Trækarmering, 1609 mm^2 opfylder ikke minimumskrav: 331 mm^2; "},null,null,null,null,null,null,0,{"$f":"IF(BG24=1,AX24,\"\")","v":""},{"$f":"IF(AU18>AU20,1,0)","v":0},null,null,0.14868987909589038,9.6250000000000014E-4,0.18658199976179593,-0.12702367084147212,9.9506665214579773,6.4484552325593176,0.64804254254261617,0.44386902059973316,140.71436370235895,0.2263384121660893,416.66666666666669,0.67020643276582259,416.66666666666669,0,0.41005427838228031,9.9999999991773336E-7,9.9999999999999995E-7,2.985199956437393,0.3096353719378101,-0.67020643276582259,0,-9.9999999999999995E-7,1.2385414877512404E-2,0,0,9.6250000000000014E-4,140.71436370235895,416.66666666666669,416.66666666666669]
[null,null,"Gk [kN]","Qk [kN]","e [mm]","x1 [m]",null,null,null,null,null,"ukar",{"$f":"IF(OR(BG28=1,BG29=1,BG30=1),\"\",BM141)","v":{"$error":"#DIV/0!"}},null,"to",28,null,null,null,null,null,null,null,null,null,null,null,null,null,null,null,null,null,null,null,null,null,null,null,null,null,null,null,null,null,null,null,null,null,"Grænse forskydningstrykbrud (V_ud_0) overskredet; ",null,null,null,null,null,null,0,{"$f":"IF(BG25=1,AX25,\"\")","v":""},{"$f":"IF(AU24>P30,1,0)","v":0},null,null,0.13536258454864553,1.0500000000000002E-3,0.20354399974014104,-0.13857127728160595,10.643991606304676,6.8781940767287573,0.64620438752081022,0.43223946412304698,147.94444729310504,0.23796796864277564,416.66666666666669,0.67020643276582259,416.66666666666669,0,0.41211763134291579,1.0000000000287557E-6,9.9999999999999995E-7,3.1931974818914024,0.33778404211397461,-0.67020643276582259,0,-9.9999999999999995E-7,1.3511361684558985E-2,0,0,1.0500000000000002E-3,147.94444729310504,416.66666666666669,416.66666666666669]
[null,"P1",15,0,10,1,null,1.1000000000000001,1.65,0.6,0.5,"Revnevidder",null,null,"fo",{"$f":"AU36","v":1.9881012305571},null,null,null,null,null,null,null,null,null,null,null,null,null,null,null,null,null,null,null,null,null,null,null,null,null,null,null,null,null,"Beregning af slutkrybetal",null,null,null,"Grænser 0,5 < cot0 < 2 overholdes ikke; ",null,null,null,null,null,null,0,{"$f":"IF(BG26=1,AX26,\"\")","v":""},{"$f":"IF(OR(P15<0.5,P15>2),1,0)","v":0},null,null,0.12440296416481195,1.1375000000000001E-3,0.22050599971848608,-0.15011888372173979,11.30560329414889,7.2846159398097532,0.64433677268508427,0.42193516843907525,154.3506175789822,0.24827226432674718,416.66666666666669,0.67020643276582259,416.66666666666669,0,0.41373694735822142,9.9999999980671106E-7,9.9999999999999995E-7,3.391680988244667,0.36593271229013913,-0.67020643276582259,0,-9.9999999999999995E-7,1.4637308491605565E-2,0,0,1.1375000000000001E-3,154.3506175789822,416.66666666666669,416.66666666666669]
[null,"P2",12,null,15,1.5,null,1.1000000000000001,1.65,0.6,0.5,"wk,L",{"$f":"IF(OR(BG28=1,BG29=1,BG30=1),\"\",IF(BO136=0,\"urevnet\",BT141))","v":"urevnet"},"Svindtøjning",null,null,null,null,null,null,null,null,null,null,null,null,null,null,null,null,null,null,null,null,null,null,null,null,null,null,null,null,null,null,null,"to",{"$f":"P25","v":28},null,null,"Partialkoefficienter skal være større end 1; ",null,null,null,null,null,null,{"$f":"IF(MIN(M18:M19)<1,1,0)","v":0},""," ",null,null,0.11529316012723655,1.225E-3,0.23746799969683116,-0.16166649016187359,11.936218292489684,7.6682837533684767,0.64243829707717315,0.41284929807289888,159.99929406753355,0.25735813469292362,416.66666666666669,0.67020643276582259,416.66666666666669,0,0.41502279792616781,9.9999999991773336E-7,9.9999999999999995E-7,3.5808654877469053,0.3940813824663037,-0.67020643276582259,0,-9.9999999999999995E-7,1.5763255298652148E-2,0,0,1.225E-3,159.99929406753355,416.66666666666669,416.66666666666669]
[null,"P3",17,5,20,2,null,1.1000000000000001,1.65,0.6,0.5,"wk,kar",{"$f":"IF(OR(BG28=1,BG29=1,BG30=1),\"\",IF(BM136=0,\"urevnet\",BS141))","v":{"$error":"#DIV/0!"}},null,"ecs",{"$f":"1000*BX140","v":0.4259533057195411},null,null,null,null,null,null,null,null,null,null,null,null,null,null,null,null,null,null,null,null,null,null,null,null,null,null,null,null,null,"RH",{"$f":"P24*100","v":55.000000000000007},null,null,"M_d > M_ud  !",null,null,null,null,null,null,null,{"$f":"IF(BG28=1,AX28,\"\")","v":""},{"$f":"IF(AU23>M30,1,0)","v":0},null,null,0.1076500128406246,1.3124999999999999E-3,0.25442999967517621,-0.1732140966020074,12.536530537769828,8.0297417958722299,0.64050749700488285,0.40486730201034127,164.96169300931527,0.26534013075548141,416.66666666666669,0.67020643276582259,416.66666666666669,0,0.41605487983593326,1.000000000139778E-6,9.9999999999999995E-7,3.7609591613309483,0.42223005264246816,-0.67020643276582259,0,-9.9999999999999995E-7,1.6889202105698727E-2,0,0,1.3124999999999999E-3,164.96169300931527,416.66666666666669,416.66666666666669]
[null,null,"Jævnt fordelte laste [kN/m]",null,null,"Punktlaste [kN]",null,null,"Kontrol:","Langtid","Brudstadie","Momentkapacitet",null,"Forskydningskapacitet",null,null,null,null,null,null,null,null,null,null,null,null,null,null,null,null,null,null,null,null,null,null,null,null,null,null,null,null,null,null,null,"h",{"$f":"P7","v":700},null,null,{"$f":"\"Armeringsspænding = \"&TEXT(MAX(BD10+BD11,BE10+BE11),0)&\" MPa > f_yk for kar. last ! \"","v":"Armeringsspænding = 58 MPa > f_yk for kar. last ! "},null,null,null,null,null,null,null,"",{"$f":"IF(BG28=1,0,IF(OR(BD10+BD11>P18,BE10+BE11>P18),1,0))","v":0},null,null,0.10118402090912779,1.3999999999999998E-3,0.27139199965352129,-0.18476170304214123,13.107212127149969,8.3695164786741412,0.63854284171824172,0.39787212778017472,169.31058580822167,0.2723353049856479,416.66666666666669,0.67020643276582259,416.66666666666669,0,0.4168915320975618,1.0000000000287557E-6,9.9999999999999995E-7,3.9321636381449907,0.45037872281863267,-0.67020643276582259,0,-9.9999999999999995E-7,1.8015148912745308E-2,0,0,1.3999999999999998E-3,169.31058580822167,416.66666666666669,416.66666666666669]
[null,null,"p1","p2","p3","P1","P2","P3","M (kNm)",{"$f":"INDEX(AU21:AU22,MATCH(J29,AW21:AW22,0))","v":0},{"$f":"M30","v":420.86459379933143},"MRd",{"$f":"BX56*1000","v":420.86459379933143},"v/ trykbrud i krop:","VRd,0",{"$f":"BL110","v":782.3579441300592},null,null,null,null,null,null,null,null,null,null,null,null,null,null,null,null,null,null,null,null,null,null,null,null,null,null,null,null,null,"b",{"$f":"P9","v":300},null,null,{"$f":"\"Betonkanttøjning = \"&TEXT(1000*(BB10+BB11),\"0,00\")&\" 0/00 > 0,6*e_1 for kar. last ! \"","v":"Betonkanttøjning = 0,07 0/00 > 0,6*e_1 for kar. last ! "},null,null,null,null,null,null,null,"",{"$f":"IF(BG28=1,0,IF(BB10+BB11>0.6*CF63,IF(BG28=0,1,0),0))","v":0},null,null,9.5672703226036521E-2,1.4874999999999997E-3,0.28835399963186636,-0.19630930948227504,13.648914203721615,8.6881170917761708,0.6365427287547315,0.39174855539108777,173.11760461722253,0.27845887737473474,416.66666666666669,0.67020643276582259,416.66666666666669,0,0.41757599165696391,9.9999999991773336E-7,9.9999999999999995E-7,4.0946742611164844,0.47852739299479724,-0.67020643276582259,0,-9.9999999999999995E-7,1.914109571979189E-2,0,0,1.4874999999999997E-3,173.11760461722253,416.66666666666669,416.66666666666669]
[null,"Langtidsværdi",{"$f":"Kold2!D87","v":5},{"$f":"Kold2!E87","v":7.5},{"$f":"Kold2!F87","v":6.5},{"$f":"Kold2!H87","v":15},{"$f":"Kold2!I87","v":12},{"$f":"Kold2!J87","v":19.5},"x (mm)",{"$f":"IF(OR(BG28=1,BG29=1,BG30=1),\"-\",IF(IF(J29=\"langtid\",BO136,BM136)=0,\"urevnet\",IF(J29=\"langtid\",BJ79,BJ102)*1000))","v":"urevnet"},{"$f":"BJ56*1000","v":59.901317457074761},"EIL,revnet",{"$f":"IF(OR(BG28=1,BG29=1,BG30=1),\"\",CK63)","v":84847.188068652482},"v/ type 1 bøjler:","VRd,1",{"$f":"BL111","v":144.00668067440381},null," NB:  Resultaterne skal altid kontrolleres af ansvarlig statiker",null,null,null,null,null,null,null,null,null,null,null,null,null,null,null,null,null,null,null,null,null,null,null,null,null,null,null,"ho",{"$f":"2*AU29*AU30/(2*(AU29+AU30))","v":210},null,null,null,null,null,null,null,null,null,null,null,null,null,null,9.0942697965267827E-2,1.5749999999999996E-3,0.30531599961021139,-0.20785691592240887,14.162267797880213,8.9860365119165273,0.63450547893618725,0.38638645285375767,176.45121838355729,0.28382097991206495,416.66666666666669,0.67020643276582259,416.66666666666669,0,0.41814063477509533,1.0000000000287557E-6,9.9999999999999995E-7,4.2486803393640642,0.5066760631709617,-0.67020643276582259,0,-9.9999999999999995E-7,2.0267042526838471E-2,0,0,1.5749999999999996E-3,176.45121838355729,416.66666666666669,416.66666666666669]
[null,"Kar. værdi",{"$f":"Kold2!D88","v":5},{"$f":"Kold2!E88","v":9},{"$f":"Kold2!F88","v":10},{"$f":"Kold2!H88","v":15},{"$f":"Kold2!I88","v":12},{"$f":"Kold2!J88","v":22},"e0 (o/oo)",{"$f":"IF(OR(BG28=1,BG29=1,BG30=1),\"-\",IF(IF(J29=\"langtid\",BO136,BM136)=0,\"urevnet\",1000*IF(J29=\"langtid\",BB10,BB12)))","v":"urevnet"},{"$f":"1000*BK56","v":3.0624999999999978},"EIkort,revnet",{"$f":"IF(OR(BG28=1,BG29=1,BG30=1),\"\",CK86)","v":98983.270066006531},"v/ type 2 bøjler:","VRd,2",{"$f":"BL112","v":144.00668067440381},null,null,null,null,null,null,null,null,null,null,null,null,null,null,null,null,null,null,null,null,null,null,null,null,null,null,null,null,null,"fck",{"$f":"M21","v":35},null,null,"Kar. last mindre end langtidslast ! ",null,null,null,null,null,null,null,"",{"$f":"IF(OR(Kold2!D88<Kold2!D87,Kold2!E88<Kold2!E87,Kold2!F88<Kold2!F87,Kold2!H88<Kold2!H87,Kold2!I88<Kold2!I87,Kold2!J88<Kold2!J87),1,0)","v":0},null,null,8.6857356018351123E-2,1.6624999999999995E-3,0.32227799958855646,-0.21940452236254268,14.647884627433765,9.2637518751259247,0.63242933097493181,0.38168295900022409,179.37537579212062,0.28852447376559853,416.66666666666669,0.67020643276582259,416.66666666666669,0,0.41860992390614493,1.0000000000287557E-6,9.9999999999999995E-7,4.3943653882301295,0.53482473334712621,-0.67020643276582259,0,-9.9999999999999995E-7,2.1392989333885049E-2,0,0,1.6624999999999995E-3,179.37537579212062,416.66666666666669,416.66666666666669]
[null,"Regnm. værdi",{"$f":"Kold2!D89","v":5.5},{"$f":"Kold2!E89","v":11.55},{"$f":"Kold2!F89","v":14.85},{"$f":"Kold2!H89","v":16.5},{"$f":"Kold2!I89","v":13.200000000000001},{"$f":"Kold2!J89","v":26.950000000000003},"sst (MPa)",{"$f":"IF(OR(BG28=1,BG29=1,BG30=1),\"-\",IF(IF(J29=\"langtid\",BO136,BM136)=0,\"urevnet\",IF(J29=\"langtid\",BT79,BT102)))","v":"urevnet"},{"$f":"BT56","v":416.66666666666669},"Forskydningskraftens største excentricitet, exc.:",null,null,null,{"$f":"MAX(Kold2!P61:BD61)","v":25},null,"Vejledning:",null,null,"Betonelementbyggeriers statik",null,null,null,null,null,null,null,null,null,null,null,null,null,null,null,null,null,null,null,null,null,null,null,null,"fcm",{"$f":"AU32+8","v":43},null,null,"Regnm. last mindre end kar. last ! ",null,null,null,null,null,null,null,"",{"$f":"IF(OR(Kold2!D89<Kold2!D88,Kold2!E89<Kold2!E88,Kold2!F89<Kold2!F88,Kold2!H89<Kold2!H88,Kold2!I89<Kold2!I88,Kold2!J89<Kold2!J88),1,0)","v":0},null,null,8.3307909837673333E-2,1.7499999999999994E-3,0.33923999956690154,-0.23095212880267652,15.10635785882639,9.521725215887157,0.63031243565594297,0.37754372954362103,181.94873059137834,0.2926637032222017,416.66666666666669,0.67020643276582259,416.66666666666669,0,0.41900249411839108,1.000000000139778E-6,9.9999999999999995E-7,4.531907357647917,0.56297340352329073,-0.67020643276582259,0,-9.9999999999999995E-7,2.2518936140931631E-2,0,0,1.7499999999999994E-3,181.94873059137834,416.66666666666669,416.66666666666669]
[null,null,null,null,null,null,null,null,"z (mm)","-",{"$f":"AU17","v":635.56278048584659},"Forankringskrav til hovedarmering over lejer, Na :",null,null,null,{"$f":"CF112","v":3.1025641025641024E-5},null,"Polyteknisk Forlag 2010 eller www.bef.dk",null,null,null,null,null,null,null,null,null,null,null,null,null,null,null,null,null,null,null,null,null,null,null,null,null,null,null,"a1",{"$f":"IF(AU33<35,1,(35/AU33)^0.7)","v":0.86580424765236474},null,null,"Forskydningsarmering bør vurderes nærmere !",null,null,null,null,null,null,null,"",{"$f":"IF(Kold2!I81=1,1,0)","v":0},null,null,8.020704454519588E-2,1.8374999999999993E-3,0.35620199954524662,-0.24249973524281029,15.538262831703683,9.7604040748429046,0.62815284955330697,0.37388344172922561,184.22432785231601,0.29632399103659701,416.66666666666669,0.67020643276582259,416.66666666666669,0,0.41933265170754686,1.0000000000287557E-6,9.9999999999999995E-7,4.6614788495111048,0.59112207369945535,-0.67020643276582259,0,-9.9999999999999995E-7,2.3644882947978212E-2,0,0,1.8374999999999993E-3,184.22432785231601,416.66666666666669,416.66666666666669]
[null,null,null,null,null,null,null,null,null,null,null,null,null,null,null,null,null,null,null,null,null,null,null,null,null,null,null,null,null,null,null,null,null,null,null,null,null,null,null,null,null,null,null,null,null,"a2",{"$f":"IF(AU33<35,1,(35/AU33)^0.2)","v":0.95966557859456925},null,null,"b - 2*c' skal mindst være 3*maks(d) !",null,null,null,null,null,null,{"$f":"IF(P8-2*N9<3*MAX(N11:N13),1,0)","v":0},{"$f":"IF(BE35=1,AX35,\"\")","v":""},null,null,null,7.7484130581170291E-2,1.9249999999999992E-3,0.37316399952359169,-0.25404734168294413,15.944157748906061,9.9802220768523107,0.62594852823361335,0.37062576030690458,186.24962512333565,0.29958167245891804,416.66666666666669,0.67020643276582259,416.66666666666669,0,0.41961146264239679,1.0000000000287557E-6,9.9999999999999995E-7,4.7832473246718186,0.61927074387561976,-0.67020643276582259,0,-9.9999999999999995E-7,2.4770829755024797E-2,0,0,1.9249999999999992E-3,186.24962512333565,416.66666666666669,416.66666666666669]
[null,null,null,null,null,null,null,null,null,null,null,null,null,null,null,null,null,null,null,null,null,null,null,null,null,null,null,null,null,null,null,null,null,null,null,null,null,null,null,null,null,null,null,null,null,"f",{"$f":"(1/(0.1+AU27^0.2))*(16.8/AU33^0.5)*(1+10*AU34*(1-AU28/100)/AU31^(1/3))*AU35","v":1.9881012305571},null,null,{"$f":"\"Trækarmering, \"&AU20&\" mm^2 overstiger maksimumværdi: \"&AU19&\" mm^2; \"","v":"Trækarmering, 1609 mm^2 overstiger maksimumværdi: 8400 mm^2; "},null,null,null,null,null,null,0,{"$f":"IF(BE36=1,AX36,\"\")","v":""},{"$f":"IF(AU20>AU19,1,0)","v":0},null,null,7.5081634971711705E-2,2.0124999999999991E-3,0.39012599950193672,-0.26559494812307793,16.324584333836714,10.181599481087721,0.62369731889490465,0.36770294460541547,188.0667367117677,0.3025044881604072,416.66666666666669,0.67020643276582259,416.66666666666669,0,0.4198475501707018,1.000000000139778E-6,9.9999999999999995E-7,4.8973753001510145,0.64741941405178427,-0.67020643276582259,0,-9.9999999999999995E-7,2.5896776562071372E-2,0,0,2.0124999999999991E-3,188.0667367117677,416.66666666666669,416.66666666666669]
[null,null,null,null,null,null,null,null,null,null,null,null,null,null,null,null,null,null,null,null,null,null,null,null,null,null,null,null,null,null,null,null,null,null,null,null,null,null,null,null,null,null,null,null,null,null,null,null,null,"Træklag 1 skal ligge højere end træklag 2",null,null,null,null,null,null,{"$f":"IF(AND(O12<O13,AU10>0),1,0)","v":0},{"$f":"IF(BE37=1,AX37,\"\")","v":""}," ",null,null,7.2952386594143798E-2,2.099999999999999E-3,0.40708799948028179,-0.2771425545632118,16.68006845701418,10.364943704797273,0.62139695238712789,0.36505524074786461,189.71281154291097,0.3051521920179579,416.66666666666669,0.67020643276582259,416.66666666666669,0,0.42004768369375634,9.9999999991773336E-7,9.9999999999999995E-7,5.0040205371042541,0.67556808422794878,-0.67020643276582259,0,-9.9999999999999995E-7,2.7022723369117953E-2,0,0,2.099999999999999E-3,189.71281154291097,416.66666666666669,416.66666666666669]
[null,null,null,null,null,null,null,null,null,null,null,null,null,null,null,null,null,null,null,null,null,null,null,null,null,null,null,null,null,null,null,null,null,null,null,null,null,null,null,null,null,null,null,null,null,null,null,null,null,null,null,null,null,null,null,null,null,""," ",null,null,7.1057471078710951E-2,2.1874999999999989E-3,0.42404999945862687,-0.28869016100334555,17.011120733525281,10.53064982216185,0.61904503454661819,0.3626301658616799,191.22047816597478,0.30757726690414278,416.66666666666669,0.67020643276582259,416.66666666666669,0,0.42021721643941656,1.000000000139778E-6,9.9999999999999995E-7,5.1033362200575842,0.70371675440411341,-0.67020643276582259,0,-9.9999999999999995E-7,2.8148670176164538E-2,0,0,2.1874999999999989E-3,191.22047816597478,416.66666666666669,416.66666666666669]
[null,null,null,null,null,null,null,null,null,null,null,null,null,null,null,null,null,null,null,null,null,null,null,null,null,null,null,null,null,null,null,null,null,null,null,null,null,null,null,null,null,null,null,null,null,null,null,null,null,null,null,null,null,null,null,null,null,""," ",null,null,6.9364596502162645E-2,2.2749999999999988E-3,0.44101199943697195,-0.30023776744347941,17.318237092964466,10.679101039675665,0.61663903677667342,0.36038175842467995,192.61831081317445,0.30982567434114267,416.66666666666669,0.67020643276582259,416.66666666666669,0,0.42036041278417258,1.0000000000287557E-6,9.9999999999999995E-7,5.1954711278893395,0.73186542458027792,-0.67020643276582259,0,-9.9999999999999995E-7,2.9274616983211113E-2,0,0,2.2749999999999988E-3,192.61831081317445,416.66666666666669,416.66666666666669]
[null,null,null,null,null,null,null,null,null,null,null,null,null,null,null,null,null,null,null,null,null,null,null,null,null,null,null,null,null,null,null,null,null,null,null,null,null,null,null,null,null,null,null,null,null,null,null,null,null,null,null,null,null,null,null,null,null,""," ",null,null,6.7846815137103542E-2,2.3624999999999987E-3,0.45797399941531697,-0.31178537388361321,17.601899323356175,10.81066914932409,0.6141762857931633,0.35826984283609625,193.93128661518966,0.3119375899297262,416.66666666666669,0.67020643276582259,416.66666666666669,0,0.42048069452019954,9.9999999991773336E-7,9.9999999999999995E-7,5.2805697970068524,0.76001409475644233,-0.67020643276582259,0,-9.9999999999999995E-7,3.0400563790257695E-2,0,0,2.3624999999999987E-3,193.93128661518966,416.66666666666669,416.66666666666669]
[null,null,null,null,null,null,null,null,null,null,null,null,null,null,null,null,null,null,null,null,null,null,null,null,null,null,null,null,null,null,null,null,null,null,null,null,null,null,null,null,null,null,null,null,null,null,null,null,null,null,null,null,null,null,null,null,null,""," ",null,null,6.6481517022226794E-2,2.4499999999999986E-3,0.47493599939366204,-0.32333298032374702,17.862575590461141,10.925714960791021,0.61165395244712084,0.35625933695341655,195.18121610481404,0.31394809581240607,416.66666666666669,0.67020643276582259,416.66666666666669,0,0.42058082723839629,1.0000000000287557E-6,9.9999999999999995E-7,5.3587726771383419,0.78816276493260684,-0.67020643276582259,0,-9.9999999999999995E-7,3.1526510597304276E-2,0,0,2.4499999999999986E-3,195.18121610481404,416.66666666666669,416.66666666666669]
[null,null,null,null,null,null,null,null,null,null,null,null,null,null,null,null,null,null,null,null,null,null,null,null,null,null,null,null,null,null,null,null,null,null,null,null,null,null,null,null,null,null,null,null,null,null,null,null,null,null,null,null,null,null,null,null,null,""," ",null,null,6.5249632697900253E-2,2.5374999999999985E-3,0.49189799937200712,-0.33488058676388083,18.100720933783158,11.024588713815616,0.60906903952313529,0.35431961774896353,196.38713758762253,0.31588781501685909,416.66666666666669,0.67020643276582259,416.66666666666669,0,0.4206630622229619,1.0000000000287557E-6,9.9999999999999995E-7,5.4302162801349469,0.81631143510877147,-0.67020643276582259,0,-9.9999999999999995E-7,3.2652457404350861E-2,0,0,2.5374999999999985E-3,196.38713758762253,416.66666666666669,416.66666666666669]
[null,null,null,null,null,null,null,null,null,null,null,null,null,null,null,null,null,null,null,null,null,null,null,null,null,null,null,null,null,null,null,null,null,null,null,null,null,null,null,null,null,null,null,null,null,null,null,null,null,null,null,null,null,null,null,null,null,""," ",null,null,6.4134998008261418E-2,2.6249999999999984E-3,0.5088599993503522,-0.34642819320401463,18.316777740505842,11.107630471786869,0.60641836840239549,0.35242395117153275,197.56567159642015,0.31778348159428976,416.66666666666669,0.67020643276582259,416.66666666666669,0,0.42072924511495424,9.9999999991773336E-7,9.9999999999999995E-7,5.4950333221517527,0.84446010528493598,-0.67020643276582259,0,-9.9999999999999995E-7,3.3778404211397439E-2,0,0,2.6249999999999984E-3,197.56567159642015,416.66666666666669,416.66666666666669]
[null,null,null,null,null,null,null,null,null,null,null,null,null,null,null,null,null,null,null,null,null,null,null,null,null,null,null,null,null,null,null,null,null,null,null,null,null,null,null,null,null,null,null,null,null,null,null,null,null,null,null,null,null,null,null,null,null,""," ",null,null,6.3123845256412847E-2,2.7124999999999983E-3,0.52582199932869722,-0.3579757996441485,18.51117619851696,11.175170497576728,0.60369856446356107,0.35054898656081318,198.73133521328893,0.31965844620500944,416.66666666666669,0.67020643276582259,416.66666666666669,0,0.42078089961864451,1.0000000000287557E-6,9.9999999999999995E-7,5.5533528595550878,0.87260877546110038,-0.67020643276582259,0,-9.9999999999999995E-7,3.4904351018444017E-2,0,0,2.7124999999999983E-3,198.73133521328893,416.66666666666669,416.66666666666669]
[null,null,null,null,null,null,null,null,null,null,null,null,null,null,null,null,null,null,null,null,null,null,null,null,null,null,null,null,null,null,null,null,null,null,null,null,null,null,null,null,null,null,null,null,null,null,null,null,null,null,null,null,null,null,null,null,null,""," ",null,null,6.2204393432985422E-2,2.7999999999999982E-3,0.54278399930704235,-0.36952340608428225,18.684334729616186,11.227529612531255,0.60090604107700496,0.34867431256639153,199.89681815429691,0.32153312019943114,416.66666666666669,0.67020643276582259,416.66666666666669,0,0.42081929236199733,1.000000000139778E-6,9.9999999999999995E-7,5.6053004188848554,0.90075744563726501,-0.67020643276582259,0,-9.9999999999999995E-7,3.6030297825490602E-2,0,0,2.7999999999999982E-3,199.89681815429691,416.66666666666669,416.66666666666669]
[null,null,null,null,null,null,null,null,null,null,null,null,null,null,null,null,null,null,null,null,null,null,null,null,null,null,null,null,null,null,null,null,null,null,null,null,null,null,null,null,null,null,null,null,null,null,null,null,null,"For ny bruger: Klik på knappen 'angiv nyt brugernavn' for ibrugtagning.",null,null,null,null,null,null,null,{"$f":"IF(BG46=1,AX46,\"\")","v":"For ny bruger: Klik på knappen 'angiv nyt brugernavn' for ibrugtagning."},{"$f":"Makro!E20","v":1},null,null,6.1366516546509917E-2,2.8874999999999981E-3,0.55974599928538737,-0.38107101252441611,18.83666040392098,11.2650195395314,0.59803698203246836,0.3467820697074615,201.07322364073852,0.32342536305836117,416.66666666666669,0.67020643276582259,416.66666666666669,0,0.42084548344789496,1.000000000139778E-6,9.9999999999999995E-7,5.6509981211762943,0.92890611581342941,-0.67020643276582259,0,-9.9999999999999995E-7,3.715624463253718E-2,0,0,2.8874999999999981E-3,201.07322364073852,416.66666666666669,416.66666666666669]
[null,null,null,null,null,null,null,null,null,null,null,null,null,null,null,null,null,null,null,null,null,null,null,null,null,null,null,null,null,null,null,null,null,null,null,null,null,null,null,null,null,null,null,null,null,null,null,null,null,null,null,null,null,null,null,null,null,null,null,null,null,6.0601473840195944E-2,2.974999999999998E-3,0.5767079992637324,-0.39261861896454991,18.96854933643592,11.287943230942195,0.59508732221602423,0.34485661391954631,202.27027757179948,0.32535081884627642,416.66666666666669,0.67020643276582259,416.66666666666669,0,0.42086036608062427,1.000000000139778E-6,9.9999999999999995E-7,5.6905648009307761,0.95705478598959404,-0.67020643276582259,0,-9.9999999999999995E-7,3.8282191439583758E-2,0,0,2.974999999999998E-3,202.27027757179948,416.66666666666669,416.66666666666669]
[null,null,null,null,null,null,null,null,null,null,null,null,null,null,null,null,null,null,null,null,null,null,null,null,null,null,null,null,null,null,null,null,null,null,null,null,null,null,null,null,null,null,null,null,null,null,null,null,null,null,null,null,null,null,null,null,null,null,null,null,null,5.9901689290140024E-2,3.0624999999999979E-3,0.59366999924207753,-0.40416622540468372,19.080387066694112,11.296595182225785,0.59205272632779171,0.3428842252814151,203.4965096087403,0.32732320748440746,416.66666666666669,0.67020643276582259,416.66666666666669,0,0.42086469780554669,9.9999999991773336E-7,9.9999999999999995E-7,5.7241161200082331,0.98520345616575855,-0.67020643276582259,0,-9.9999999999999995E-7,3.9408138246630343E-2,0,0,3.0624999999999979E-3,203.4965096087403,416.66666666666669,416.66666666666669]
[null,null,null,null,null,null,null,null,null,null,null,null,null,null,null,null,null,null,null,null,null,null,null,null,null,null,null,null,null,null,null,null,null,null,null,null,null,null,null,null,null,null,null,null,null,null,null,null,null,null,null,null,null,null,null,null,null,null,null,null,null,5.9260570537002233E-2,3.1499999999999979E-3,0.61063199922042255,-0.41571383184481753,19.172548922319052,11.291261731966271,0.58892856540436023,0.34085285633556428,204.75940964380089,0.32935457643025817,416.66666666666669,0.67020643276582259,416.66666666666669,0,0.42085912527487374,9.9999999991773336E-7,9.9999999999999995E-7,5.7517646766957151,1.013352126341923,-0.67020643276582259,0,-9.9999999999999995E-7,4.0534085053676921E-2,0,0,3.0624999999999979E-3,203.4965096087403,416.66666666666669,416.66666666666669]
[null,null,null,null,null,null,null,null,null,null,null,null,null,null,null,null,null,null,null,null,null,null,null,null,null,null,null,null,null,null,null,null,null,null,null,null,null,null,null,null,null,null,null,null,null,null,null,null,null,null,null,null,null,null,null,null,null,null,null,null,null,5.8672337447340392E-2,3.2374999999999978E-3,0.62759399919876768,-0.42726143828495139,19.245422783160663,11.272221418619763,0.58570921229554473,0.3387521819551006,206.06539679800923,0.33145525081072208,416.66666666666669,0.67020643276582259,416.66666666666669,0,0.42084419779130422,1.000000000139778E-6,9.9999999999999995E-7,5.7736268349481987,1.0415007965180876,-0.67020643276582259,0,-9.9999999999999995E-7,4.1660031860723507E-2,0,0,3.0624999999999979E-3,203.4965096087403,416.66666666666669,416.66666666666669]
[null,null,null,null,null,null,null,null,null,null,null,null,null,null,null,null,null,null,null,null,null,null,null,null,null,null,null,null,null,null,null,null,null,null,null,null,null,null,null,null,null,null,null,null,null,null,null,null,null,null,null,null,null,null,null,null,null,null,null,null,null,5.8131964587421057E-2,3.3249999999999977E-3,0.6445559991771127,-0.43880904472508514,19.299344021309043,11.239745054309692,0.582390004649874,0.33657263496215811,207.42041897624296,0.33363479780366428,416.66666666666669,0.67020643276582259,416.66666666666669,0,0.4208204016877608,9.9999999980671106E-7,9.9999999999999995E-7,5.7898032063927127,1.0696494666942522,-0.67020643276582259,0,-9.9999999999999995E-7,4.2785978667770085E-2,0,0,3.0624999999999979E-3,203.4965096087403,416.66666666666669,416.66666666666669]
[null,null,null,null,null,null,null,null,null,null,null,null,null,null,null,null,null,null,null,null,null,null,null,null,null,null,null,null,null,null,null,null,null,null,null,null,null,null,null,null,null,null,null,null,null,null,null,null,null,null,null,null,null,null,null,null,null,null,null,null,null,5.7635011906341772E-2,3.4124999999999976E-3,0.66151799915545773,-0.450356651165219,19.334659411243358,11.194096181734045,0.57896526355279532,0.33430599761162216,208.82958514239328,0.33590143515420007,416.66666666666669,0.67020643276582259,416.66666666666669,0,0.4207881545324938,9.9999999969568876E-7,9.9999999999999995E-7,5.8003978233730074,1.0977981368704166,-0.67020643276582259,0,-9.9999999999999995E-7,4.3911925474816663E-2,0,0,3.0624999999999979E-3,203.4965096087403,416.66666666666669,416.66666666666669]
[null,null,null,null,null,null,null,null,null,null,null,null,null,null,null,null,null,null,null,null,null,null,null,null,null,null,null,null,null,null,null,null,null,null,null,null,null,null,null,null,null,null,null,null,null,null,null,null,null,null,null,null,null,null,null,null,null,null,null,null,null,5.717756084251821E-2,3.4999999999999975E-3,0.67847999913380286,-0.46190425760535281,19.351706824338518,11.135531264102871,0.57542889447342105,0.33194501830655709,210.29740360699805,0.33826241445926541,416.66666666666669,0.67020643276582259,416.66666666666669,0,0.42074782162692592,9.9999999991773336E-7,9.9999999999999995E-7,5.8055120473015549,1.1259468070465812,-0.67020643276582259,0,-9.9999999999999995E-7,4.5037872281863248E-2,0,0,3.0624999999999979E-3,203.4965096087403,416.66666666666669,416.66666666666669]
[null,null,null,null,null,null,null,null,null,null,null,null,null,null,null,null,null,null,null,null,null,null,null,null,null,null,null,null,null,null,null,null,null,null,null,null,null,null,null,null,null,null,null,null,null,null,null,null,null,null,null,null,null,null,null,null,null,null,null,null,null,null,null,null,null,null,null,null,null,{"$f":"CJ53","v":203.4965096087403},0.32732320748440746,{"$f":"CK53","v":416.66666666666669},0.67020643276582259,{"$f":"CL53","v":416.66666666666669},0]
[null,null,null,null,null,null,null,null,null,null,null,null,null,null,null,null,null,null,null,null,null,null,null,null,null,null,null,null,null,null,null,null,null,null,null,null,null,null,null,null,null,null,null,null,null,null,null,null,null,null,null,null,null,null,null,null,null,null,null,null,null,5.9901317457074763E-2,{"$f":"CI53","v":3.0624999999999979E-3},{"$f":"IF($CH$11=1,BK55/($CG$11*$CF$11),2^(1/3)*$CF$11/BK55)","v":0.59366999924207753},{"$f":"IF($CH$11=1,-($CG$11-2)*BK55/$CF$11,3*($CF$11/BK55)^2)","v":-0.40416622540468372},{"$f":"IF(CH$11=1,0.5*(CG$11*BK55*BN$11/CF$11)*(1-CI54^2+(BL55-BM55)*(BM55^2*(1-CI54^2)+2*BM55*(1-CI54)+2*LN((1-BM55)/(1-BM55*CI54)))/(BM55^3)),BN$11*BM55*(LN((1-BL55+BL55^2)/(1+BL55)^2)/(6*BL55)+ATAN((2-BL55)/(BL55*3^0.5))/(BL55*3^0.5)-LN((CI54^2-BL55*CI54+BL55^2)/(CI54+BL55)^2)/(6*BL55)-ATAN((2*CI54-BL55)/(BL55*3^0.5))/(BL55*3^0.5)))","v":19.080732755216182},{"$f":"IF(CH$11=1,(CG$11*BK55*BN$11/CF$11)*(1-CI54^3-(BL55-BM55)*(-2*BM55^3*(1-CI54^3)-3*BM55^2*(1-CI54^2)-6*BM55*(1-CI54)-6*LN((1-BM55)/(1-BM55*CI54)))/(2*BM55^4))/3,BN$11*BM55*(LN((1+BL55^3)/(BL55^3+CI54^3)))/3)","v":11.296595867671931},{"$f":"BO55/BN55","v":0.59204203594244731},{"$f":"BN55*BJ55*BL$11","v":0.34288830902514278},{"$f":"MAX(MIN(BS$11,CC$11*BR$11*BK55*(BJ55-BQ$11)/BJ55),-BS$11)","v":203.49397074936306},0.32731912374067984,{"$f":"MIN(BW$11,CC$11*BV$11*BK55*(BK$11-BJ55-BU$11)/BJ55)","v":416.66666666666669},0.67020643276582259,{"$f":"MIN($CA$11,CC$11*$BZ$11*BK55*(BK$11-BJ55-$BY$11)/BJ55)","v":416.66666666666669},0,{"$f":"(0.5*BK$11-BJ55+BP55*BJ55)*BQ55+(0.5*BK$11-BQ$11)*BS55+(0.5*BK$11-BU$11)*BU55+(0.5*BK$11-BY$11)*BW55","v":0.42086459379933144},{"$f":"BQ55+BS55-BU55-BW55","v":1.0000000000287557E-6},{"$f":"$CI$11","v":9.9999999999999995E-7},{"$f":"BN55*BL$11","v":5.7242198265648545},{"$f":"IF(BR54<BS$11,CC$11*BK55*BP$11*BR$11,BP$11*BS$11)","v":0.98520345616575855},{"$f":"IF(BT54<BW$11,CC$11*BK55*BT$11*BV$11,-BT$11*BW$11)","v":-0.67020643276582259},{"$f":"IF(BV54<CA$11,CC$11*BK55*$BX$11*$BZ$11,-$BX$11*CA$11)","v":0},{"$f":"-BZ55","v":-9.9999999999999995E-7},{"$f":"IF(BR54<BS$11,BQ$11*CC$11*BK55*BP$11*BR$11,0)","v":3.9408138246630343E-2},{"$f":"IF(BT54<BW$11,(BK$11-BU$11)*CC$11*BK55*BT$11*BV$11,0)","v":0},{"$f":"IF(BV54<CA$11,(BK$11-$BY$11)*CC$11*BK55*$BX$11*$BZ$11,0)","v":0}]
[null,null,null,null,null,null,null,null,null,null,null,null,null,null,null,null,null,null,null,null,null,null,null,null,null,null,null,null,null,null,null,null,null,null,null,null,null,null,null,null,null,null,null,null,null,null,null,null,null,null,null,null,null,null,null,null,null,null,null,null,null,5.9901317457074763E-2,{"$f":"BK55","v":3.0624999999999979E-3},{"$f":"IF($CH$11=1,BK56/($CG$11*$CF$11),2^(1/3)*$CF$11/BK56)","v":0.59366999924207753},{"$f":"IF($CH$11=1,-($CG$11-2)*BK56/$CF$11,3*($CF$11/BK56)^2)","v":-0.40416622540468372},{"$f":"IF(CH$11=1,0.5*(CG$11*BK56*BN$11/CF$11)*(1-CI55^2+(BL56-BM56)*(BM56^2*(1-CI55^2)+2*BM56*(1-CI55)+2*LN((1-BM56)/(1-BM56*CI55)))/(BM56^3)),BN$11*BM56*(LN((1-BL56+BL56^2)/(1+BL56)^2)/(6*BL56)+ATAN((2-BL56)/(BL56*3^0.5))/(BL56*3^0.5)-LN((CI55^2-BL56*CI55+BL56^2)/(CI55+BL56)^2)/(6*BL56)-ATAN((2*CI55-BL56)/(BL56*3^0.5))/(BL56*3^0.5)))","v":19.080732755216182},{"$f":"IF(CH$11=1,(CG$11*BK56*BN$11/CF$11)*(1-CI55^3-(BL56-BM56)*(-2*BM56^3*(1-CI55^3)-3*BM56^2*(1-CI55^2)-6*BM56*(1-CI55)-6*LN((1-BM56)/(1-BM56*CI55)))/(2*BM56^4))/3,BN$11*BM56*(LN((1+BL56^3)/(BL56^3+CI55^3)))/3)","v":11.296595867671931},{"$f":"BO56/BN56","v":0.59204203594244731},{"$f":"BN56*BJ56*BL$11","v":0.34288830902514278},{"$f":"MAX(MIN(BS$11,CC$11*BR$11*BK56*(BJ56-BQ$11)/BJ56),-BS$11)","v":203.49397074936306},0.32731912374067984,{"$f":"MIN(BW$11,CC$11*BV$11*BK56*(BK$11-BJ56-BU$11)/BJ56)","v":416.66666666666669},0.67020643276582259,{"$f":"MIN($CA$11,CC$11*$BZ$11*BK56*(BK$11-BJ56-$BY$11)/BJ56)","v":416.66666666666669},0,{"$f":"(0.5*BK$11-BJ56+BP56*BJ56)*BQ56+(0.5*BK$11-BQ$11)*BS56+(0.5*BK$11-BU$11)*BU56+(0.5*BK$11-BY$11)*BW56","v":0.42086459379933144},{"$f":"BQ56+BS56-BU56-BW56","v":1.0000000000287557E-6},{"$f":"$CI$11","v":9.9999999999999995E-7},{"$f":"BN56*BL$11","v":5.7242198265648545},{"$f":"IF(BR55<BS$11,CC$11*BK56*BP$11*BR$11,BP$11*BS$11)","v":0.98520345616575855},{"$f":"IF(BT55<BW$11,CC$11*BK56*BT$11*BV$11,-BT$11*BW$11)","v":-0.67020643276582259},{"$f":"IF(BV55<CA$11,CC$11*BK56*$BX$11*$BZ$11,-$BX$11*CA$11)","v":0},{"$f":"-BZ56","v":-9.9999999999999995E-7},{"$f":"IF(BR55<BS$11,BQ$11*CC$11*BK56*BP$11*BR$11,0)","v":3.9408138246630343E-2},{"$f":"IF(BT55<BW$11,(BK$11-BU$11)*CC$11*BK56*BT$11*BV$11,0)","v":0},{"$f":"IF(BV55<CA$11,(BK$11-$BY$11)*CC$11*BK56*$BX$11*$BZ$11,0)","v":0}]
[null,null,null,null,null,null,null,null,null,null,null,null,null,null,null,null,null,null,null,null,null,null,null,null,null,null,null,null,null,null,null,null,null,null,null,null,null,null,null,null,null,null,null,null,null,null,null,null,null,null,null,null,null,null,null,null,null,null,null,null,null,"hc","e0","a'","b'","N'","tN'","t'","Nc","sac","Nac","sat","Nat","sat","Nat","Mtot","N","N","A","B1","B2'","B2","B3","C1","C2","C2'"]
[]
[]
[null,null,null,null,null,null,null,null,null,null,null,null,null,null,null,null,null,null,null,null,null,null,null,null,null,null,null,null,null,null,null,null,null,null,null,null,null,null,null,null,null,null,null,null,null,null,null,null,null,null,null,null,null,null,null,null,null,null,null,null,null,"LANGTIDSLAST"]
[null,null,null,null,null,null,null,null,null,null,null,null,null,null,null,null,null,null,null,null,null,null,null,null,null,null,null,null,null,null,null,null,null,null,null,null,null,null,null,null,null,null,null,null,null,null,null,null,null,null,null,null,null,null,null,null,null,null,null,null,null,"L","h","b","fck","fcd","Ecd","Ac","ac","Esc","fyd_c","At","at","Est","fyd_t","At","at","Est","fyd_t","Modenhed","1+f","uterm","   emax","e1","k","Tilstand:","Nf",null,"EIL"]
[null,null,null,null,null,null,null,null,null,null,null,null,null,null,null,null,null,null,null,null,null,null,null,null,null,null,null,null,null,null,null,null,null,null,null,null,null,null,null,null,null,null,null,null,null,null,null,null,null,null,null,null,null,null,null,null,null,null,null,null,null,"(m)","(m)","(m)","(Mpa)","(Mpa)","(Mpa)","(m2)","(m)","(Mpa)","(Mpa)","(m2)","(m)","(Mpa)","(Mpa)","(m2)","(m)","(Mpa)","(Mpa)","(døgn)",null,"(m)",null,null,null,null,null,null,"(kNm2)"]
[null,null,null,null,null,null,null,null,null,null,null,null,null,null,null,null,null,null,null,null,null,null,null,null,null,null,null,null,null,null,null,null,null,null,null,null,null,null,null,null,null,null,null,null,null,null,null,null,null,null,null,null,null,null,null,null,null,null,null,null,null,{"$f":"BJ11","v":5},{"$f":"BK11","v":0.7},{"$f":"BL11","v":0.3},{"$f":"BM11","v":35},{"$f":"BM63","v":35},{"$f":"22000*((BM11+8)/10)^0.3","v":34077.14619918933},{"$f":"BP11","v":1.6084954386379742E-3},{"$f":"BQ11","v":0.04},{"$f":"BR11","v":200000},{"$f":"P18","v":500},{"$f":"BT11","v":1.6084954386379742E-3},{"$f":"BU11","v":0.04},{"$f":"BV11","v":200000},{"$f":"P18","v":500},{"$f":"BX11","v":0},{"$f":"BY11","v":0.1},{"$f":"BZ11","v":200000},{"$f":"P18","v":500},{"$f":"CB11","v":0},{"$f":"1+P26","v":2.9881012305571},{"$f":"CD11","v":0},{"$f":"CE11","v":3.5000000000000001E-3},{"$f":"0.7*($M$21+8)^(0.31)/1000","v":2.246328469196467E-3},{"$f":"1.05*BO63*CF63/BN63","v":2.2964539096862753},{"$f":"CH11","v":1},0,null,{"$f":"1000*CJ80/(CC63*BK79/BJ79)","v":84847.188068652482}]
[null,null,null,null,null,null,null,null,null,null,null,null,null,null,null,null,null,null,null,null,null,null,null,null,null,null,null,null,null,null,null,null,null,null,null,null,null,null,null,null,null,null,null,null,null,null,null,null,null,null,null,null,null,null,null,null,null,null,null,null,null,"hc","e0",null,null,"N'","tN'","t'","Nc","sac","Nac","sat","Nat","sat","Nat","Mtot","N","N","A","B1","B2","B2'","B3","C1","C2",null,"e0"]
[]
[null,null,null,null,null,null,null,null,null,null,null,null,null,null,null,null,null,null,null,null,null,null,null,null,null,null,null,null,null,null,null,null,null,null,null,null,null,null,null,null,null,null,null,null,null,null,null,null,null,null,null,null,null,null,null,null,null,null,null,null,null,{"$f":"0.5*(-(CB66+CC66+CD66+CE66)+SQRT(MAX((CB66+CC66+CD66+CE66)^2+4*CA66*(CF66+CG66+CH66),0)))/CA66","v":0.22060774379062711},{"$f":"MIN(BZ66/(BK63*BL63*BO63)+0.1*CF63,CK80)","v":3.3715420493168264E-5},null,null,{"$f":"0.5*BK66*$BO$63","v":0.57446265665641949},{"$f":"0.5*2*BK66*$BO$63/3","v":0.38297510443761301},{"$f":"BO66/BN66","v":0.66666666666666674},{"$f":"BN66*BJ66*BL$63","v":3.8019273173082714E-2},{"$f":"MAX(MIN(BS$63,CC$63*BR$63*BK66*(BJ66-BQ$63)/BJ66),-BS$63)","v":16.495652413195771},{"$f":"BR66*BP$63","v":2.6533181663982889E-2},{"$f":"MIN(BW$63,CC$63*BV$63*BK66*(BK$63-BJ66-BU$63)/BJ66)","v":40.131512521866874},{"$f":"BT66*BT$63","v":6.4551354837065616E-2},{"$f":"MIN($CA$63,CC$63*$BZ$63*BK66*(BK$63-BJ66-$BY$63)/BJ66)","v":34.651464302344685},{"$f":"BV66*$BX$63","v":0},{"$f":"(0.5*BK$63-BJ66+BP66*BJ66)*BQ66+(0.5*BK$63-BQ$63)*BS66+(0.5*BK$63-BU$63)*BU66+(0.5*BK$63-BY$63)*BW66","v":3.8747169900812888E-2},{"$f":"BQ66+BS66-BU66-BW66","v":1.0999999999899979E-6},{"$f":"$CI$63+0.000001","v":9.9999999999999995E-7},{"$f":"BN66*BL$63","v":0.17233879699692584},{"$f":"IF(BR65<BS$63,CC$63*BK66*BP$63*BR$63,BP$63*BS$63)","v":3.2409603373727953E-2},{"$f":"IF(BT65<BW$63,CC$63*BK66*BT$63*BV$63,-BT$63*BW$63)","v":3.2409603373727953E-2},{"$f":"IF(BV65<CA$63,CC$63*BK66*$BX$63*$BZ$63,-$BX$63*CA$63)","v":0},{"$f":"-(BZ66+0.0000001)","v":-1.1000000000000001E-6},{"$f":"IF(BR65<BS$63,BQ$63*CC$63*BK66*BP$63*BR$63,0)","v":1.2963841349491181E-3},{"$f":"IF(BT65<BW$63,(BK$63-BU$63)*CC$63*BK66*BT$63*BV$63,0)","v":2.1390338226660449E-2},{"$f":"IF(BV65<CA$63,(BK$63-$BY$63)*CC$63*BK66*$BX$63*$BZ$63,0)","v":0}]
[null,null,null,null,null,null,null,null,null,null,null,null,null,null,null,null,null,null,null,null,null,null,null,null,null,null,null,null,null,null,null,null,null,null,null,null,null,null,null,null,null,null,null,null,null,null,null,null,null,null,null,null,null,null,null,null,null,null,null,null,null,0.22060745665676648,{"$f":"MIN(BZ66/(BK63*BL63*BO63)+0.12*CF63,1.2*CK80)","v":4.0458504591801913E-5},null,null,{"$f":"0.5*BK67*$BO$63","v":0.68935518798770334},{"$f":"0.5*2*BK67*$BO$63/3","v":0.45957012532513558},{"$f":"BO67/BN67","v":0.66666666666666674},4.5623068426534311E-2,19.79477718974529,3.1839808818560314E-2,48.15790917671918,7.7461777245094635E-2,41.581842754158103,0,4.6496635932201588E-2,{"$f":"BQ67+BS67-BU67-BW67","v":1.0999999999899979E-6},{"$f":"$CI$63+0.000001","v":9.9999999999999995E-7},0.20680655639631099,3.8891524048473541E-2,3.8891524048473541E-2,0,{"$f":"-(BZ67+0.0000001)","v":-1.1000000000000001E-6},1.5556609619389419E-3,2.5668405871992532E-2,0,{"$f":"BK67","v":4.0458504591801913E-5}]
[null,null,null,null,null,null,null,null,null,null,null,null,null,null,null,null,null,null,null,null,null,null,null,null,null,null,null,null,null,null,null,null,null,null,null,null,null,null,null,null,null,null,null,null,null,null,null,null,null,null,null,null,null,null,null,null,null,null,null,null,null,0.22060839245649072,{"$f":"IF(BX67<>BX66,BK67+(BK67-BK66)*($CJ$80-BX67)/(BX67-BX66),BK67)","v":2.449329155251885E-5},null,null,0.41733073856727693,0.27822049237818464,0.66666666666666674,2.7619999007402085E-2,11.983628888699595,1.9275612405803555E-2,29.154270684730406,4.6894511413205664E-2,25.173183629237176,0,2.8148670176259306E-2,1.0999999999761201E-6,9.9999999999999995E-7,0.12519922157018307,2.3544652652191248E-2,2.3544652652191248E-2,0,-1.1000000000000001E-6,9.4178610608764985E-4,1.5539470750446219E-2,0,2.449329155251885E-5]
[null,null,null,null,null,null,null,null,null,null,null,null,null,null,null,null,null,null,null,null,null,null,null,null,null,null,null,null,null,null,null,null,null,null,null,null,null,null,null,null,null,null,null,null,null,null,null,null,null,null,null,null,null,null,null,null,null,null,null,null,null,0.22060839245649075,{"$f":"IF(BX68<>BX67,BK68+(BK68-BK67)*($CJ$80-BX68)/(BX68-BX67),BK68)","v":2.4493291552436399E-5},null,null,0.41733073856587211,0.27822049237724805,0.66666666666666663,2.7619999007309114E-2,11.983628888659256,1.9275612405738669E-2,29.154270684632266,4.6894511413047811E-2,25.173183629152437,0,2.8148670176164552E-2,1.0999999999691812E-6,9.9999999999999995E-7,0.12519922156976163,2.3544652652111989E-2,2.3544652652111989E-2,0,-1.1000000000000001E-6,9.4178610608447965E-4,1.553947075039391E-2,0,2.4493291552436399E-5]
[null,null,null,null,null,null,null,null,null,null,null,null,null,null,null,null,null,null,null,null,null,null,null,null,null,null,null,null,null,null,null,null,null,null,null,null,null,null,null,null,null,null,null,null,null,null,null,null,null,null,null,null,null,null,null,null,null,null,null,null,null,0.22060839245649078,2.4493291552436396E-5,null,null,0.41733073856587205,0.27822049237724805,0.66666666666666674,2.7619999007309114E-2,11.983628888659252,1.9275612405738662E-2,29.154270684632252,4.6894511413047783E-2,25.17318362915243,0,2.8148670176164542E-2,1.0999999999969368E-6,9.9999999999999995E-7,0.1251992215697616,2.3544652652111985E-2,2.3544652652111985E-2,0,-1.1000000000000001E-6,9.4178610608447965E-4,1.553947075039391E-2,0,2.4493291552436396E-5]
[null,null,null,null,null,null,null,null,null,null,null,null,null,null,null,null,null,null,null,null,null,null,null,null,null,null,null,null,null,null,null,null,null,null,null,null,null,null,null,null,null,null,null,null,null,null,null,null,null,null,null,null,null,null,null,null,null,null,null,null,null,0.22060839245649075,2.4493291552436399E-5,null,null,0.41733073856587211,0.27822049237724805,0.66666666666666663,2.7619999007309114E-2,11.983628888659256,1.9275612405738669E-2,29.154270684632266,4.6894511413047811E-2,25.173183629152437,0,2.8148670176164552E-2,1.0999999999691812E-6,9.9999999999999995E-7,0.12519922156976163,2.3544652652111989E-2,2.3544652652111989E-2,0,-1.1000000000000001E-6,9.4178610608447965E-4,1.553947075039391E-2,0,2.4493291552436399E-5]
[null,null,null,null,null,null,null,null,null,null,null,null,null,null,null,null,null,null,null,null,null,null,null,null,null,null,null,null,null,null,null,null,null,null,null,null,null,null,null,null,null,null,null,null,null,null,null,null,null,null,null,null,null,null,null,null,null,null,null,null,null,0.22060839245649075,2.4493291552436399E-5,null,null,0.41733073856587211,0.27822049237724805,0.66666666666666663,2.7619999007309114E-2,11.983628888659256,1.9275612405738669E-2,29.154270684632266,4.6894511413047811E-2,25.173183629152437,0,2.8148670176164552E-2,1.0999999999691812E-6,9.9999999999999995E-7,0.12519922156976163,2.3544652652111989E-2,2.3544652652111989E-2,0,-1.1000000000000001E-6,9.4178610608447965E-4,1.553947075039391E-2,0,2.4493291552436399E-5]
[null,null,null,null,null,null,null,null,null,null,null,null,null,null,null,null,null,null,null,null,null,null,null,null,null,null,null,null,null,null,null,null,null,null,null,null,null,null,null,null,null,null,null,null,null,null,null,null,null,null,null,null,null,null,null,null,null,null,null,null,null,0.22060839245649075,2.4493291552436399E-5,null,null,0.41733073856587211,0.27822049237724805,0.66666666666666663,2.7619999007309114E-2,11.983628888659256,1.9275612405738669E-2,29.154270684632266,4.6894511413047811E-2,25.173183629152437,0,2.8148670176164552E-2,1.0999999999691812E-6,9.9999999999999995E-7,0.12519922156976163,2.3544652652111989E-2,2.3544652652111989E-2,0,-1.1000000000000001E-6,9.4178610608447965E-4,1.553947075039391E-2,0,2.4493291552436399E-5]
[null,null,null,null,null,null,null,null,null,null,null,null,null,null,null,null,null,null,null,null,null,null,null,null,null,null,null,null,null,null,null,null,null,null,null,null,null,null,null,null,null,null,null,null,null,null,null,null,null,null,null,null,null,null,null,null,null,null,null,null,null,0.22060839245649075,2.4493291552436399E-5,null,null,0.41733073856587211,0.27822049237724805,0.66666666666666663,2.7619999007309114E-2,11.983628888659256,1.9275612405738669E-2,29.154270684632266,4.6894511413047811E-2,25.173183629152437,0,2.8148670176164552E-2,1.0999999999691812E-6,9.9999999999999995E-7,0.12519922156976163,2.3544652652111989E-2,2.3544652652111989E-2,0,-1.1000000000000001E-6,9.4178610608447965E-4,1.553947075039391E-2,0,2.4493291552436399E-5]
[null,null,null,null,null,null,null,null,null,null,null,null,null,null,null,null,null,null,null,null,null,null,null,null,null,null,null,null,null,null,null,null,null,null,null,null,null,null,null,null,null,null,null,null,null,null,null,null,null,null,null,null,null,null,null,null,null,null,null,null,null,0.22060839245649075,2.4493291552436399E-5,null,null,0.41733073856587211,0.27822049237724805,0.66666666666666663,2.7619999007309114E-2,11.983628888659256,1.9275612405738669E-2,29.154270684632266,4.6894511413047811E-2,25.173183629152437,0,2.8148670176164552E-2,1.0999999999691812E-6,9.9999999999999995E-7,0.12519922156976163,2.3544652652111989E-2,2.3544652652111989E-2,0,-1.1000000000000001E-6,9.4178610608447965E-4,1.553947075039391E-2,0,2.4493291552436399E-5]
[null,null,null,null,null,null,null,null,null,null,null,null,null,null,null,null,null,null,null,null,null,null,null,null,null,null,null,null,null,null,null,null,null,null,null,null,null,null,null,null,null,null,null,null,null,null,null,null,null,null,null,null,null,null,null,null,null,null,null,null,null,0.22060839245649075,2.4493291552436399E-5,null,null,0.41733073856587211,0.27822049237724805,0.66666666666666663,2.7619999007309114E-2,11.983628888659256,1.9275612405738669E-2,29.154270684632266,4.6894511413047811E-2,25.173183629152437,0,2.8148670176164552E-2,1.0999999999691812E-6,9.9999999999999995E-7,0.12519922156976163,2.3544652652111989E-2,2.3544652652111989E-2,0,-1.1000000000000001E-6,9.4178610608447965E-4,1.553947075039391E-2,0,2.4493291552436399E-5]
[null,null,null,null,null,null,null,null,null,null,null,null,null,null,null,null,null,null,null,null,null,null,null,null,null,null,null,null,null,null,null,null,null,null,null,null,null,null,null,null,null,null,null,null,null,null,null,null,null,null,null,null,null,null,null,null,null,null,null,null,null,{"$f":"BJ76","v":0.22060839245649075},{"$f":"BK76","v":2.4493291552436399E-5},null,null,null,null,null,null,{"$f":"BR76","v":11.983628888659256},1.9275612405738669E-2,29.154270684632266,4.6894511413047811E-2,25.173183629152437,0,2.8148670176164552E-2,null,null,null,null,null,null,null,null,null,null,{"$f":"CI76","v":2.4493291552436399E-5}]
[null,null,null,null,null,null,null,null,null,null,null,null,null,null,null,null,null,null,null,null,null,null,null,null,null,null,null,null,null,null,null,null,null,null,null,null,null,null,null,null,null,null,null,null,null,null,null,null,null,null,null,null,null,null,null,null,null,null,null,null,null,0.22060839245649075,{"$f":"IF(BX77<>BX76,BK77+(BK77-BK76)*($CJ$80-BX77)/(BX77-BX76),BK77)","v":2.4493291552436399E-5},null,null,{"$f":"0.5*BK78*$BO$63","v":0.41733073856587211},{"$f":"0.5*2*BK78*$BO$63/3","v":0.27822049237724805},{"$f":"BO78/BN78","v":0.66666666666666663},{"$f":"BN78*BJ78*BL$63","v":2.7619999007309114E-2},{"$f":"MAX(MIN(BS$63,CC$63*BR$63*BK78*(BJ78-BQ$63)/BJ78),-BS$63)","v":11.983628888659256},{"$f":"BR78*BP$63","v":1.9275612405738669E-2},{"$f":"MIN(BW$63,CC$63*BV$63*BK78*(BK$63-BJ78-BU$63)/BJ78)","v":29.154270684632266},{"$f":"BT78*BT$63","v":4.6894511413047811E-2},{"$f":"MIN($CA$63,CC$63*$BZ$63*BK78*(BK$63-BJ78-$BY$63)/BJ78)","v":25.173183629152437},{"$f":"BV78*$BX$63","v":0},{"$f":"(0.5*BK$63-BJ78+BP78*BJ78)*BQ78+(0.5*BK$63-BQ$63)*BS78+(0.5*BK$63-BU$63)*BU78+(0.5*BK$63-BY$63)*BW78","v":2.8148670176164552E-2},{"$f":"BQ78+BS78-BU78-BW78","v":1.0999999999691812E-6},{"$f":"$CI$63+0.000001","v":9.9999999999999995E-7},{"$f":"BN78*BL$63","v":0.12519922156976163},{"$f":"IF(BR77<BS$63,CC$63*BK78*BP$63*BR$63,BP$63*BS$63)","v":2.3544652652111989E-2},{"$f":"IF(BT77<BW$63,CC$63*BK78*BT$63*BV$63,-BT$63*BW$63)","v":2.3544652652111989E-2},{"$f":"IF(BV77<CA$63,CC$63*BK78*$BX$63*$BZ$63,-$BX$63*CA$63)","v":0},{"$f":"-(BZ78+0.0000001)","v":-1.1000000000000001E-6},{"$f":"IF(BR77<BS$63,BQ$63*CC$63*BK78*BP$63*BR$63,0)","v":9.4178610608447965E-4},{"$f":"IF(BT77<BW$63,(BK$63-BU$63)*CC$63*BK78*BT$63*BV$63,0)","v":1.553947075039391E-2},{"$f":"IF(BV77<CA$63,(BK$63-$BY$63)*CC$63*BK78*$BX$63*$BZ$63,0)","v":0},{"$f":"CI77","v":2.4493291552436399E-5}]
[null,null,null,null,null,null,null,null,null,null,null,null,null,null,null,null,null,null,null,null,null,null,null,null,null,null,null,null,null,null,null,null,null,null,null,null,null,null,null,null,null,null,null,null,null,null,null,null,null,null,null,null,null,null,null,null,null,null,null,null,null,0.22060839245649075,{"$f":"IF(BX78<>BX77,BK78+(BK78-BK77)*($CJ$80-BX78)/(BX78-BX77),BK78)","v":2.4493291552436399E-5},null,null,{"$f":"0.5*BK79*$BO$63","v":0.41733073856587211},{"$f":"0.5*2*BK79*$BO$63/3","v":0.27822049237724805},{"$f":"BO79/BN79","v":0.66666666666666663},{"$f":"BN79*BJ79*BL$63","v":2.7619999007309114E-2},{"$f":"MAX(MIN(BS$63,CC$63*BR$63*BK79*(BJ79-BQ$63)/BJ79),-BS$63)","v":11.983628888659256},{"$f":"BR79*BP$63","v":1.9275612405738669E-2},{"$f":"MIN(BW$63,CC$63*BV$63*BK79*(BK$63-BJ79-BU$63)/BJ79)","v":29.154270684632266},{"$f":"BT79*BT$63","v":4.6894511413047811E-2},{"$f":"MIN($CA$63,CC$63*$BZ$63*BK79*(BK$63-BJ79-$BY$63)/BJ79)","v":25.173183629152437},{"$f":"BV79*$BX$63","v":0},{"$f":"(0.5*BK$63-BJ79+BP79*BJ79)*BQ79+(0.5*BK$63-BQ$63)*BS79+(0.5*BK$63-BU$63)*BU79+(0.5*BK$63-BY$63)*BW79","v":2.8148670176164552E-2},{"$f":"BQ79+BS79-BU79-BW79","v":1.0999999999691812E-6},{"$f":"$CI$63+0.000001","v":9.9999999999999995E-7},{"$f":"BN79*BL$63","v":0.12519922156976163},{"$f":"IF(BR78<BS$63,CC$63*BK79*BP$63*BR$63,BP$63*BS$63)","v":2.3544652652111989E-2},{"$f":"IF(BT78<BW$63,CC$63*BK79*BT$63*BV$63,-BT$63*BW$63)","v":2.3544652652111989E-2},{"$f":"IF(BV78<CA$63,CC$63*BK79*$BX$63*$BZ$63,-$BX$63*CA$63)","v":0},{"$f":"-(BZ79+0.0000001)","v":-1.1000000000000001E-6},{"$f":"IF(BR78<BS$63,BQ$63*CC$63*BK79*BP$63*BR$63,0)","v":9.4178610608447965E-4},{"$f":"IF(BT78<BW$63,(BK$63-BU$63)*CC$63*BK79*BT$63*BV$63,0)","v":1.553947075039391E-2},{"$f":"IF(BV78<CA$63,(BK$63-$BY$63)*CC$63*BK79*$BX$63*$BZ$63,0)","v":0},{"$f":"CI78","v":2.4493291552436399E-5}]
[null,null,null,null,null,null,null,null,null,null,null,null,null,null,null,null,null,null,null,null,null,null,null,null,null,null,null,null,null,null,null,null,null,null,null,null,null,null,null,null,null,null,null,null,null,null,null,null,null,null,null,null,null,null,null,null,null,null,null,null,null,null,null,null,null,null,null,null,null,null,null,null,null,null,null,null,null,null,null,null,null,null,null,null,null,null,"korr-M_L =",{"$f":"MAX(AU21/1000,0.05*(BT63*BS63+BX63*BW63)*BK63)","v":2.8148670176164549E-2},{"$f":"CJ80/((BL63*BK63^2/6)*BO63)","v":3.3715420493168264E-5}]
[]
[]
[null,null,null,null,null,null,null,null,null,null,null,null,null,null,null,null,null,null,null,null,null,null,null,null,null,null,null,null,null,null,null,null,null,null,null,null,null,null,null,null,null,null,null,null,null,null,null,null,null,null,null,null,null,null,null,null,null,null,null,null,null,"KORTTIDSLAST"]
[null,null,null,null,null,null,null,null,null,null,null,null,null,null,null,null,null,null,null,null,null,null,null,null,null,null,null,null,null,null,null,null,null,null,null,null,null,null,null,null,null,null,null,null,null,null,null,null,null,null,null,null,null,null,null,null,null,null,null,null,null,"L","h","b","fck","fcd","Ecd","Ac","ac","Esc","fyd_c","At","at","Est","fyd_t","At","at","Est","fyd_t","Modenhed","1+f","uterm","   emax","e1","k","Tilstand:","Nf",null,"EI_k"]
[null,null,null,null,null,null,null,null,null,null,null,null,null,null,null,null,null,null,null,null,null,null,null,null,null,null,null,null,null,null,null,null,null,null,null,null,null,null,null,null,null,null,null,null,null,null,null,null,null,null,null,null,null,null,null,null,null,null,null,null,null,"(m)","(m)","(m)","(Mpa)","(Mpa)","(Mpa)","(m2)","(m)","(Mpa)","(Mpa)","(m2)","(m)","(Mpa)","(Mpa)","(m2)","(m)","(Mpa)","(Mpa)","(døgn)",null,"(m)",null,null,null,null,null,null,"(kNm2)"]
[null,null,null,null,null,null,null,null,null,null,null,null,null,null,null,null,null,null,null,null,null,null,null,null,null,null,null,null,null,null,null,null,null,null,null,null,null,null,null,null,null,null,null,null,null,null,null,null,null,null,null,null,null,null,null,null,null,null,null,null,null,{"$f":"BJ63","v":5},{"$f":"BK63","v":0.7},{"$f":"BL63","v":0.3},{"$f":"BM63","v":35},{"$f":"BN63","v":35},{"$f":"22000*((BM11+8)/10)^0.3","v":34077.14619918933},{"$f":"BP63","v":1.6084954386379742E-3},{"$f":"BQ63","v":0.04},200000,500,1.6084954386379742E-3,0.04,200000,500,0,0.1,200000,500,{"$f":"CB63","v":0},1,{"$f":"CD63","v":0},3.5000000000000001E-3,{"$f":"0.7*($M$21+8)^(0.31)/1000","v":2.246328469196467E-3},{"$f":"1.05*BO86*CF86/BN86","v":2.2964539096862753},1,0,null,{"$f":"1000*CJ103/(CC86*BK102/BJ102)","v":98983.270066006531}]
[null,null,null,null,null,null,null,null,null,null,null,null,null,null,null,null,null,null,null,null,null,null,null,null,null,null,null,null,null,null,null,null,null,null,null,null,null,null,null,null,null,null,null,null,null,null,null,null,null,null,null,null,null,null,null,null,null,null,null,null,null,"hc","e0","a'","b'","N'","tN'","t'","Nc","sac","Nac","sat","Nat","sat","Nat","Mtot","N","N","A","B1","B2","B2'","B3","C1","C2",null,"e0"]
[]
[null,null,null,null,null,null,null,null,null,null,null,null,null,null,null,null,null,null,null,null,null,null,null,null,null,null,null,null,null,null,null,null,null,null,null,null,null,null,null,null,null,null,null,null,null,null,null,null,null,null,null,null,null,null,null,null,null,null,null,null,null,{"$f":"0.5*(-(CB89+CC89+CD89+CE89)+SQRT(MAX((CB89+CC89+CD89+CE89)^2+4*CA89*(CF89+CG89+CH89),0)))/CA89","v":0.15619164421310958},{"$f":"MIN(BZ89/(BK86*BL86*BO86)+0.1*CF86,CK103)","v":3.3715420493168264E-5},null,null,{"$f":"0.5*BK89*$BO$86","v":0.57446265665641949},{"$f":"0.5*2*BK89*$BO$86/3","v":0.38297510443761301},{"$f":"BO89/BN89","v":0.66666666666666674},{"$f":"BN89*BJ89*BL$86","v":2.6917880064659162E-2},{"$f":"MAX(MIN(BS$86,CC$86*BR$86*BK89*(BJ89-BQ$86)/BJ89),-BS$86)","v":5.0162096214219742},{"$f":"BR89*BP$86","v":8.068550295309165E-3},{"$f":"MIN(BW$86,CC$86*BV$86*BK89*(BK$86-BJ89-BU$86)/BJ89)","v":21.750344775359043},{"$f":"BT89*BT$86","v":3.4985330359968314E-2},{"$f":"MIN($CA$86,CC$86*$BZ$86*BK89*(BK$86-BJ89-$BY$86)/BJ89)","v":19.160033059541522},{"$f":"BV89*$BX$86","v":0},{"$f":"(0.5*BK$86-BJ89+BP89*BJ89)*BQ89+(0.5*BK$86-BQ$86)*BS89+(0.5*BK$86-BU$86)*BU89+(0.5*BK$86-BY$86)*BW89","v":2.136651171042326E-2},{"$f":"BQ89+BS89-BU89-BW89","v":1.1000000000108145E-6},{"$f":"$CI$86+0.000001","v":9.9999999999999995E-7},{"$f":"BN89*BL$86","v":0.17233879699692584},{"$f":"IF(BR88<BS$86,CC$86*BK89*BP$86*BR$86,BP$86*BS$86)","v":1.0846220015004486E-2},{"$f":"IF(BT88<BW$86,CC$86*BK89*BT$86*BV$86,-BT$86*BW$86)","v":1.0846220015004486E-2},{"$f":"IF(BV88<CA$86,CC$86*BK89*$BX$86*$BZ$86,-$BX$86*CA$86)","v":0},{"$f":"-(BZ89+0.0000001)","v":-1.1000000000000001E-6},{"$f":"IF(BR88<BS$86,BQ$86*CC$86*BK89*BP$86*BR$86,0)","v":4.3384880060017949E-4},{"$f":"IF(BT88<BW$86,(BK$86-BU$86)*CC$86*BK89*BT$86*BV$86,0)","v":7.1585052099029604E-3},{"$f":"IF(BV88<CA$86,(BK$86-$BY$86)*CC$86*BK89*$BX$86*$BZ$86,0)","v":0}]
[null,null,null,null,null,null,null,null,null,null,null,null,null,null,null,null,null,null,null,null,null,null,null,null,null,null,null,null,null,null,null,null,null,null,null,null,null,null,null,null,null,null,null,null,null,null,null,null,null,null,null,null,null,null,null,null,null,null,null,null,null,0.15619126507648207,{"$f":"MIN(BZ89/(BK86*BL86*BO86)+0.12*CF86,1.2*CK103)","v":4.0458504591801913E-5},null,null,{"$f":"0.5*BK90*$BO$86","v":0.68935518798770334},{"$f":"0.5*2*BK90*$BO$86/3","v":0.45957012532513558},{"$f":"BO90/BN90","v":0.66666666666666674},3.2301377669650647E-2,6.0194465155554298,9.6822522633961561E-3,26.100496727921321,4.1982529933046818E-2,22.992115123713898,0,2.5639833651296393E-2,{"$f":"BQ90+BS90-BU90-BW90","v":1.099999999983059E-6},{"$f":"$CI$86+0.000001","v":9.9999999999999995E-7},0.20680655639631099,1.3015464018005383E-2,1.3015464018005383E-2,0,{"$f":"-(BZ90+0.0000001)","v":-1.1000000000000001E-6},5.206185607202153E-4,8.5902062518835517E-3,0,{"$f":"BK90","v":4.0458504591801913E-5}]
[null,null,null,null,null,null,null,null,null,null,null,null,null,null,null,null,null,null,null,null,null,null,null,null,null,null,null,null,null,null,null,null,null,null,null,null,null,null,null,null,null,null,null,null,null,null,null,null,null,null,null,null,null,null,null,null,null,null,null,null,null,0.15619109611888063,{"$f":"IF(BX90<>BX89,BK90+(BK90-BK89)*($CJ$103-BX90)/(BX90-BX89),BK90)","v":4.4417320686395806E-5},null,null,{"$f":"0.5*BK91*$BO$86","v":0.7568077654032932},0.50453851026886209,{"$f":"BO91/BN91","v":0.66666666666666663},{"$f":"BN91*BJ91*BL$86","v":3.5461990328886306E-2},{"$f":"MAX(MIN(BS$86,CC$86*BR$86*BK91*(BJ91-BQ$86)/BJ91),-BS$86)","v":6.6084396684022018},{"$f":"BR91*BP$86","v":1.0629645063139188E-2},{"$f":"MIN(BW$86,CC$86*BV$86*BK91*(BK$86-BJ91-BU$86)/BJ91)","v":28.654439599190656},{"$f":"BT91*BT$86","v":4.6090535392025511E-2},{"$f":"MIN($CA$86,CC$86*$BZ$86*BK91*(BK$86-BJ91-$BY$86)/BJ91)","v":25.241902895875221},{"$f":"BV91*$BX$86","v":0},{"$f":"(0.5*BK$86-BJ91+BP91*BJ91)*BQ91+(0.5*BK$86-BQ$86)*BS91+(0.5*BK$86-BU$86)*BU91+(0.5*BK$86-BY$86)*BW91","v":2.814867017620263E-2},{"$f":"BQ91+BS91-BU91-BW91","v":1.099999999983059E-6},9.9999999999999995E-7,{"$f":"BN91*BL$86","v":0.22704232962098794},{"$f":"IF(BR90<BS$86,CC$86*BK91*BP$86*BR$86,BP$86*BS$86)","v":1.4289011544117557E-2},{"$f":"IF(BT90<BW$86,CC$86*BK91*BT$86*BV$86,-BT$86*BW$86)","v":1.4289011544117557E-2},{"$f":"IF(BV90<CA$86,CC$86*BK91*$BX$86*$BZ$86,-$BX$86*CA$86)","v":0},-1.1000000000000001E-6,{"$f":"IF(BR90<BS$86,BQ$86*CC$86*BK91*BP$86*BR$86,0)","v":5.7156046176470225E-4},{"$f":"IF(BT90<BW$86,(BK$86-BU$86)*CC$86*BK91*BT$86*BV$86,0)","v":9.4307476191175868E-3},{"$f":"IF(BV90<CA$86,(BK$86-$BY$86)*CC$86*BK91*$BX$86*$BZ$86,0)","v":0},4.4417320686395806E-5]
[null,null,null,null,null,null,null,null,null,null,null,null,null,null,null,null,null,null,null,null,null,null,null,null,null,null,null,null,null,null,null,null,null,null,null,null,null,null,null,null,null,null,null,null,null,null,null,null,null,null,null,null,null,null,null,null,null,null,null,null,null,0.15619109611888066,{"$f":"IF(BX91<>BX90,BK91+(BK91-BK90)*($CJ$103-BX91)/(BX91-BX90),BK91)","v":4.4417320686335714E-5},null,null,0.75680776540226935,0.50453851026817953,{"$f":"BO92/BN92","v":0.66666666666666663},3.5461990328838337E-2,6.6084396683932622,1.0629645063124809E-2,28.654439599151893,4.6090535391963158E-2,25.241902895841072,0,2.8148670176164552E-2,{"$f":"BQ92+BS92-BU92-BW92","v":1.0999999999899979E-6},9.9999999999999995E-7,0.2270423296206808,1.4289011544098227E-2,1.4289011544098227E-2,0,-1.1000000000000001E-6,5.71560461763929E-4,9.4307476191048279E-3,0,4.4417320686335714E-5]
[null,null,null,null,null,null,null,null,null,null,null,null,null,null,null,null,null,null,null,null,null,null,null,null,null,null,null,null,null,null,null,null,null,null,null,null,null,null,null,null,null,null,null,null,null,null,null,null,null,null,null,null,null,null,null,null,null,null,null,null,null,0.15619109611888063,4.4417320686335707E-5,null,null,0.75680776540226924,0.50453851026817953,0.66666666666666674,3.546199032883833E-2,6.6084396683932605,1.0629645063124806E-2,28.654439599151889,4.6090535391963151E-2,25.241902895841072,0,2.8148670176164549E-2,1.099999999983059E-6,9.9999999999999995E-7,0.22704232962068077,1.4289011544098224E-2,1.4289011544098224E-2,0,-1.1000000000000001E-6,5.71560461763929E-4,9.4307476191048262E-3,0,4.4417320686335707E-5]
[null,null,null,null,null,null,null,null,null,null,null,null,null,null,null,null,null,null,null,null,null,null,null,null,null,null,null,null,null,null,null,null,null,null,null,null,null,null,null,null,null,null,null,null,null,null,null,null,null,null,null,null,null,null,null,null,null,null,null,null,null,0.15619109611888063,4.4417320686335707E-5,null,null,0.75680776540226924,0.50453851026817953,0.66666666666666674,3.546199032883833E-2,6.6084396683932605,1.0629645063124806E-2,28.654439599151889,4.6090535391963151E-2,25.241902895841072,0,2.8148670176164549E-2,1.099999999983059E-6,9.9999999999999995E-7,0.22704232962068077,1.4289011544098224E-2,1.4289011544098224E-2,0,-1.1000000000000001E-6,5.71560461763929E-4,9.4307476191048262E-3,0,4.4417320686335707E-5]
[null,null,null,null,null,null,null,null,null,null,null,null,null,null,null,null,null,null,null,null,null,null,null,null,null,null,null,null,null,null,null,null,null,null,null,null,null,null,null,null,null,null,null,null,null,null,null,null,null,null,null,null,null,null,null,null,null,null,null,null,null,0.15619109611888063,4.4417320686335707E-5,null,null,0.75680776540226924,0.50453851026817953,0.66666666666666674,3.546199032883833E-2,6.6084396683932605,1.0629645063124806E-2,28.654439599151889,4.6090535391963151E-2,25.241902895841072,0,2.8148670176164549E-2,1.099999999983059E-6,9.9999999999999995E-7,0.22704232962068077,1.4289011544098224E-2,1.4289011544098224E-2,0,-1.1000000000000001E-6,5.71560461763929E-4,9.4307476191048262E-3,0,4.4417320686335707E-5]
[null,null,null,null,null,null,null,null,null,null,null,null,null,null,null,null,null,null,null,null,null,null,null,null,null,null,null,null,null,null,null,null,null,null,null,null,null,null,null,null,null,null,null,null,null,null,null,null,null,null,null,null,null,null,null,null,null,null,null,null,null,0.15619109611888063,4.4417320686335707E-5,null,null,{"$f":"0.5*BK96*$BO$86","v":0.75680776540226924},0.50453851026817953,0.66666666666666674,3.546199032883833E-2,6.6084396683932605,1.0629645063124806E-2,28.654439599151889,4.6090535391963151E-2,25.241902895841072,0,2.8148670176164549E-2,1.099999999983059E-6,9.9999999999999995E-7,0.22704232962068077,1.4289011544098224E-2,1.4289011544098224E-2,0,-1.1000000000000001E-6,5.71560461763929E-4,9.4307476191048262E-3,0,4.4417320686335707E-5]
[null,null,null,null,null,null,null,null,null,null,null,null,null,null,null,null,null,null,null,null,null,null,null,null,null,null,null,null,null,null,null,null,null,null,null,null,null,null,null,null,null,null,null,null,null,null,null,null,null,null,null,null,null,null,null,null,null,null,null,null,null,0.15619109611888063,4.4417320686335707E-5,null,null,0.75680776540226924,0.50453851026817953,0.66666666666666674,3.546199032883833E-2,6.6084396683932605,1.0629645063124806E-2,28.654439599151889,4.6090535391963151E-2,25.241902895841072,0,2.8148670176164549E-2,1.099999999983059E-6,9.9999999999999995E-7,0.22704232962068077,1.4289011544098224E-2,1.4289011544098224E-2,0,-1.1000000000000001E-6,5.71560461763929E-4,9.4307476191048262E-3,0,4.4417320686335707E-5]
[null,null,null,null,null,null,null,null,null,null,null,null,null,null,null,null,null,null,null,null,null,null,null,null,null,null,null,null,null,null,null,null,null,null,null,null,null,null,null,null,null,null,null,null,null,null,null,null,null,null,null,null,null,null,null,null,null,null,null,null,null,0.15619109611888063,4.4417320686335707E-5,null,null,0.75680776540226924,0.50453851026817953,0.66666666666666674,3.546199032883833E-2,6.6084396683932605,1.0629645063124806E-2,28.654439599151889,4.6090535391963151E-2,25.241902895841072,0,2.8148670176164549E-2,1.099999999983059E-6,9.9999999999999995E-7,0.22704232962068077,1.4289011544098224E-2,1.4289011544098224E-2,0,-1.1000000000000001E-6,5.71560461763929E-4,9.4307476191048262E-3,0,4.4417320686335707E-5]
[null,null,null,null,null,null,null,null,null,null,null,null,null,null,null,null,null,null,null,null,null,null,null,null,null,null,null,null,null,null,null,null,null,null,null,null,null,null,null,null,null,null,null,null,null,null,null,null,null,null,null,null,null,null,null,null,null,null,null,null,null,0.15619109611888063,4.4417320686335707E-5,null,null,0.75680776540226924,0.50453851026817953,0.66666666666666674,3.546199032883833E-2,6.6084396683932605,1.0629645063124806E-2,28.654439599151889,4.6090535391963151E-2,25.241902895841072,0,2.8148670176164549E-2,1.099999999983059E-6,9.9999999999999995E-7,0.22704232962068077,1.4289011544098224E-2,1.4289011544098224E-2,0,-1.1000000000000001E-6,5.71560461763929E-4,9.4307476191048262E-3,0,4.4417320686335707E-5]
[null,null,null,null,null,null,null,null,null,null,null,null,null,null,null,null,null,null,null,null,null,null,null,null,null,null,null,null,null,null,null,null,null,null,null,null,null,null,null,null,null,null,null,null,null,null,null,null,null,null,null,null,null,null,null,null,null,null,null,null,null,{"$f":"BJ99","v":0.15619109611888063},{"$f":"BK99","v":4.4417320686335707E-5},null,null,null,null,null,null,{"$f":"BR99","v":6.6084396683932605},1.0629645063124806E-2,28.654439599151889,4.6090535391963151E-2,25.241902895841072,0,2.8148670176164549E-2,null,null,null,null,null,null,null,null,null,null,{"$f":"CI99","v":4.4417320686335707E-5}]
[null,null,null,null,null,null,null,null,null,null,null,null,null,null,null,null,null,null,null,null,null,null,null,null,null,null,null,null,null,null,null,null,null,null,null,null,null,null,null,null,null,null,null,null,null,null,null,null,null,null,null,null,null,null,null,null,null,null,null,null,null,{"$f":"0.5*(-(CB101+CC101+CD101+CE101)+SQRT(MAX((CB101+CC101+CD101+CE101)^2+4*CA101*(CF101+CG101+CH101),0)))/CA101","v":0.15619109611888063},{"$f":"IF(BX100<>BX99,BK100+(BK100-BK99)*($CJ$103-BX100)/(BX100-BX99),BK100)","v":4.4417320686335707E-5},null,null,{"$f":"0.5*BK101*$BO$86","v":0.75680776540226924},{"$f":"0.5*2*BK101*$BO$86/3","v":0.50453851026817953},{"$f":"BO101/BN101","v":0.66666666666666674},{"$f":"BN101*BJ101*BL$86","v":3.546199032883833E-2},{"$f":"MAX(MIN(BS$86,CC$86*BR$86*BK101*(BJ101-BQ$86)/BJ101),-BS$86)","v":6.6084396683932605},{"$f":"BR101*BP$86","v":1.0629645063124806E-2},{"$f":"MIN(BW$86,CC$86*BV$86*BK101*(BK$86-BJ101-BU$86)/BJ101)","v":28.654439599151889},{"$f":"BT101*BT$86","v":4.6090535391963151E-2},{"$f":"MIN($CA$86,CC$86*$BZ$86*BK101*(BK$86-BJ101-$BY$86)/BJ101)","v":25.241902895841072},{"$f":"BV101*$BX$86","v":0},{"$f":"(0.5*BK$86-BJ101+BP101*BJ101)*BQ101+(0.5*BK$86-BQ$86)*BS101+(0.5*BK$86-BU$86)*BU101+(0.5*BK$86-BY$86)*BW101","v":2.8148670176164549E-2},{"$f":"BQ101+BS101-BU101-BW101","v":1.099999999983059E-6},{"$f":"$CI$86+0.000001","v":9.9999999999999995E-7},{"$f":"BN101*BL$86","v":0.22704232962068077},{"$f":"IF(BR100<BS$86,CC$86*BK101*BP$86*BR$86,BP$86*BS$86)","v":1.4289011544098224E-2},{"$f":"IF(BT100<BW$86,CC$86*BK101*BT$86*BV$86,-BT$86*BW$86)","v":1.4289011544098224E-2},{"$f":"IF(BV100<CA$86,CC$86*BK101*$BX$86*$BZ$86,-$BX$86*CA$86)","v":0},{"$f":"-(BZ101+0.0000001)","v":-1.1000000000000001E-6},{"$f":"IF(BR100<BS$86,BQ$86*CC$86*BK101*BP$86*BR$86,0)","v":5.71560461763929E-4},{"$f":"IF(BT100<BW$86,(BK$86-BU$86)*CC$86*BK101*BT$86*BV$86,0)","v":9.4307476191048262E-3},{"$f":"IF(BV100<CA$86,(BK$86-$BY$86)*CC$86*BK101*$BX$86*$BZ$86,0)","v":0},{"$f":"CI100","v":4.4417320686335707E-5}]
[null,null,null,null,null,null,null,null,null,null,null,null,null,null,null,null,null,null,null,null,null,null,null,null,null,null,null,null,null,null,null,null,null,null,null,null,null,null,null,null,null,null,null,null,null,null,null,null,null,null,null,null,null,null,null,null,null,null,null,null,null,{"$f":"0.5*(-(CB102+CC102+CD102+CE102)+SQRT(MAX((CB102+CC102+CD102+CE102)^2+4*CA102*(CF102+CG102+CH102),0)))/CA102","v":0.15619109611888063},{"$f":"IF(BX101<>BX100,BK101+(BK101-BK100)*($CJ$103-BX101)/(BX101-BX100),BK101)","v":4.4417320686335707E-5},null,null,{"$f":"0.5*BK102*$BO$86","v":0.75680776540226924},{"$f":"0.5*2*BK102*$BO$86/3","v":0.50453851026817953},{"$f":"BO102/BN102","v":0.66666666666666674},{"$f":"BN102*BJ102*BL$86","v":3.546199032883833E-2},{"$f":"MAX(MIN(BS$86,CC$86*BR$86*BK102*(BJ102-BQ$86)/BJ102),-BS$86)","v":6.6084396683932605},{"$f":"BR102*BP$86","v":1.0629645063124806E-2},{"$f":"MIN(BW$86,CC$86*BV$86*BK102*(BK$86-BJ102-BU$86)/BJ102)","v":28.654439599151889},{"$f":"BT102*BT$86","v":4.6090535391963151E-2},{"$f":"MIN($CA$86,CC$86*$BZ$86*BK102*(BK$86-BJ102-$BY$86)/BJ102)","v":25.241902895841072},{"$f":"BV102*$BX$86","v":0},{"$f":"(0.5*BK$86-BJ102+BP102*BJ102)*BQ102+(0.5*BK$86-BQ$86)*BS102+(0.5*BK$86-BU$86)*BU102+(0.5*BK$86-BY$86)*BW102","v":2.8148670176164549E-2},{"$f":"BQ102+BS102-BU102-BW102","v":1.099999999983059E-6},{"$f":"$CI$86+0.000001","v":9.9999999999999995E-7},{"$f":"BN102*BL$86","v":0.22704232962068077},{"$f":"IF(BR101<BS$86,CC$86*BK102*BP$86*BR$86,BP$86*BS$86)","v":1.4289011544098224E-2},{"$f":"IF(BT101<BW$86,CC$86*BK102*BT$86*BV$86,-BT$86*BW$86)","v":1.4289011544098224E-2},{"$f":"IF(BV101<CA$86,CC$86*BK102*$BX$86*$BZ$86,-$BX$86*CA$86)","v":0},{"$f":"-(BZ102+0.0000001)","v":-1.1000000000000001E-6},{"$f":"IF(BR101<BS$86,BQ$86*CC$86*BK102*BP$86*BR$86,0)","v":5.71560461763929E-4},{"$f":"IF(BT101<BW$86,(BK$86-BU$86)*CC$86*BK102*BT$86*BV$86,0)","v":9.4307476191048262E-3},{"$f":"IF(BV101<CA$86,(BK$86-$BY$86)*CC$86*BK102*$BX$86*$BZ$86,0)","v":0},{"$f":"CI101","v":4.4417320686335707E-5}]
[null,null,null,null,null,null,null,null,null,null,null,null,null,null,null,null,null,null,null,null,null,null,null,null,null,null,null,null,null,null,null,null,null,null,null,null,null,null,null,null,null,null,null,null,null,null,null,null,null,null,null,null,null,null,null,null,null,null,null,null,null,null,null,null,null,null,null,null,null,null,null,null,null,null,null,null,null,null,null,null,null,null,null,null,null,null,"korr-M_kort =",{"$f":"MAX((AU22-AU21)/1000,0.05*(BT86*BS86+BX86*BW86)*BK86)","v":2.8148670176164549E-2},{"$f":"CJ103/((BL86*BK86^2/6)*BO86)","v":3.3715420493168264E-5}]
[]
[]
[]
[null,null,null,null,null,null,null,null,null,null,null,null,null,null,null,null,null,null,null,null,null,null,null,null,null,null,null,null,null,null,null,null,null,null,null,null,null,null,null,null,null,null,null,null,null,null,null,null,null,null,null,null,null,null,null,null,null,null,null,null,null,"FORSKYDNING"]
[]
[null,null,null,null,null,null,null,null,null,null,null,null,null,null,null,null,null,null,null,null,null,null,null,null,null,null,null,null,null,null,null,null,null,null,null,null,null,null,null,null,null,null,null,null,null,null,null,null,null,null,null,null,null,null,null,null,null,null,null,null,null,null,null,"V","v","f_cd","b","h","h_int","c","b","cot0","w","a","d","A","f_yd"]
[null,null,null,null,null,null,null,null,null,null,null,null,null,null,null,null,null,null,null,null,null,null,null,null,null,null,null,null,null,null,null,null,null,null,null,null,null,null,null,null,null,null,null,null,null,null,null,null,null,null,null,null,null,null,null,null,null,null,null,null,null," Betontrykbrud",null,{"$f":"1000*(BM110*BN110*BT110)/((1+BT110^2)*(1/(BO110*BQ110)+BU110/((1.4*BS110)*(BO110-BS110*BO110)*(BP110-BS110*BO110))))","v":782.3579441300592},{"$f":"0.7-$M$21/200","v":0.52499999999999991},{"$f":"$M$22","v":25},{"$f":"$P$9/1000","v":0.3},{"$f":"$P$7/1000","v":0.7},{"$f":"$K$34/1000","v":0.63556278048584658},{"$f":"$O$13/1000","v":0.04},{"$f":"MIN(BP110/(2*(BO110+BP110)),0.5)","v":0.35},{"$f":"$P$15","v":2},{"$f":"$P$33/$P$9","v":8.3333333333333329E-2}]
[null,null,null,null,null,null,null,null,null,null,null,null,null,null,null,null,null,null,null,null,null,null,null,null,null,null,null,null,null,null,null,null,null,null,null,null,null,null,null,null,null,null,null,null,null,null,null,null,null,null,null,null,null,null,null,null,null,null,null,null,null," Bøjler, type 1",null,{"$f":"MIN($BL$110,1000*BX111*BY111*BT111/(BV111*(1/BQ111+BU111*BO111/((BO111-BS111*BO111)*(BP111-BS111*BO111)))))","v":144.00668067440381},null,null,{"$f":"$P$9/1000","v":0.3},{"$f":"$P$7/1000","v":0.7},{"$f":"$K$34/1000","v":0.63556278048584658},{"$f":"$O$13/1000","v":0.04},{"$f":"MIN(BP111/(2*(BO111+BP111)),0.5)","v":0.35},{"$f":"$P$15","v":2},{"$f":"$P$33/$P$9","v":8.3333333333333329E-2},{"$f":"$O$15/1000","v":0.15},{"$f":"N15","v":6},{"$f":"2*PI()*(BW111/1000)^2/4","v":5.6548667764616275E-5},{"$f":"P22","v":341.66666666666669}]
[null,null,null,null,null,null,null,null,null,null,null,null,null,null,null,null,null,null,null,null,null,null,null,null,null,null,null,null,null,null,null,null,null,null,null,null,null,null,null,null,null,null,null,null,null,null,null,null,null,null,null,null,null,null,null,null,null,null,null,null,null," Bøjler, type 2",null,{"$f":"MIN($BL$110,1000*BX112*BY112*BT112/(BV112*(1/BQ112+BU112*BO112/((BO112-BS112*BO112)*(BP112-BS112*BO112)))))","v":144.00668067440381},null,null,{"$f":"$P$9/1000","v":0.3},{"$f":"$P$7/1000","v":0.7},{"$f":"$K$34/1000","v":0.63556278048584658},{"$f":"$O$13/1000","v":0.04},0.35,{"$f":"$P$15","v":2},{"$f":"$P$33/$P$9","v":8.3333333333333329E-2},{"$f":"$O$16/1000","v":0.15},{"$f":"N16","v":6},{"$f":"2*PI()*(BW112/1000)^2/4","v":5.6548667764616275E-5},{"$f":"P22","v":341.66666666666669},null,null,null,null,"Vederlagsforankring:",null,{"$f":"0.5*BU110*BO110*$AU$24*BT110/(MIN(BP110,BO110)*(1-BS110))+0.5*$AU$24*BT110","v":3.1025641025641024E-5},"KN"]
[]
[]
[null,null,null,null,null,null,null,null,null,null,null,null,null,null,null,null,null,null,null,null,null,null,null,null,null,null,null,null,null,null,null,null,null,null,null,null,null,null,null,null,null,null,null,null,null,null,null,null,null,null,null,null,null,"<"]
[]
[null,null,null,null,null,null,null,null,null,null,null,null,null,null,null,null,null,null,null,null,null,null,null,null,null,null,null,null,null,null,null,null,null,null,null,null,null,null,null,null,null,null,null,null,null,null,null,null,null,null,null,null,null,null,null,null,null,null,null,null,null,"ANVENDELSESSTADIE  - HENSYN TIL KRYBNING, TENSION STIFFENING, SVIND MV:"]
[null,null,null,null,null,null,null,null,null,null,null,null,null,null,null,null,null,null,null,null,null,null,null,null,null,null,null,null,null,null,null,null,null,null,null,null,null,null,null,null,null,null,null,null,null,null,null,null,null,null,null,null,null,null,null,null,null,null,null,null,null,"L","h","b","fck","fcd","Ecd = Ecm","Ac","ac","Esc","fyd_c","At","at","Est","fyd_t","At","at","Est","fyd_t","Modenhed","1+f",null,"RH","feff = fctm","EI_k"]
[null,null,null,null,null,null,null,null,null,null,null,null,null,null,null,null,null,null,null,null,null,null,null,null,null,null,null,null,null,null,null,null,null,null,null,null,null,null,null,null,null,null,null,null,null,null,null,null,null,null,null,null,null,null,null,null,null,null,null,null,null,"(m)","(m)","(m)","(Mpa)","(Mpa)","(Mpa)","(m2)","(m)","(Mpa)","(Mpa)","(m2)","(m)","(Mpa)","(Mpa)","(m2)","(m)","(Mpa)","(Mpa)","(døgn)",null,null,null,"(Mpa)","(kNm2)"]
[null,null,null,null,null,null,null,null,null,null,null,null,null,null,null,null,null,null,null,null,null,null,null,null,null,null,null,null,null,null,null,null,null,null,null,null,null,null,null,null,null,null,null,null,null,null,null,null,null,null,null,null,null,null,null,null,null,null,null,null,null,{"$f":"BJ63","v":5},{"$f":"BK63","v":0.7},{"$f":"BL63","v":0.3},{"$f":"BM63","v":35},{"$f":"BN63","v":35},{"$f":"22000*((BM120+8)/10)^0.3","v":34077.14619918933},{"$f":"BP63","v":1.6084954386379742E-3},{"$f":"BQ63","v":0.04},200000,500,1.6084954386379742E-3,0.04,"-",500,0,0.1,"-",500,0,2.9881012305571,null,{"$f":"P24","v":0.55000000000000004},{"$f":"0.3*BM120^(2/3)","v":3.2099624416952368},5565.9999455214083]
[null,null,null,null,null,null,null,null,null,null,null,null,null,null,null,null,null,null,null,null,null,null,null,null,null,null,null,null,null,null,null,null,null,null,null,null,null,null,null,null,null,null,null,null,null,null,null,null,null,null,null,null,null,null,null,null,null,null,null,null,null,"Nedbøjninger",null,"Urevnet","Revnet, korttid","Urevnet","Revnet, langtid",null,"Revnevidder",null,"Korttid","Langtid",null,"Udtørringssvind"]
[null,null,null,null,null,null,null,null,null,null,null,null,null,null,null,null,null,null,null,null,null,null,null,null,null,null,null,null,null,null,null,null,null,null,null,null,null,null,null,null,null,null,null,null,null,null,null,null,null,null,null,null,null,null,null,null,null,null,null,null,null,"(1+ f)",null,1,1,{"$f":"CC120","v":2.9881012305571},{"$f":"CC120","v":2.9881012305571},null,"(1+ f)",null,1,{"$f":"CC120","v":2.9881012305571},null,null,"CEM-klasse:","N"]
[null,null,null,null,null,null,null,null,null,null,null,null,null,null,null,null,null,null,null,null,null,null,null,null,null,null,null,null,null,null,null,null,null,null,null,null,null,null,null,null,null,null,null,null,null,null,null,null,null,null,null,null,null,"<",null,null,null,null,null,null,null,"aeff","-",{"$f":"BR120/BO120","v":5.8690360639635326},{"$f":"BR120/BO120","v":5.8690360639635326},{"$f":"BN122*BR120/BO120","v":17.537273884913429},{"$f":"BO122*BR120/BO120","v":17.537273884913429},null,"aeff",null,{"$f":"BR120/BO120","v":5.8690360639635326},{"$f":"BT122*BR120/BO120","v":17.537273884913429},null,null,"fcmo",10,"MPa"]
[null,null,null,null,null,null,null,null,null,null,null,null,null,null,null,null,null,null,null,null,null,null,null,null,null,null,null,null,null,null,null,null,null,null,null,null,null,null,null,null,null,null,null,null,null,null,null,null,null,null,null,null,null,null,null,null,null,null,null,null,null,"hc","(m)","-",{"$f":"BJ102","v":0.15619109611888063},"-",{"$f":"BJ79","v":0.22060839245649075},null,"kt",null,0.6,0.4,null,null,"fcm",{"$f":"BM120+8","v":43},"MPa"]
[null,null,null,null,null,null,null,null,null,null,null,null,null,null,null,null,null,null,null,null,null,null,null,null,null,null,null,null,null,null,null,null,null,null,null,null,null,null,null,null,null,null,null,null,null,null,null,null,null,null,null,null,null,null,null,null,null,null,null,null,null,"Atr","(m2)",{"$f":"BK120*BL120+BL123*BP120+BL123*BT120+BL123*BX120","v":0.22888063547617424},{"$f":"BM124*BL120+BM123*BP120+BM123*BT120+BM123*BX120","v":6.5737964311838412E-2},{"$f":"BK120*BL120+BN123*BP120+BN123*BT120+BN123*BX120","v":0.26641725010005624},{"$f":"BO124*BL120+BO123*BP120+BO123*BT120+BO123*BX120","v":0.12259976783700344},null,"x1",null,0,0,null,null,"ads1",4]
[null,null,null,null,null,null,null,null,null,null,null,null,null,null,null,null,null,null,null,null,null,null,null,null,null,null,null,null,null,null,null,null,null,null,null,null,null,null,null,null,null,null,null,null,null,null,null,null,null,null,null,null,null,null,null,null,null,null,null,null,null,"Sy","(m3)",{"$f":"BL123*(0.5*BK120-BQ120)*BP120-BL123*(0.5*BK120-BU120)*BT120-BL123*(0.5*BK120-BY120)*BX120","v":0},{"$f":"BM124*BL120*(0.5*BK120-0.5*BM124)+BM123*(0.5*BK120-BQ120)*BP120-BM123*(0.5*BK120-BU120)*BT120-BM123*(0.5*BK120-BY120)*BX120","v":1.2740716316459854E-2},{"$f":"BN123*(0.5*BK120-BQ120)*BP120-BN123*(0.5*BK120-BU120)*BT120-BN123*(0.5*BK120-BY120)*BX120","v":0},{"$f":"BO124*BL120*(0.5*BK120-0.5*BO124)+BO123*(0.5*BK120-BQ120)*BP120-BO123*(0.5*BK120-BU120)*BT120-BO123*(0.5*BK120-BY120)*BX120","v":1.5863671784595967E-2},null,"As",null,{"$f":"BT120+BX120","v":1.6084954386379742E-3},{"$f":"BT120+BX120","v":1.6084954386379742E-3},null,null,"ads2",0.12]
[null,null,null,null,null,null,null,null,null,null,null,null,null,null,null,null,null,null,null,null,null,null,null,null,null,null,null,null,null,null,null,null,null,null,null,null,null,null,null,null,null,null,null,null,null,null,null,null,null,null,null,null,null,null,null,null,null,null,null,null,null,"Iy","(m4)",{"$f":"BL120*BK120^3/12+BL123*(0.5*BK120-BQ120)^2*BP120+BL123*(0.5*BK120-BU120)^2*BT120+BL123*(0.5*BK120-BY120)^2*BX120","v":1.0389429069260341E-2},{"$f":"BL120*BM124^3/12+BL120*BM124*(0.5*BK120-0.5*BM124)^2+BM123*(0.5*BK120-BQ120)^2*BP120+BM123*(0.5*BK120-BU120)^2*BT120+BM123*(0.5*BK120-BY120)^2*BX120","v":5.3739461726855491E-3},{"$f":"BL120*BK120^3/12+BN123*(0.5*BK120-BQ120)^2*BP120+BN123*(0.5*BK120-BU120)^2*BT120+BN123*(0.5*BK120-BY120)^2*BX120","v":1.39966977346154E-2},{"$f":"BL120*BO124^3/12+BL120*BO124*(0.5*BK120-0.5*BO124)^2+BO123*(0.5*BK120-BQ120)^2*BP120+BO123*(0.5*BK120-BU120)^2*BT120+BO123*(0.5*BK120-BY120)^2*BX120","v":9.4925678713750697E-3},null,"d",null,{"$f":"BK120-(BX120*BY120+BT120*BU120)/(BT120+BX120)","v":0.65999999999999992},{"$f":"BK120-(BX120*BY120+BT120*BU120)/(BT120+BX120)","v":0.65999999999999992},null,null,"RH0",1]
[null,null,null,null,null,null,null,null,null,null,null,null,null,null,null,null,null,null,null,null,null,null,null,null,null,null,null,null,null,null,null,null,null,null,null,null,null,null,null,null,null,null,null,null,null,null,null,null,null,null,null,null,null,null,null,null,null,null,null,null,null,"z","(m)",{"$f":"BL126/BL125","v":0},{"$f":"BM126/BM125","v":0.19381063058208275},{"$f":"BN126/BN125","v":0},{"$f":"BO126/BO125","v":0.12939397899747038},null,"hc,eff",null,{"$f":"MIN(2.5*(BK120-BS127),(BK120-BM124)/3,BK120/2)","v":0.10000000000000009},{"$f":"MIN(2.5*(BK120-BT127),(BK120-BO124)/3,BK120/2)","v":0.10000000000000009},null,null,"RH",{"$f":"CE120","v":0.55000000000000004}]
[null,null,null,null,null,null,null,null,null,null,null,null,null,null,null,null,null,null,null,null,null,null,null,null,null,null,null,null,null,null,null,null,null,null,null,null,null,null,null,null,null,null,null,null,null,null,null,null,null,null,null,null,null,null,null,null,null,null,null,null,null,"Io","(m4)",{"$f":"BL127-BL125*BL128^2","v":1.0389429069260341E-2},{"$f":"BM127-BM125*BM128^2","v":2.9046599093250341E-3},{"$f":"BN127-BN125*BN128^2","v":1.39966977346154E-2},{"$f":"BO127-BO125*BO128^2","v":7.4399042576562963E-3},null,"Ac,eff",null,{"$f":"BS128*BL120","v":3.0000000000000027E-2},{"$f":"BT128*BL120","v":3.0000000000000027E-2},null,null,"bRH",{"$f":"1.55*(1-(BX128/BX127)^3)","v":1.29211875}]
[null,null,null,null,null,null,null,null,null,null,null,null,null,null,null,null,null,null,null,null,null,null,null,null,null,null,null,null,null,null,null,null,null,null,null,null,null,null,null,null,null,null,null,null,null,null,null,null,null,null,null,null,null,null,null,null,null,null,null,null,null,"aeff*Sa","(m3)",{"$f":"-(BL123*(0.5*BK120-BQ120-BL128)*BP120-BL123*(0.5*BK120-BU120+BL128)*BT120-BL123*(0.5*BK120-BY120+BL128)*BX120)","v":0},{"$f":"-(BM123*(0.5*BK120-BQ120-BM128)*BP120-BM123*(0.5*BK120-BU120+BM128)*BT120-BM123*(0.5*BK120-BY120+BM128)*BX120)","v":3.6592678674277693E-3},{"$f":"-(BN123*(0.5*BK120-BQ120-BN128)*BP120-BN123*(0.5*BK120-BU120+BN128)*BT120-BN123*(0.5*BK120-BY120+BN128)*BX120)","v":0},{"$f":"-(BO123*(0.5*BK120-BQ120-BO128)*BP120-BO123*(0.5*BK120-BU120+BO128)*BT120-BO123*(0.5*BK120-BY120+BO128)*BX120)","v":7.3000524745417093E-3},null,"rp,eff",null,{"$f":"BS126/BS129","v":5.3616514621265758E-2},{"$f":"BT126/BT129","v":5.3616514621265758E-2},null,null,"ecd,0",{"$f":"0.85*((220+110*BX125)*EXP(-BX126*BX124/BX123))*BX129/1000000","v":4.3268250680897753E-4}]
[null,null,null,null,null,null,null,null,null,null,null,null,null,null,null,null,null,null,null,null,null,null,null,null,null,null,null,null,null,null,null,null,null,null,null,null,null,null,null,null,null,null,null,null,null,null,null,null,null,null,null,null,null,null,null,null,null,null,null,null,null,"Sa/Io","(m)",{"$f":"MAX(BL130/BL129,0)","v":0},{"$f":"MAX(BM130/BM129,0)","v":1.2597921896743107},{"$f":"MAX(BN130/BN129,0)","v":0},{"$f":"MAX(BO130/BO129,0)","v":0.98120247542558525},null,"esm-ecm",null,{"$f":"MAX(BM133-BS124*CF120*(1+BS123*BS130)/BS130,0.6*BM133)/BR120","v":0},{"$f":"MAX(BO133-BT124*CF120*(1+BT123*BT130)/BT130,0.6*BO133)/BR120","v":0},null,null,"b",1]
[null,null,null,null,null,null,null,null,null,null,null,null,null,null,null,null,null,null,null,null,null,null,null,null,null,null,null,null,null,null,null,null,null,null,null,null,null,null,null,null,null,null,null,null,null,null,null,null,null,null,null,null,null,null,null,null,null,null,null,null,null,"Mcr","(MNm)",{"$f":"CF120*BL129/(0.5*BK120+BL128)","v":9.528479172280685E-2},null,{"$f":"CF120*BN129/(0.5*BK120+BN128)","v":0.12836821153107497},null,null,"seq",null,{"$f":"((N12^2*P12+N13^2*P13)/(N12*P12+N13*P13))/1000","v":1.6E-2},{"$f":"((N12^2*P12+N13^2*P13)/(N12*P12+N13*P13))/1000","v":1.6E-2},null,null,"h0",{"$f":"2*BK120*BL120/(2*(BK120+BL120))","v":0.21},"m"]
[null,null,null,null,null,null,null,null,null,null,null,null,null,null,null,null,null,null,null,null,null,null,null,null,null,null,null,null,null,null,null,null,null,null,null,null,null,null,null,null,null,null,null,null,null,null,null,null,null,null,null,null,null,null,null,null,null,null,null,null,null,"sat2","(MPa)","-",{"$f":"(AU22-AU21)/1000*BM123*(0.5*BK120+BM128-BU120)/BM129","v":0},"-",{"$f":"(AU21/1000)*BO123*(0.5*BK120+BO128-BU120)/BO129","v":0},null,"c",null,{"$f":"BK120-BS127-0.5*BS132","v":3.2000000000000035E-2},{"$f":"BK120-BT127-0.5*BT132","v":3.2000000000000035E-2},null,null,"kn",{"$f":"IF(BX132<0.1,1,IF(BX132<0.2,0.85+0.15*(0.2-BX132)/0.1,IF(BX132<0.3,0.75+0.1*(0.3-BX132)/0.1,IF(BX132<0.5,0.7+0.05*(0.5-BX132)/0.2,0.7))))","v":0.84}]
[null,null,null,null,null,null,null,null,null,null,null,null,null,null,null,null,null,null,null,null,null,null,null,null,null,null,null,null,null,null,null,null,null,null,null,null,null,null,null,null,null,null,null,null,null,null,null,null,null,null,null,null,null,null,null,null,null,null,null,null,null,"sr2","(MPa, spænding i armering svarende til korttids-revnemoment)",null,null,null,{"$f":"BO123*BL132*(0.5*BK120+BO128-BU120)/BO129","v":98.689836233590825},null,"k1",null,0.8,0.8,null,null,"ecd",{"$f":"BX130*BX131*BX133","v":3.6345330571954112E-4}]
[null,null,null,null,null,null,null,null,null,null,null,null,null,null,null,null,null,null,null,null,null,null,null,null,null,null,null,null,null,null,null,null,null,null,null,null,null,null,null,null,null,null,null,null,null,null,null,null,null,null,null,null,null,null,null,null,null,null,null,null,null,"EI","(MNm2)",{"$f":"BL129*BO120","v":354.04209331929218},{"$f":"BM129*BO120","v":98.982520388993208},{"$f":"BN129*BO120/BN122","v":159.62227455039249},{"$f":"BO129*BO120/BO122","v":84.846759039972895},null,"k2",null,0.5,0.5]
[null,null,null,null,null,null,null,null,null,null,null,null,null,null,null,null,null,null,null,null,null,null,null,null,null,null,null,null,null,null,null,null,null,null,null,null,null,null,null,null,null,null,null,null,null,null,null,null,null,null,null,null,null,null,null,null,null,null,null,null,null,"x","(faktor vedr. tension stiffening)",null,{"$f":"MAX(1-1*(BO134/(BM133+BO133))^2,MAX(0,1-0.5*(BO134/BO133)^2),0)","v":{"$error":"#DIV/0!"}},null,{"$f":"IF(BL132>CJ80,0,BM136)","v":0},null,"k3",null,{"$f":"3.4*(25/(1000*BS133))^(2/3)","v":2.8840687176320858},{"$f":"BS136","v":2.8840687176320858},null,"Autogent svind"]
[null,null,null,null,null,null,null,null,null,null,null,null,null,null,null,null,null,null,null,null,null,null,null,null,null,null,null,null,null,null,null,null,null,null,null,null,null,null,null,null,null,null,null,null,null,null,null,null,null,null,null,null,null,null,null,null,null,null,null,null,null,"u","(mm, elastisk u)",{"$f":"BM137*BM135/BL135","v":0},{"$f":"Kold2!D8-Kold!BO137","v":0},{"$f":"BO137*BO135/BN135","v":0},{"$f":"Kold2!D7","v":0},null,"k4",null,0.42499999999999999,0.42499999999999999,null,null,"eca",{"$f":"2.5*(BM120-10)/1000000","v":6.2500000000000001E-5}]
[null,null,null,null,null,null,null,null,null,null,null,null,null,null,null,null,null,null,null,null,null,null,null,null,null,null,null,null,null,null,null,null,null,null,null,null,null,null,null,null,null,null,null,null,null,null,null,null,null,null,null,null,null,null,null,null,null,null,null,null,null,"uts","(mm, incl tension stiffening)",null,{"$f":"BM136*BM137+(1-BM136)*BL137","v":{"$error":"#DIV/0!"}},null,{"$f":"BO136*BO137+(1-BO136)*BN137","v":0},null,"s,rmaks",null,{"$f":"MIN(1.3*(BK120-BM124),BS136*BS133+BS134*BS135*BS137*BS132/BS130)","v":0.14302083707476854},{"$f":"MIN(1.3*(BK120-BO124),BT136*BT133+BT134*BT135*BT137*BT132/BT130)","v":0.14302083707476854}]
[null,null,null,null,null,null,null,null,null,null,null,null,null,null,null,null,null,null,null,null,null,null,null,null,null,null,null,null,null,null,null,null,null,null,null,null,null,null,null,null,null,null,null,null,null,null,null,null,null,null,null,null,null,null,null,null,null,null,null,null,null,"us","(mm, svindtillæg - langtid)",null,null,{"$f":"1000*0.125*BX140*BN131*BJ120^2","v":0},{"$f":"1000*0.125*BX140*BO131*BJ120^2","v":1.3060826187116401},null,"wk",null,{"$f":"1000*BS138*BS131","v":0},{"$f":"1000*BT138*BT131","v":0},null,"Resulterende svind"]
[null,null,null,null,null,null,null,null,null,null,null,null,null,null,null,null,null,null,null,null,null,null,null,null,null,null,null,null,null,null,null,null,null,null,null,null,null,null,null,null,null,null,null,null,null,null,null,null,null,null,null,null,null,null,null,null,null,null,null,null,null,"ucs","(mm, svindtillæg incl tension stiffening)",null,null,null,{"$f":"BO136*BO139+(1-BO136)*BN139","v":0},null,null,null,null,null,null,null,"esc",{"$f":"BX134+BX137","v":4.2595330571954112E-4}]
[null,null,null,null,null,null,null,null,null,null,null,null,null,null,null,null,null,null,null,null,null,null,null,null,null,null,null,null,null,null,null,null,null,null,null,null,null,null,null,null,null,null,null,null,null,null,null,null,null,null,null,null,null,null,null,null,null,null,null,null,null,"ures","(mm, resulterende udbøjning)",null,{"$f":"BO141+BM138","v":{"$error":"#DIV/0!"}},null,{"$f":"BO140+BO138","v":0},null,"wk, res",null,{"$f":"BS139+BT139","v":0},{"$f":"BT139","v":0}]

{"sheet":"Kold2","index":1,"n_rows":101,"n_cols":66,"rows_kept":101,"cut":false,"hidden":false,"merged":[[84,2,84,5],[84,6,84,9]]}
[]
[]
[null,"Nedbøjninger",null,null,null,null,null,null,null,null,"p/P","x1","x2","R1","R2",0,1,2,3,4,5,6,7,8,9,10,11,12,13,14,15,16,17,18,19,20,21,22,23,24,25,26,27,28,29,30,31,32,33,34,35,36,37,38,39,40]
[null,"L","(m)",{"$f":"IF(Makro!E20=1,0.00001,Kold!M8)","v":1.0000000000000001E-5},null,null,null,null,null,null,null,null,null,null,null,0,{"$f":"Q3*($BD$4-$P$4)/40","v":2.5000000000000004E-7},{"$f":"R3*($BD$4-$P$4)/40","v":5.0000000000000008E-7},7.5000000000000012E-7,1.0000000000000002E-6,1.2500000000000001E-6,1.5000000000000002E-6,1.7500000000000002E-6,2.0000000000000003E-6,2.2500000000000001E-6,2.5000000000000002E-6,2.7499999999999999E-6,3.0000000000000005E-6,3.2500000000000002E-6,3.5000000000000004E-6,3.7500000000000005E-6,4.0000000000000007E-6,4.25E-6,4.5000000000000001E-6,4.7500000000000003E-6,5.0000000000000004E-6,5.2500000000000006E-6,5.4999999999999999E-6,5.75E-6,6.000000000000001E-6,6.2500000000000003E-6,6.5000000000000004E-6,6.7499999999999997E-6,7.0000000000000007E-6,7.25E-6,7.500000000000001E-6,7.7500000000000003E-6,8.0000000000000013E-6,8.2500000000000006E-6,8.4999999999999999E-6,8.7500000000000009E-6,9.0000000000000002E-6,9.2500000000000012E-6,9.5000000000000005E-6,9.7500000000000015E-6,{"$f":"$D$4","v":1.0000000000000001E-5},{"$f":"L18","v":1},{"$f":"L22","v":1.5},{"$f":"L26","v":2}]
[null,"EI_L","(kNm2)",{"$f":"Kold!M31","v":84847.188068652482}]
[null,"EI_k","(kNm2)",{"$f":"Kold!M32","v":98983.270066006531},null,null,null,null,"p1","L",{"$f":"D12","v":5},{"$f":"D16","v":0},{"$f":"D17","v":5},{"$f":"(M6-L6)*K6-O6","v":-6249974.9999999991},{"$f":"0.5*K6*(M6^2-L6^2)/$D$4","v":6249999.9999999991},{"$f":"$N6*P$4-IF(P$4>$L6,0.5*($L6-P$4)^2*$K6)+IF(P$4>$M6,0.5*(P$4-$M6)^2*$K6)","v":0},{"$f":"$N6*Q$4-IF(Q$4>$L6,0.5*($L6-Q$4)^2*$K6)+IF(Q$4>$M6,0.5*(Q$4-$M6)^2*$K6)","v":-1.5624937500001563},-3.1249875000006249,-4.6874812500014063,-6.2499750000025003,-7.8124687500039061,-9.3749625000056263,-10.937456250007656,-12.499950000009999,-14.062443750012655,-15.624937500015625,-17.187431250018903,-18.7499250000225,-20.312418750026406,-21.874912500030625,-23.437406250035156,-24.99990000004,-26.56239375004515,{"$f":"$N6*AH$4-IF(AH$4>$L6,0.5*($L6-AH$4)^2*$K6)+IF(AH$4>$M6,0.5*(AH$4-$M6)^2*$K6)","v":-28.124887500050622},-29.687381250056404,-31.249875000062499,-32.812368750068906,-34.374862500075615,-35.937356250082651,-37.499850000089999,-39.062343750097654,-40.62483750010562,-42.1873312501139,-43.749825000122499,-45.312318750131404,-46.874812500140621,-48.437306250150151,-49.99980000016,-51.562293750170149,-53.124787500180616,-54.687281250191404,-56.24977500020249,-57.81226875021391,-59.374762500225621,-60.937256250237652,-62.499750000249996,-6249977.4999999991,{"$f":"$N6*BF$4-IF(BF$4>$L6,0.5*($L6-BF$4)^2*$K6)+IF(BF$4>$M6,0.5*(BF$4-$M6)^2*$K6)","v":-9374968.1249999981},-12499959.999999998]
[null,"u_L","(mm)",{"$f":"1000*MAX(P70:BD70)","v":0},null,null,null,null,"p1","K",{"$f":"D13","v":5},{"$f":"D16","v":0},{"$f":"D17","v":5},{"$f":"(M7-L7)*K7-O7","v":-6249974.9999999991},{"$f":"0.5*K7*(M7^2-L7^2)/$D$4","v":6249999.9999999991},{"$f":"$N7*P$4-IF(P$4>$L7,0.5*($L7-P$4)^2*$K7)+IF(P$4>$M7,0.5*(P$4-$M7)^2*$K7)","v":0},-1.5624937500001563,-3.1249875000006249,-4.6874812500014063,-6.2499750000025003,-7.8124687500039061,-9.3749625000056263,-10.937456250007656,-12.499950000009999,-14.062443750012655,-15.624937500015625,-17.187431250018903,-18.7499250000225,-20.312418750026406,-21.874912500030625,-23.437406250035156,-24.99990000004,-26.56239375004515,-28.124887500050622,-29.687381250056404,-31.249875000062499,-32.812368750068906,-34.374862500075615,-35.937356250082651,-37.499850000089999,-39.062343750097654,-40.62483750010562,-42.1873312501139,-43.749825000122499,-45.312318750131404,-46.874812500140621,-48.437306250150151,-49.99980000016,-51.562293750170149,-53.124787500180616,-54.687281250191404,-56.24977500020249,-57.81226875021391,-59.374762500225621,-60.937256250237652,-62.499750000249996,-6249977.4999999991,-9374968.1249999981,-12499959.999999998]
[null,"u_k","(mm)",{"$f":"1000*MAX(P74:BD74)","v":0},null,null,null,null,"p1","d",{"$f":"D14","v":5.5},{"$f":"D16","v":0},{"$f":"D17","v":5},{"$f":"(M8-L8)*K8-O8","v":-6874972.4999999991},{"$f":"0.5*K8*(M8^2-L8^2)/$D$4","v":6874999.9999999991},{"$f":"$N8*P$4-IF(P$4>$L8,0.5*($L8-P$4)^2*$K8)+IF(P$4>$M8,0.5*(P$4-$M8)^2*$K8)","v":0},-1.7187431250001719,-3.4374862500006875,-5.1562293750015478,-6.87497250000275,-8.5937156250042968,-10.312458750006188,-12.031201875008421,-13.749945000011,-15.468688125013919,-17.187431250017188,-18.906174375020793,-20.624917500024754,-22.343660625029045,-24.062403750033685,-25.781146875038672,-27.499890000044001,-29.218633125049667,-30.937376250055685,-32.65611937506204,-34.374862500068751,-36.093605625075796,-37.812348750083181,-39.531091875090915,-41.249835000099004,-42.968578125107413,-44.687321250116185,-46.40606437512529,-48.124807500134743,-49.843550625144537,-51.562293750154687,-53.281036875165171,-54.999780000176003,-56.718523125187168,-58.437266250198682,-60.156009375210544,-61.874752500222741,-63.593495625235299,-65.312238750248184,-67.030981875261418,-68.749725000274992,-6874975.2499999991,-10312464.937499998,-13749955.999999998]
[]
[null,null,null,null,null,null,null,null,"p2","L",{"$f":"E12","v":7.5},{"$f":"E16","v":1},{"$f":"E17","v":3},{"$f":"(M10-L10)*K10-O10","v":-2999984.9999999995},{"$f":"0.5*K10*(M10^2-L10^2)/$D$4","v":2999999.9999999995},{"$f":"$N10*P$4-IF(P$4>$L10,0.5*($L10-P$4)^2*$K10)+IF(P$4>$M10,0.5*(P$4-$M10)^2*$K10)+IF(P$4>$D$4,(P$4-$D$4)*$O10)","v":0},-0.74999625000000003,-1.4999925000000001,-2.24998875,-2.9999850000000001,-3.7499812499999998,-4.4999775,-5.2499737499999997,-5.9999700000000002,-6.7499662499999991,-7.4999624999999996,-8.2499587499999993,-8.9999549999999999,-9.7499512499999987,-10.499947499999999,-11.24994375,-11.99994,-12.749936249999998,-13.499932499999998,-14.249928749999999,-14.999924999999999,-15.74992125,-16.499917499999999,-17.249913749999997,-17.99991,-18.749906249999999,-19.499902499999997,-20.249898749999996,-20.999894999999999,-21.749891249999997,-22.4998875,-23.249883749999999,-23.999880000000001,-24.74987625,-25.499872499999995,-26.249868749999997,-26.999864999999996,-27.749861249999999,-28.499857499999997,-29.24985375,-29.999849999999999,-2999984.9999999995,-4499978.4374999991,-5999973.7499999991]
[null,"Jævnt fordelte laste",null,"p1","p2","p3",null,null,"p2","K",{"$f":"E13","v":9},{"$f":"E16","v":1},{"$f":"E17","v":3},{"$f":"(M11-L11)*K11-O11","v":-3599981.9999999995},{"$f":"0.5*K11*(M11^2-L11^2)/$D$4","v":3599999.9999999995},{"$f":"$N11*P$4-IF(P$4>$L11,0.5*($L11-P$4)^2*$K11)+IF(P$4>$M11,0.5*(P$4-$M11)^2*$K11)+IF(P$4>$D$4,(P$4-$D$4)*$O11)","v":0},-0.89999550000000006,-1.7999910000000001,-2.6999865000000001,-3.5999820000000002,-4.4999775,-5.3999730000000001,-6.2999684999999994,-7.1999640000000005,-8.0999594999999989,-8.9999549999999999,-9.8999504999999992,-10.799946,-11.6999415,-12.599936999999999,-13.4999325,-14.399928000000001,-15.299923499999998,-16.199918999999998,-17.099914499999997,-17.99991,-18.899905499999999,-19.799900999999998,-20.699896499999998,-21.599892000000001,-22.4998875,-23.399882999999999,-24.299878499999995,-25.199873999999998,-26.099869499999997,-26.999865,-27.899860499999999,-28.799856000000002,-29.699851499999998,-30.599846999999997,-31.4998425,-32.399837999999995,-33.299833499999998,-34.199828999999994,-35.099824500000004,-35.99982,-3599981.9999999995,-5399974.1249999991,-7199968.4999999991]
[null,"Langtidsværdi","(kN/m)",{"$f":"Kold2!D87*D26","v":5},{"$f":"Kold2!E87*D26","v":7.5},{"$f":"Kold2!F87*D26","v":6.5},null,null,"p2","d",{"$f":"E14","v":11.55},{"$f":"E16","v":1},{"$f":"E17","v":3},{"$f":"(M12-L12)*K12-O12","v":-4619976.9000000004},{"$f":"0.5*K12*(M12^2-L12^2)/$D$4","v":4620000},{"$f":"$N12*P$4-IF(P$4>$L12,0.5*($L12-P$4)^2*$K12)+IF(P$4>$M12,0.5*(P$4-$M12)^2*$K12)+IF(P$4>$D$4,(P$4-$D$4)*$O12)","v":0},-1.1549942250000003,-2.3099884500000005,-3.4649826750000008,-4.6199769000000011,-5.7749711250000013,-6.9299653500000016,-8.084959575000001,-9.2399538000000021,-10.394948025000001,-11.549942250000003,-12.704936475,-13.859930700000003,-15.014924925000003,-16.169919150000002,-17.324913375000005,-18.479907600000004,-19.634901825,-20.789896050000003,-21.944890275000002,-23.099884500000005,-24.254878725000005,-25.40987295,-26.564867175000003,-27.719861400000006,-28.874855625000002,-30.029849850000005,-31.184844075000001,-32.339838300000004,-33.494832525,-34.64982675000001,-35.804820975000005,-36.959815200000008,-38.114809425000004,-39.26980365,-40.42479787500001,-41.579792100000006,-42.734786325000009,-43.889780550000005,-45.044774775000008,-46.199769000000011,-4619976.9000000004,-6929966.7937500002,-9239959.5750000011]
[null,"Kar. værdi","(kN/m)",{"$f":"Kold2!D88*D26","v":5},{"$f":"Kold2!E88*D26","v":9},{"$f":"Kold2!F88*D26","v":10}]
[null,"Regnm. værdi","(kN/m)",{"$f":"Kold2!D89*D26","v":5.5},{"$f":"Kold2!E89*D26","v":11.55},{"$f":"Kold2!F89*D26","v":14.85},null,null,"p3","L",{"$f":"F12","v":6.5},{"$f":"F16","v":2},{"$f":"F17","v":4},{"$f":"(M14-L14)*K14-O14","v":-3899986.9999999995},{"$f":"0.5*K14*(M14^2-L14^2)/$D$4","v":3899999.9999999995},{"$f":"$N14*P$4-IF(P$4>$L14,0.5*($L14-P$4)^2*$K14)+IF(P$4>$M14,0.5*(P$4-$M14)^2*$K14)+IF(P$4>$D$4,(P$4-$D$4)*$O14)","v":0},-0.97499675000000008,-1.9499935000000002,-2.92499025,-3.8999870000000003,-4.8749837500000002,-5.8499805,-6.8249772499999999,-7.7999740000000006,-8.7749707499999996,-9.7499675000000003,-10.724964249999999,-11.699961,-12.674957749999999,-13.6499545,-14.624951250000001,-15.599948000000001,-16.574944749999997,-17.549941499999999,-18.524938249999998,-19.499935000000001,-20.47493175,-21.449928499999999,-22.424925249999998,-23.399922,-24.374918749999999,-25.349915499999998,-26.324912249999997,-27.299909,-28.274905749999999,-29.249902500000001,-30.224899249999996,-31.199896000000003,-32.174892749999998,-33.149889499999993,-34.124886250000003,-35.099882999999998,-36.074879750000001,-37.049876499999996,-38.024873249999999,-38.999870000000001,-3899986.9999999995,-5849980.4999999991,-7799973.9999999991]
[null,"exc","(m)",{"$f":"Kold2!D90","v":25},{"$f":"Kold2!E90","v":15},{"$f":"Kold2!F90","v":25},null,null,"p3","K",{"$f":"F13","v":10},{"$f":"F16","v":2},{"$f":"F17","v":4},{"$f":"(M15-L15)*K15-O15","v":-5999979.9999999991},{"$f":"0.5*K15*(M15^2-L15^2)/$D$4","v":5999999.9999999991},{"$f":"$N15*P$4-IF(P$4>$L15,0.5*($L15-P$4)^2*$K15)+IF(P$4>$M15,0.5*(P$4-$M15)^2*$K15)+IF(P$4>$D$4,(P$4-$D$4)*$O15)","v":0},-1.499995,-2.9999899999999999,-4.4999849999999997,-5.9999799999999999,-7.4999749999999992,-8.9999699999999994,-10.499965,-11.99996,-13.499954999999998,-14.999949999999998,-16.499944999999997,-17.999939999999999,-19.499934999999997,-20.999929999999999,-22.499925000000001,-23.999919999999999,-25.499914999999994,-26.999909999999996,-28.499904999999998,-29.999899999999997,-31.499894999999999,-32.999889999999994,-34.499884999999992,-35.999879999999997,-37.499874999999996,-38.999869999999994,-40.499864999999993,-41.999859999999998,-43.499854999999997,-44.999850000000002,-46.499844999999993,-47.999839999999999,-49.499834999999997,-50.999829999999989,-52.499824999999994,-53.999819999999993,-55.499814999999998,-56.999809999999997,-58.499805000000002,-59.999799999999993,-5999979.9999999991,-8999969.9999999981,-11999959.999999998]
[null,"x1","(m)",{"$f":"Kold2!D91","v":0},{"$f":"Kold2!E91","v":1},{"$f":"Kold2!F91","v":2},null,null,"p3","d",{"$f":"F14","v":14.85},{"$f":"F16","v":2},{"$f":"F17","v":4},{"$f":"(M16-L16)*K16-O16","v":-8909970.2999999989},{"$f":"0.5*K16*(M16^2-L16^2)/$D$4","v":8909999.9999999981},{"$f":"$N16*P$4-IF(P$4>$L16,0.5*($L16-P$4)^2*$K16)+IF(P$4>$M16,0.5*(P$4-$M16)^2*$K16)+IF(P$4>$D$4,(P$4-$D$4)*$O16)","v":0},-2.2274925750000003,-4.4549851500000006,-6.682477725,-8.9099703000000012,-11.137462874999999,-13.36495545,-15.592448024999999,-17.819940600000002,-20.047433174999998,-22.274925749999998,-24.502418324999997,-26.7299109,-28.957403475,-31.184896049999999,-33.412388624999998,-35.639881200000005,-37.867373774999997,-40.094866349999997,-42.322358924999996,-44.549851499999995,-46.777344075000002,-49.004836649999994,-51.232329224999994,-53.4598218,-55.687314374999993,-57.914806949999999,-60.142299524999991,-62.369792099999998,-64.597284674999997,-66.824777249999997,-69.052269824999996,-71.27976240000001,-73.507254974999995,-75.734747549999994,-77.962240124999994,-80.189732699999993,-82.417225275000007,-84.644717849999992,-86.872210425000006,-89.099702999999991,-8909970.2999999989,-13364955.449999999,-17819940.599999998]
[null,"x2","(m)",{"$f":"Kold2!D92","v":5},{"$f":"Kold2!E92","v":3},{"$f":"Kold2!F92","v":4}]
[null,null,null,null,null,null,null,null,"P1","L",{"$f":"D20","v":15},{"$f":"D24","v":1},null,{"$f":"K18-O18","v":-1499984.9999999998},{"$f":"K18*L18/$D$4","v":1499999.9999999998},{"$f":"$N18*P$4-IF(P$4>$L18,(P$4-$L18)*$K18)","v":0},{"$f":"$N18*Q$4-IF(Q$4>$L18,(Q$4-$L18)*$K18)","v":-0.37499625000000003},-0.74999250000000006,-1.12498875,-1.4999850000000001,-1.8749812499999998,-2.2499775,-2.6249737499999997,-2.9999700000000002,-3.3749662499999995,-3.7499624999999996,-4.1249587499999993,-4.4999549999999999,-4.8749512499999996,-5.2499474999999993,-5.6249437499999999,-5.9999400000000005,-6.3749362499999993,-6.749932499999999,-7.1249287499999996,-7.4999249999999993,-7.8749212499999999,-8.2499174999999987,-8.6249137499999993,-8.9999099999999999,-9.3749062499999987,-9.7499024999999993,-10.124898749999998,-10.499894999999999,-10.874891249999999,-11.2498875,-11.624883749999999,-11.999880000000001,-12.37487625,-12.749872499999999,-13.124868749999999,-13.499864999999998,-13.87486125,-14.249857499999999,-14.62485375,-14.999849999999999,{"$f":"$N18*BE$4-IF(BE$4>$L18,(BE$4-$L18)*$K18)","v":-1499984.9999999998},-2249984.9999999995,-2999984.9999999995]
[null,"Punktlaste",null,"P1","P2","P3",null,null,"P1","K",{"$f":"D21","v":15},{"$f":"D24","v":1},null,{"$f":"K19-O19","v":-1499984.9999999998},{"$f":"K19*L19/$D$4","v":1499999.9999999998},{"$f":"$N19*P$4-IF(P$4>$L19,(P$4-$L19)*$K19)","v":0},-0.37499625000000003,-0.74999250000000006,-1.12498875,-1.4999850000000001,-1.8749812499999998,-2.2499775,-2.6249737499999997,-2.9999700000000002,-3.3749662499999995,-3.7499624999999996,-4.1249587499999993,-4.4999549999999999,-4.8749512499999996,-5.2499474999999993,-5.6249437499999999,-5.9999400000000005,-6.3749362499999993,-6.749932499999999,-7.1249287499999996,-7.4999249999999993,-7.8749212499999999,-8.2499174999999987,-8.6249137499999993,-8.9999099999999999,-9.3749062499999987,-9.7499024999999993,-10.124898749999998,-10.499894999999999,-10.874891249999999,-11.2498875,-11.624883749999999,-11.999880000000001,-12.37487625,-12.749872499999999,-13.124868749999999,-13.499864999999998,-13.87486125,-14.249857499999999,-14.62485375,-14.999849999999999,-1499984.9999999998,-2249984.9999999995,-2999984.9999999995]
[null,"Langtidsværdi","(kN)",{"$f":"Kold2!H87*D26","v":15},{"$f":"Kold2!I87*D26","v":12},{"$f":"Kold2!J87*D26","v":19.5},null,null,"P1","d",{"$f":"D22","v":16.5},{"$f":"D24","v":1},null,{"$f":"K20-O20","v":-1649983.4999999998},{"$f":"K20*L20/$D$4","v":1649999.9999999998},{"$f":"$N20*P$4-IF(P$4>$L20,(P$4-$L20)*$K20)","v":0},-0.41249587500000001,-0.82499175000000002,-1.237487625,-1.6499835,-2.0624793749999997,-2.47497525,-2.8874711249999998,-3.2999670000000001,-3.7124628749999995,-4.1249587499999993,-4.5374546249999996,-4.9499504999999999,-5.3624463749999993,-5.7749422499999996,-6.1874381249999999,-6.5999340000000002,-7.0124298749999987,-7.424925749999999,-7.8374216249999993,-8.2499174999999987,-8.6624133749999999,-9.0749092499999993,-9.4874051249999987,-9.8999009999999998,-10.312396874999999,-10.724892749999999,-11.137388624999998,-11.549884499999999,-11.962380374999999,-12.37487625,-12.787372124999999,-13.199868,-13.612363875,-14.024859749999997,-14.437355625,-14.849851499999998,-15.262347374999999,-15.674843249999999,-16.087339125,-16.499834999999997,-1649983.4999999998,-2474983.4999999995,-3299983.4999999995]
[null,"Kar. værdi","(kN)",{"$f":"Kold2!H88*D26","v":15},{"$f":"Kold2!I88*D26","v":12},{"$f":"Kold2!J88*D26","v":22}]
[null,"Regnm. værdi","(kN)",{"$f":"Kold2!H89*D26","v":16.5},{"$f":"Kold2!I89*D26","v":13.200000000000001},{"$f":"Kold2!J89*D26","v":26.950000000000003},null,null,"P2","L",{"$f":"E20","v":12},{"$f":"E24","v":1.5},null,{"$f":"K22-O22","v":-1799987.9999999998},{"$f":"K22*L22/$D$4","v":1799999.9999999998},{"$f":"$N22*P$4-IF(P$4>$L22,(P$4-$L22)*$K22)","v":0},-0.44999700000000004,-0.89999400000000007,-1.3499909999999999,-1.7999880000000001,-2.2499849999999997,-2.6999819999999999,-3.1499790000000001,-3.5999760000000003,-4.0499729999999996,-4.4999699999999994,-4.9499669999999991,-5.3999639999999998,-5.8499609999999995,-6.2999580000000002,-6.7499549999999999,-7.1999520000000006,-7.6499489999999986,-8.0999459999999992,-8.549942999999999,-8.9999399999999987,-9.4499370000000003,-9.8999339999999982,-10.349930999999998,-10.799928,-11.249924999999999,-11.699921999999999,-12.149918999999999,-12.599916,-13.049912999999998,-13.49991,-13.949907,-14.399904000000001,-14.849900999999999,-15.299897999999997,-15.749895,-16.199891999999998,-16.649889000000002,-17.099885999999998,-17.549883000000001,-17.999879999999997,-1799987.9999999998,-2699981.9999999995,-3599981.9999999995]
[null,"exc","(m)",{"$f":"Kold2!H90","v":10},{"$f":"Kold2!I90","v":15},{"$f":"Kold2!J90","v":20},null,null,"P2","K",{"$f":"E21","v":12},{"$f":"E24","v":1.5},null,{"$f":"K23-O23","v":-1799987.9999999998},{"$f":"K23*L23/$D$4","v":1799999.9999999998},{"$f":"$N23*P$4-IF(P$4>$L23,(P$4-$L23)*$K23)","v":0},-0.44999700000000004,-0.89999400000000007,-1.3499909999999999,-1.7999880000000001,-2.2499849999999997,-2.6999819999999999,-3.1499790000000001,-3.5999760000000003,-4.0499729999999996,-4.4999699999999994,-4.9499669999999991,-5.3999639999999998,-5.8499609999999995,-6.2999580000000002,-6.7499549999999999,-7.1999520000000006,-7.6499489999999986,-8.0999459999999992,-8.549942999999999,-8.9999399999999987,-9.4499370000000003,-9.8999339999999982,-10.349930999999998,-10.799928,-11.249924999999999,-11.699921999999999,-12.149918999999999,-12.599916,-13.049912999999998,-13.49991,-13.949907,-14.399904000000001,-14.849900999999999,-15.299897999999997,-15.749895,-16.199891999999998,-16.649889000000002,-17.099885999999998,-17.549883000000001,-17.999879999999997,-1799987.9999999998,-2699981.9999999995,-3599981.9999999995]
[null,"x","(m)",{"$f":"Kold2!H91","v":1},{"$f":"Kold2!I91","v":1.5},{"$f":"Kold2!J91","v":2},null,null,"P2","d",{"$f":"E22","v":13.200000000000001},{"$f":"E24","v":1.5},null,{"$f":"K24-O24","v":-1979986.8},{"$f":"K24*L24/$D$4","v":1980000},{"$f":"$N24*P$4-IF(P$4>$L24,(P$4-$L24)*$K24)","v":0},-0.49499670000000007,-0.98999340000000013,-1.4849901000000003,-1.9799868000000003,-2.4749835000000004,-2.9699802000000006,-3.4649769000000004,-3.9599736000000005,-4.4549703000000003,-4.9499670000000009,-5.4449636999999997,-5.9399604000000013,-6.434957100000001,-6.9299538000000007,-7.4249505000000013,-7.9199472000000011,-8.4149439000000008,-8.9099406000000005,-9.4049373000000003,-9.8999340000000018,-10.394930700000002,-10.889927399999999,-11.384924100000001,-11.879920800000003,-12.3749175,-12.869914200000002,-13.3649109,-13.859907600000001,-14.354904300000001,-14.849901000000003,-15.344897700000001,-15.839894400000002,-16.3348911,-16.829887800000002,-17.324884500000003,-17.819881200000001,-18.314877900000003,-18.809874600000001,-19.304871300000002,-19.799868000000004,-1979986.8,-2969980.2,-3959980.2]
[]
[null,"Inddatatest",{"$f":"MAX(Kold!BE17:BE46)","v":0},{"$f":"IF(C26=1,0,1)","v":1},null,null,null,null,"P3","L",{"$f":"F20","v":19.5},{"$f":"F24","v":2},null,{"$f":"K26-O26","v":-3899980.4999999995},{"$f":"K26*L26/$D$4","v":3899999.9999999995},{"$f":"$N26*P$4-IF(P$4>$L26,(P$4-$L26)*$K26)","v":0},-0.97499512500000007,-1.9499902500000001,-2.9249853750000003,-3.8999805000000003,-4.8749756250000003,-5.8499707500000007,-6.8249658750000002,-7.7999610000000006,-8.7749561249999992,-9.7499512500000005,-10.724946374999998,-11.699941500000001,-12.674936624999999,-13.64993175,-14.624926875,{"$f":"$N26*AF$4-IF(AF$4>$L26,(AF$4-$L26)*$K26)","v":-15.599922000000001},-16.574917124999999,-17.549912249999998,-18.524907374999998,-19.499902500000001,-20.474897625000001,-21.449892749999997,-22.424887874999996,-23.399883000000003,-24.374878124999999,-25.349873249999998,-26.324868374999994,-27.299863500000001,-28.274858624999997,-29.24985375,-30.224848874999999,-31.199844000000002,-32.174839124999998,-33.149834249999998,-34.124829374999997,-35.099824499999997,-36.074819625000003,-37.049814749999996,-38.024809875000003,-38.999805000000002,-3899980.4999999995,-5849970.7499999991,-7799960.9999999991]
[null,null,null,null,null,null,null,null,"P3","K",{"$f":"F21","v":22},{"$f":"F24","v":2},null,{"$f":"K27-O27","v":-4399978},{"$f":"K27*L27/$D$4","v":4400000},{"$f":"$N27*P$4-IF(P$4>$L27,(P$4-$L27)*$K27)","v":0},{"$f":"$N27*Q$4-IF(Q$4>$L27,(Q$4-$L27)*$K27)","v":-1.0999945000000002},-2.1999890000000004,-3.2999835000000006,-4.3999780000000008,-5.4999725000000002,-6.5999670000000012,-7.6999615000000006,-8.7999560000000017,-9.899950500000001,-10.999945,-12.0999395,-13.199934000000002,-14.299928500000002,-15.399923000000001,-16.499917500000002,-17.599912000000003,-18.699906500000001,-19.799901000000002,-20.8998955,-21.999890000000001,-23.099884500000002,-24.199878999999999,-25.2998735,-26.399868000000005,-27.499862500000003,-28.599857000000004,-29.699851499999998,-30.799846000000002,-31.8998405,-32.999835000000004,-34.099829499999998,-35.199824000000007,-36.299818500000001,-37.399813000000002,-38.499807500000003,-39.599802000000004,-40.699796500000005,-41.799790999999999,-42.899785500000007,-43.999780000000001,-4399978,{"$f":"$N27*BF$4-IF(BF$4>$L27,(BF$4-$L27)*$K27)","v":-6599967},{"$f":"$N27*BG$4-IF(BG$4>$L27,(BG$4-$L27)*$K27)","v":-8799956}]
[null,null,null,null,null,null,null,null,"P3","d",{"$f":"F22","v":26.950000000000003},{"$f":"F24","v":2},null,{"$f":"K28-O28","v":-5389973.0499999998},{"$f":"K28*L28/$D$4","v":5390000},{"$f":"$N28*P$4-IF(P$4>$L28,(P$4-$L28)*$K28)","v":0},-1.3474932625000002,-2.6949865250000005,-4.0424797875000005,-5.3899730500000009,-6.7374663125000005,-8.084959575000001,-9.4324528375000014,-10.779946100000002,-12.127439362500001,-13.474932625000001,-14.8224258875,-16.169919150000002,-17.517412412500001,-18.864905675000003,-20.212398937500001,-21.559892200000004,-22.907385462499999,-24.254878725000001,-25.6023719875,-26.949865250000002,-28.297358512500001,-29.644851774999999,-30.992345037499998,-32.339838300000004,-33.687331562499999,-35.034824825000001,-36.382318087499996,-37.729811350000006,-39.077304612500001,-40.424797875000003,-41.772291137499998,-43.119784400000007,-44.467277662500003,-45.814770924999998,-47.1622641875,-48.509757450000002,-49.857250712500004,-51.204743975,-52.552237237500009,-53.899730500000004,{"$f":"$N28*BE$4-IF(BE$4>$L28,(BE$4-$L28)*$K28)","v":-5389973.0499999998},{"$f":"$N28*BF$4-IF(BF$4>$L28,(BF$4-$L28)*$K28)","v":-8084959.5749999993},{"$f":"$N28*BG$4-IF(BG$4>$L28,(BG$4-$L28)*$K28)","v":-10779946.1}]
[]
[null,null,null,null,null,null,null,null,"MOMENTER",null,null,null,null,null,"punkt",{"$f":"P3","v":0},{"$f":"Q3","v":1},2,3,4,5,6,7,8,9,10,11,12,13,14,15,16,17,18,19,20,21,22,23,24,25,26,27,28,29,30,31,32,33,34,35,36,37,38,39,40,{"$f":"BE4*40/$D$4","v":3999999.9999999995},{"$f":"BF4*40/$D$4","v":5999999.9999999991},{"$f":"BG4*40/$D$4","v":7999999.9999999991}]
[null,null,null,null,null,null,null,null,null,null,null,null,null,null," :    ",{"$f":"P6+P10+P14+P18+P22+P26","v":0},{"$f":"Q6+Q10+Q14+Q18+Q22+Q26","v":-5.0874751250001573},-10.174950250000627,-15.262425375001406,-20.349900500002505,-25.437375625003906,-30.524850750005626,-35.612325875007656,-40.699801000010005,-45.787276125012653,-50.874751250015628,-55.962226375018901,-61.049701500022501,-66.137176625026399,-71.224651750030631,-76.312126875035148,{"$f":"AF6+AF10+AF14+AF18+AF22+AF26","v":-81.399602000040019},-86.487077125045147,-91.57455225005063,-96.662027375056397,-101.7495025000625,-106.83697762506891,-111.9244527500756,-117.01192787508265,-122.09940300008999,-127.18687812509764,-132.27435325010561,-137.36182837511387,-142.44930350012248,-147.5367786251314,-152.62425375014061,-157.71172887515013,-162.79920400016002,-167.88667912517013,-172.97415425018059,-178.06162937519139,-183.1491045002025,-188.23657962521392,-193.3240547502256,-198.41152987523765,-203.49900500025001,{"$f":"BE6+BE10+BE14+BE18+BE22+BE26","v":-20349902.999999996},-30524864.812499996,-40699835.749999993]
[null,null,null,null,null,null,null,null,null,null,null,null,null,null," :    ",{"$f":"P7+P11+P15+P19+P23+P27","v":0},-5.8874720000001561,-11.774944000000625,-17.662416000001404,-23.5498880000025,-29.437360000003906,-35.324832000005621,-41.212304000007656,-47.099776000009996,-52.987248000012656,-58.874720000015628,-64.762192000018899,-70.649664000022497,-76.537136000026408,-82.424608000030616,-88.312080000035166,{"$f":"AF7+AF11+AF15+AF19+AF23+AF27","v":-94.199552000040001},-100.08702400004513,-105.97449600005062,-111.86196800005639,-117.74944000006249,-123.6369120000689,-129.5243840000756,-135.41185600008265,-141.29932800008999,-147.18680000009766,-153.07427200010562,-158.9617440001139,-164.84921600012248,-170.73668800013141,-176.62416000014065,-182.51163200015014,-188.39910400015998,-194.28657600017016,-200.17404800018059,-206.06152000019139,-211.94899200020251,-217.83646400021394,-223.72393600022559,-229.61140800023767,-235.49888000024998,-23549890.499999996,-35324846.249999993,-47099811.499999993]
[null,null,null,null,null,null,null,null,null,null,null,null,null,null," :    ",{"$f":"P8+P12+P16+P20+P24+P28","v":0},-7.3562157625001729,-14.712431525000691,-22.068647287501552,-29.424863050002752,-36.781078812504298,-44.137294575006187,-51.493510337508418,-58.849726100011004,-66.205941862513924,-73.562157625017193,-80.918373387520788,-88.274589150024767,-95.630804912529044,-102.98702067503369,-110.34323643753866,{"$f":"AF8+AF12+AF16+AF20+AF24+AF28","v":-117.69945220004402},-125.05566796254966,-132.41188372505567,-139.76809948756204,-147.12431525006875,-154.48053101257582,-161.83674677508318,-169.19296253759092,-176.54917830009902,-183.9053940626074,-191.26160982511618,-198.6178255876253,-205.97404135013474,-213.33025711264455,-220.68647287515469,-228.04268863766515,-235.39890440017604,-242.75512016268718,-250.11133592519869,-257.46755168771057,-264.82376745022276,-272.17998321273529,-279.53619897524823,-286.89241473776144,-294.248630500275,-29424865.799999997,-44137310.456249997,-58849765.975000001]
[]
[null,null,null,null,null,null,null,null,null,null,"p/P","x1","x2",null,null,0,1,2,3,4,5,6,7,8,9,10,11,12,13,14,15,16,17,18,19,20,21,22,23,24,25,26,27,28,29,30,31,32,33,34,35,36,37,38,39,40,null,null,null,null,null,"hi cot 0","L-hi cot 0",null,"½hi cot 0","L-½hi cot 0"]
[null,null,null,null,null,null,null,null,null,null,null,null,null,null,null,0,{"$f":"Q35*($BD$4-$P$4)/40","v":2.5000000000000004E-7},5.0000000000000008E-7,7.5000000000000012E-7,1.0000000000000002E-6,1.2500000000000001E-6,1.5000000000000002E-6,1.7500000000000002E-6,2.0000000000000003E-6,2.2500000000000001E-6,2.5000000000000002E-6,2.7499999999999999E-6,3.0000000000000005E-6,3.2500000000000002E-6,3.5000000000000004E-6,3.7500000000000005E-6,4.0000000000000007E-6,4.25E-6,4.5000000000000001E-6,4.7500000000000003E-6,5.0000000000000004E-6,5.2500000000000006E-6,5.4999999999999999E-6,5.75E-6,6.000000000000001E-6,6.2500000000000003E-6,6.5000000000000004E-6,6.7499999999999997E-6,7.0000000000000007E-6,7.25E-6,7.500000000000001E-6,7.7500000000000003E-6,8.0000000000000013E-6,8.2500000000000006E-6,8.4999999999999999E-6,8.7500000000000009E-6,9.0000000000000002E-6,9.2500000000000012E-6,9.5000000000000005E-6,9.7500000000000015E-6,{"$f":"$D$4","v":1.0000000000000001E-5},0,{"$f":"Kold!K34*Kold!P15/1000","v":1.2711255609716932},{"$f":"BH36-Kold!K34*Kold!P15/1000","v":3.7288744390283068},{"$f":"Kold!M8","v":5},null,{"$f":"BF36","v":1.2711255609716932},{"$f":"BG36","v":3.7288744390283068},null,{"$f":"0.5*BJ36","v":0.63556278048584658},{"$f":"BH36-BM36","v":4.3644372195141532}]
[null,"Excentriciteter",null,null,null,null,null,null,"Venstresidig forskydning"]
[null,"exc. p_1","(mm)",{"$f":"D15","v":25},null,null,null,null,{"$f":"I8","v":"p1"},{"$f":"J8","v":"d"},{"$f":"K8","v":5.5},{"$f":"L8","v":0},{"$f":"M8","v":5},null,null,{"$f":"IF(P$36<=$L38,$K38*($M38-$L38)*($D$4-0.5*($L38+$M38))/$D$4,IF(P$36<=$M38,$K38*($M38-P$36)*($D$4-0.5*(P$36+$M38))/$D$4,0))","v":-6874972.4999999991},{"$f":"IF(Q$36<=$L38,$K38*($M38-$L38)*($D$4-0.5*($L38+$M38))/$D$4,IF(Q$36<=$M38,$K38*($M38-Q$36)*($D$4-0.5*(Q$36+$M38))/$D$4,0))","v":-6874972.5000013579},-6874972.5000026813,-6874972.5000039693,-6874972.5000052247,-6874972.5000064438,-6874972.5000076303,-6874972.5000087814,-6874972.5000099,-6874972.5000109831,-6874972.5000120299,-6874972.500013045,-6874972.5000140239,-6874972.5000149701,-6874972.50001588,-6874972.5000167564,-6874972.5000175992,{"$f":"IF(AG$36<=$L38,$K38*($M38-$L38)*($D$4-0.5*($L38+$M38))/$D$4,IF(AG$36<=$M38,$K38*($M38-AG$36)*($D$4-0.5*(AG$36+$M38))/$D$4,0))","v":-6874972.5000184076},-6874972.5000191806,-6874972.5000199201,-6874972.5000206251,-6874972.5000212938,-6874972.5000219308,-6874972.5000225324,-6874972.5000230987,-6874972.5000236323,-6874972.5000241306,-6874972.5000245953,-6874972.5000250228,-6874972.5000254195,-6874972.5000257809,-6874972.5000261078,-6874972.5000263983,{"$f":"IF(AW$36<=$L38,$K38*($M38-$L38)*($D$4-0.5*($L38+$M38))/$D$4,IF(AW$36<=$M38,$K38*($M38-AW$36)*($D$4-0.5*(AW$36+$M38))/$D$4,0))","v":-6874972.5000266572},-6874972.5000268808,-6874972.5000270698,-6874972.5000272244,-6874972.5000273436,-6874972.5000274302,-6874972.5000274833,-6874972.5000275001,null,null,null,null,null,{"$f":"IF(BJ$36<=$L38,$K38*($M38-$L38)*($D$4-0.5*($L38+$M38))/$D$4,IF(BJ$36<=$M38,$K38*($M38-BJ$36)*($D$4-0.5*(BJ$36+$M38))/$D$4,0))","v":-6430645.4384577945},-3051254.2487487802,null,{"$f":"IF(BM$36<=$L38,$K38*($M38-$L38)*($D$4-0.5*($L38+$M38))/$D$4,IF(BM$36<=$M38,$K38*($M38-BM$36)*($D$4-0.5*(BM$36+$M38))/$D$4,0))","v":-6763892.4824120943},-1636710.6375575881]
[null,"exc. p_2","(mm)",{"$f":"E15","v":15},null,null,null,null,{"$f":"I12","v":"p2"},{"$f":"J12","v":"d"},{"$f":"K12","v":11.55},{"$f":"L12","v":1},{"$f":"M12","v":3},null,null,{"$f":"IF(P$36<=$L39,$K39*($M39-$L39)*($D$4-0.5*($L39+$M39))/$D$4,IF(P$36<=$M39,$K39*($M39-P$36)*($D$4-0.5*(P$36+$M39))/$D$4,0))","v":-4619976.9000000004},-4619976.9000000004,-4619976.9000000004,-4619976.9000000004,-4619976.9000000004,-4619976.9000000004,-4619976.9000000004,-4619976.9000000004,-4619976.9000000004,-4619976.9000000004,-4619976.9000000004,-4619976.9000000004,-4619976.9000000004,-4619976.9000000004,-4619976.9000000004,-4619976.9000000004,-4619976.9000000004,-4619976.9000000004,-4619976.9000000004,-4619976.9000000004,-4619976.9000000004,-4619976.9000000004,-4619976.9000000004,-4619976.9000000004,-4619976.9000000004,-4619976.9000000004,-4619976.9000000004,-4619976.9000000004,-4619976.9000000004,-4619976.9000000004,-4619976.9000000004,-4619976.9000000004,-4619976.9000000004,-4619976.9000000004,-4619976.9000000004,-4619976.9000000004,-4619976.9000000004,-4619976.9000000004,-4619976.9000000004,-4619976.9000000004,-4619976.9000000004,null,null,null,null,null,-4264378.5207613697,0,null,-4619976.9000000004,0]
[null,"exc. p_3","(mm)",{"$f":"F15","v":25},null,null,null,null,{"$f":"I16","v":"p3"},{"$f":"J16","v":"d"},{"$f":"K16","v":14.85},{"$f":"L16","v":2},{"$f":"M16","v":4},null,null,{"$f":"IF(P$36<=$L40,$K40*($M40-$L40)*($D$4-0.5*($L40+$M40))/$D$4,IF(P$36<=$M40,$K40*($M40-P$36)*($D$4-0.5*(P$36+$M40))/$D$4,0))","v":-8909970.2999999989},-8909970.2999999989,-8909970.2999999989,-8909970.2999999989,-8909970.2999999989,-8909970.2999999989,-8909970.2999999989,-8909970.2999999989,-8909970.2999999989,-8909970.2999999989,-8909970.2999999989,-8909970.2999999989,-8909970.2999999989,-8909970.2999999989,-8909970.2999999989,-8909970.2999999989,-8909970.2999999989,-8909970.2999999989,-8909970.2999999989,-8909970.2999999989,-8909970.2999999989,-8909970.2999999989,-8909970.2999999989,-8909970.2999999989,-8909970.2999999989,-8909970.2999999989,-8909970.2999999989,-8909970.2999999989,-8909970.2999999989,-8909970.2999999989,-8909970.2999999989,-8909970.2999999989,-8909970.2999999989,-8909970.2999999989,-8909970.2999999989,-8909970.2999999989,-8909970.2999999989,-8909970.2999999989,-8909970.2999999989,-8909970.2999999989,-8909970.2999999989,null,null,null,null,null,-8909970.2999999989,-1555901.3216217067,null,-8909970.2999999989,0]
[null,"exc. P_1","(mm)",{"$f":"D23","v":10},null,null,null,null,{"$f":"I20","v":"P1"},{"$f":"J20","v":"d"},{"$f":"K20","v":16.5},{"$f":"L20","v":1},{"$f":"M20","v":0},null,null,{"$f":"IF(P$36<=$L41,$K41*($D$4-$L41)/$D$4,0)","v":-1649983.5},{"$f":"IF(Q$36<=$L41,$K41*($D$4-$L41)/$D$4,0)","v":-1649983.5},-1649983.5,-1649983.5,-1649983.5,-1649983.5,-1649983.5,-1649983.5,-1649983.5,-1649983.5,-1649983.5,-1649983.5,-1649983.5,-1649983.5,-1649983.5,-1649983.5,-1649983.5,{"$f":"IF(AG$36<=$L41,$K41*($D$4-$L41)/$D$4,0)","v":-1649983.5},-1649983.5,-1649983.5,-1649983.5,-1649983.5,-1649983.5,-1649983.5,-1649983.5,-1649983.5,-1649983.5,-1649983.5,-1649983.5,-1649983.5,-1649983.5,-1649983.5,-1649983.5,{"$f":"IF(AW$36<=$L41,$K41*($D$4-$L41)/$D$4,0)","v":-1649983.5},-1649983.5,-1649983.5,-1649983.5,-1649983.5,-1649983.5,-1649983.5,-1649983.5,null,null,null,null,null,{"$f":"IF(BJ$36<=$L41,$K41*($D$4-$L41)/$D$4,0)","v":0},0,null,{"$f":"IF(BM$36<=$L41,$K41*($D$4-$L41)/$D$4,0)","v":-1649983.5},0]
[null,"exc. P_2","(mm)",{"$f":"E23","v":15},null,null,null,null,{"$f":"I24","v":"P2"},{"$f":"J24","v":"d"},{"$f":"K24","v":13.200000000000001},{"$f":"L24","v":1.5},{"$f":"M24","v":0},null,null,{"$f":"IF(P$36<=$L42,$K42*($D$4-$L42)/$D$4,0)","v":-1979986.7999999998},-1979986.7999999998,-1979986.7999999998,-1979986.7999999998,-1979986.7999999998,-1979986.7999999998,-1979986.7999999998,-1979986.7999999998,-1979986.7999999998,-1979986.7999999998,-1979986.7999999998,-1979986.7999999998,-1979986.7999999998,-1979986.7999999998,-1979986.7999999998,-1979986.7999999998,-1979986.7999999998,-1979986.7999999998,-1979986.7999999998,-1979986.7999999998,-1979986.7999999998,-1979986.7999999998,-1979986.7999999998,-1979986.7999999998,-1979986.7999999998,-1979986.7999999998,-1979986.7999999998,-1979986.7999999998,-1979986.7999999998,-1979986.7999999998,-1979986.7999999998,-1979986.7999999998,-1979986.7999999998,-1979986.7999999998,-1979986.7999999998,-1979986.7999999998,-1979986.7999999998,-1979986.7999999998,-1979986.7999999998,-1979986.7999999998,-1979986.7999999998,null,null,null,null,null,-1979986.7999999998,0,null,-1979986.7999999998,0]
[null,"exc. P_3","(mm)",{"$f":"F23","v":20},null,null,null,null,{"$f":"I28","v":"P3"},{"$f":"J28","v":"d"},{"$f":"K28","v":26.950000000000003},{"$f":"L28","v":2},{"$f":"M28","v":0},null,null,{"$f":"IF(P$36<=$L43,$K43*($D$4-$L43)/$D$4,0)","v":-5389973.0499999998},-5389973.0499999998,-5389973.0499999998,-5389973.0499999998,-5389973.0499999998,-5389973.0499999998,-5389973.0499999998,-5389973.0499999998,-5389973.0499999998,-5389973.0499999998,-5389973.0499999998,-5389973.0499999998,-5389973.0499999998,-5389973.0499999998,-5389973.0499999998,-5389973.0499999998,-5389973.0499999998,-5389973.0499999998,-5389973.0499999998,-5389973.0499999998,-5389973.0499999998,-5389973.0499999998,-5389973.0499999998,-5389973.0499999998,-5389973.0499999998,-5389973.0499999998,-5389973.0499999998,-5389973.0499999998,-5389973.0499999998,-5389973.0499999998,-5389973.0499999998,-5389973.0499999998,-5389973.0499999998,-5389973.0499999998,-5389973.0499999998,-5389973.0499999998,-5389973.0499999998,-5389973.0499999998,-5389973.0499999998,-5389973.0499999998,-5389973.0499999998,null,null,null,null,null,-5389973.0499999998,0,null,-5389973.0499999998,0]
[null,null,null,null,null,null,null,null,"Højresidig forskydning"]
[null,null,null,null,null,null,null,null,{"$f":"I38","v":"p1"},"d",5.5,0,5,null,null,{"$f":"IF(P$36<$L45,0,IF(P$36<$M45,$K45*(P$36-$L45)*0.5*($L45+P$36)/$D$4,$K45*($M45-$L45)*0.5*($L45+$M45)/$D$4))","v":0},{"$f":"IF(Q$36<$L45,0,IF(Q$36<$M45,$K45*(Q$36-$L45)*0.5*($L45+Q$36)/$D$4,$K45*($M45-$L45)*0.5*($L45+$M45)/$D$4))","v":1.7187500000000004E-8},6.8750000000000017E-8,1.5468750000000003E-7,2.7500000000000007E-7,4.2968750000000002E-7,6.1875000000000011E-7,8.4218750000000014E-7,1.1000000000000003E-6,1.3921875000000002E-6,1.7187500000000001E-6,2.0796874999999997E-6,2.4750000000000004E-6,2.9046875000000003E-6,3.3687500000000006E-6,3.8671875000000008E-6,4.4000000000000011E-6,{"$f":"IF(AG$36<$L45,0,IF(AG$36<$M45,$K45*(AG$36-$L45)*0.5*($L45+AG$36)/$D$4,$K45*($M45-$L45)*0.5*($L45+$M45)/$D$4))","v":4.9671874999999996E-6},5.5687500000000007E-6,6.2046875E-6,6.8750000000000002E-6,7.5796875000000021E-6,8.3187499999999989E-6,9.0921874999999999E-6,9.9000000000000018E-6,1.0742187499999999E-5,1.1618750000000001E-5,1.25296875E-5,1.3475000000000002E-5,1.4454687499999998E-5,1.5468750000000003E-5,1.6517187500000001E-5,1.7600000000000004E-5,{"$f":"IF(AW$36<$L45,0,IF(AW$36<$M45,$K45*(AW$36-$L45)*0.5*($L45+AW$36)/$D$4,$K45*($M45-$L45)*0.5*($L45+$M45)/$D$4))","v":1.8717187500000003E-5},1.9868749999999998E-5,2.1054687500000003E-5,2.2275000000000003E-5,2.3529687500000002E-5,2.481875E-5,2.6142187500000008E-5,2.7500000000000001E-5,null,null,null,null,null,{"$f":"IF(BJ$36<$L45,0,IF(BJ$36<$M45,$K45*(BJ$36-$L45)*0.5*($L45+BJ$36)/$D$4,$K45*($M45-$L45)*0.5*($L45+$M45)/$D$4))","v":444334.05273279035},3823738.7600606335,null,{"$f":"IF(BM$36<$L45,0,IF(BM$36<$M45,$K45*(BM$36-$L45)*0.5*($L45+BM$36)/$D$4,$K45*($M45-$L45)*0.5*($L45+$M45)/$D$4))","v":111083.51318319759},5238285.8668471193]
[null,null,null,null,null,null,null,null,"p2","d",11.55,1,3,null,null,{"$f":"IF(P$36<$L46,0,IF(P$36<$M46,$K46*(P$36-$L46)*0.5*($L46+P$36)/$D$4,$K46*($M46-$L46)*0.5*($L46+$M46)/$D$4))","v":0},0,0,0,0,0,0,0,0,0,0,0,0,0,0,0,0,0,0,0,0,0,0,0,0,0,0,0,0,0,0,0,0,0,0,0,0,0,0,0,0,null,null,null,null,null,355601.51073885988,4620000,null,0,4620000]
[null,null,null,null,null,null,null,null,"p3","d",14.85,2,4,null,null,{"$f":"IF(P$36<$L47,0,IF(P$36<$M47,$K47*(P$36-$L47)*0.5*($L47+P$36)/$D$4,$K47*($M47-$L47)*0.5*($L47+$M47)/$D$4))","v":0},0,0,0,0,0,0,0,0,0,0,0,0,0,0,0,0,0,0,0,0,0,0,0,0,0,0,0,0,0,0,0,0,0,0,0,0,0,0,0,0,null,null,null,null,null,0,7354094.6521637123,null,0,8909999.9999999981]
[null,null,null,null,null,null,null,null,"P1","d",16.5,1,0,null,null,{"$f":"IF(P$36<$L48,0,$K48*$L48/$D$4)","v":0},{"$f":"IF(Q$36<$L48,0,$K48*$L48/$D$4)","v":0},0,0,0,0,0,0,0,0,0,0,0,0,0,0,0,{"$f":"IF(AG$36<$L48,0,$K48*$L48/$D$4)","v":0},0,0,0,0,0,0,0,0,0,0,0,0,0,0,0,{"$f":"IF(AW$36<$L48,0,$K48*$L48/$D$4)","v":0},0,0,0,0,0,0,0,null,null,null,null,null,{"$f":"IF(BJ$36<$L48,0,$K48*$L48/$D$4)","v":1649999.9999999998},1649999.9999999998,null,{"$f":"IF(BM$36<$L48,0,$K48*$L48/$D$4)","v":0},1649999.9999999998]
[null,null,null,null,null,null,null,null,{"$f":"I42","v":"P2"},"d",13.200000000000001,1.5,0,null,null,{"$f":"IF(P$36<$L49,0,$K49*$L49/$D$4)","v":0},0,0,0,0,0,0,0,0,0,0,0,0,0,0,0,0,0,0,0,0,0,0,0,0,0,0,0,0,0,0,0,0,0,0,0,0,0,0,0,0,null,null,null,null,null,0,1980000,null,0,1980000]
[null,null,null,null,null,null,null,null,"P3","d",26.950000000000003,2,0,null,null,{"$f":"IF(P$36<$L50,0,$K50*$L50/$D$4)","v":0},0,0,0,0,0,0,0,0,0,0,0,0,0,0,0,0,0,0,0,0,0,0,0,0,0,0,0,0,0,0,0,0,0,0,0,0,0,0,0,0,null,null,null,null,null,0,5390000,null,0,5390000]
[]
[null,null,null,null,null,null,null,null,"V_d - venstre",null,null,null,null,null,null,{"$f":"SUM(P38:P43)","v":-29424863.049999997},{"$f":"SUM(Q38:Q43)","v":-29424863.05000136},-29424863.050002679,-29424863.050003968,-29424863.050005227,-29424863.050006442,-29424863.050007634,-29424863.050008781,-29424863.050009899,-29424863.050010987,-29424863.05001203,-29424863.050013043,-29424863.050014026,-29424863.050014973,-29424863.050015882,-29424863.050016757,-29424863.050017603,-29424863.050018407,-29424863.050019182,-29424863.05001992,-29424863.050020628,-29424863.050021295,-29424863.050021932,-29424863.050022535,-29424863.050023101,-29424863.05002363,-29424863.050024129,-29424863.050024599,-29424863.050025024,-29424863.050025418,-29424863.050025783,-29424863.050026111,-29424863.050026402,-29424863.050026655,-29424863.050026879,-29424863.050027072,-29424863.050027225,-29424863.050027344,-29424863.05002743,-29424863.050027482,-29424863.050027501,null,null,null,null,null,{"$f":"SUM(BJ38:BJ43)","v":-26974954.109219164},{"$f":"SUM(BK38:BK43)","v":-4607155.5703704869},null,{"$f":"SUM(BM38:BM43)","v":-29313783.032412097},{"$f":"SUM(BN38:BN43)","v":-1636710.6375575881}]
[null,null,null,null,null,null,null,null,"V_d - højre",null,null,null,null,null,null,{"$f":"SUM(P45:P50)","v":0},{"$f":"SUM(Q45:Q50)","v":1.7187500000000004E-8},6.8750000000000017E-8,1.5468750000000003E-7,2.7500000000000007E-7,4.2968750000000002E-7,6.1875000000000011E-7,8.4218750000000014E-7,1.1000000000000003E-6,1.3921875000000002E-6,1.7187500000000001E-6,2.0796874999999997E-6,2.4750000000000004E-6,2.9046875000000003E-6,3.3687500000000006E-6,3.8671875000000008E-6,4.4000000000000011E-6,4.9671874999999996E-6,5.5687500000000007E-6,6.2046875E-6,6.8750000000000002E-6,7.5796875000000021E-6,8.3187499999999989E-6,9.0921874999999999E-6,9.9000000000000018E-6,1.0742187499999999E-5,1.1618750000000001E-5,1.25296875E-5,1.3475000000000002E-5,1.4454687499999998E-5,1.5468750000000003E-5,1.6517187500000001E-5,1.7600000000000004E-5,1.8717187500000003E-5,1.9868749999999998E-5,2.1054687500000003E-5,2.2275000000000003E-5,2.3529687500000002E-5,2.481875E-5,2.6142187500000008E-5,2.7500000000000001E-5,null,null,null,null,null,{"$f":"SUM(BJ45:BJ50)","v":2449935.5634716498},{"$f":"SUM(BK45:BK50)","v":24817833.412224345},null,{"$f":"SUM(BM45:BM50)","v":111083.51318319759},{"$f":"SUM(BN45:BN50)","v":27788285.86684712}]
[]
[null,null,null,null,null,null,null,null,"FORSKYDNING",null,null,null,null,null,null,{"$f":"P35","v":0},{"$f":"Q35","v":1},2,3,4,5,6,7,8,9,10,11,12,13,14,15,16,17,18,19,20,21,22,23,24,25,26,27,28,29,30,31,32,33,34,35,36,37,38,39,40,{"$f":"BF55","v":10.169004487773545},{"$f":"40*BF36/Kold!$M$8","v":10.169004487773545},{"$f":"40*BG36/Kold!$M$8","v":29.830995512226458},{"$f":"BG55","v":29.830995512226458}]
[null,null,null,null,null,null,null,null,null,null,"fyd","d","a","hicot"," :             ",{"$f":"MAX(P53,P52)","v":0},{"$f":"MAX(Q53,Q52)","v":1.7187500000000004E-8},6.8750000000000017E-8,1.5468750000000003E-7,2.7500000000000007E-7,4.2968750000000002E-7,6.1875000000000011E-7,8.4218750000000014E-7,1.1000000000000003E-6,1.3921875000000002E-6,1.7187500000000001E-6,2.0796874999999997E-6,2.4750000000000004E-6,2.9046875000000003E-6,3.3687500000000006E-6,3.8671875000000008E-6,4.4000000000000011E-6,4.9671874999999996E-6,5.5687500000000007E-6,6.2046875E-6,6.8750000000000002E-6,7.5796875000000021E-6,8.3187499999999989E-6,9.0921874999999999E-6,9.9000000000000018E-6,1.0742187499999999E-5,1.1618750000000001E-5,1.25296875E-5,1.3475000000000002E-5,1.4454687499999998E-5,1.5468750000000003E-5,1.6517187500000001E-5,1.7600000000000004E-5,1.8717187500000003E-5,1.9868749999999998E-5,2.1054687500000003E-5,2.2275000000000003E-5,2.3529687500000002E-5,2.481875E-5,2.6142187500000008E-5,2.7500000000000001E-5]
[null,null,null,null,null,null,null,null,null,null,{"$f":"550/1.3","v":423.07692307692304},12,150,900," :             ",{"$f":"Kold!$P$31","v":144.00668067440381},{"$f":"Kold!$P$31","v":144.00668067440381},{"$f":"Kold!$P$31","v":144.00668067440381},{"$f":"Kold!$P$31","v":144.00668067440381},{"$f":"Kold!$P$31","v":144.00668067440381},{"$f":"Kold!$P$31","v":144.00668067440381},{"$f":"Kold!$P$31","v":144.00668067440381},{"$f":"Kold!$P$31","v":144.00668067440381},{"$f":"Kold!$P$31","v":144.00668067440381},{"$f":"Kold!$P$31","v":144.00668067440381},{"$f":"Kold!$P$31","v":144.00668067440381},{"$f":"Kold!$P$31","v":144.00668067440381},{"$f":"Kold!$P$31","v":144.00668067440381},{"$f":"Kold!$P$31","v":144.00668067440381},{"$f":"Kold!$P$31","v":144.00668067440381},{"$f":"Kold!$P$31","v":144.00668067440381},{"$f":"Kold!$P$31","v":144.00668067440381},{"$f":"Kold!$P$31","v":144.00668067440381},{"$f":"Kold!$P$31","v":144.00668067440381},{"$f":"Kold!$P$31","v":144.00668067440381},{"$f":"Kold!$P$31","v":144.00668067440381},{"$f":"Kold!$P$31","v":144.00668067440381},{"$f":"Kold!$P$31","v":144.00668067440381},{"$f":"Kold!$P$31","v":144.00668067440381},{"$f":"Kold!$P$31","v":144.00668067440381},{"$f":"Kold!$P$31","v":144.00668067440381},{"$f":"Kold!$P$31","v":144.00668067440381},{"$f":"Kold!$P$31","v":144.00668067440381},{"$f":"Kold!$P$31","v":144.00668067440381},{"$f":"Kold!$P$31","v":144.00668067440381},{"$f":"Kold!$P$31","v":144.00668067440381},{"$f":"Kold!$P$31","v":144.00668067440381},{"$f":"Kold!$P$31","v":144.00668067440381},{"$f":"Kold!$P$31","v":144.00668067440381},{"$f":"Kold!$P$31","v":144.00668067440381},{"$f":"Kold!$P$31","v":144.00668067440381},{"$f":"Kold!$P$31","v":144.00668067440381},{"$f":"Kold!$P$31","v":144.00668067440381},{"$f":"Kold!$P$31","v":144.00668067440381},{"$f":"Kold!$P$31","v":144.00668067440381},{"$f":"Kold!$P$31","v":144.00668067440381}]
[null,null,null,null,null,null,null,null,null,null,{"$f":"550/1.3","v":423.07692307692304},12,100,900," :             ",{"$f":"Kold!$P$32","v":144.00668067440381},{"$f":"Kold!$P$32","v":144.00668067440381},{"$f":"Kold!$P$32","v":144.00668067440381},{"$f":"Kold!$P$32","v":144.00668067440381},{"$f":"Kold!$P$32","v":144.00668067440381},{"$f":"Kold!$P$32","v":144.00668067440381},{"$f":"Kold!$P$32","v":144.00668067440381},{"$f":"Kold!$P$32","v":144.00668067440381},{"$f":"Kold!$P$32","v":144.00668067440381},{"$f":"Kold!$P$32","v":144.00668067440381},{"$f":"Kold!$P$32","v":144.00668067440381},{"$f":"Kold!$P$32","v":144.00668067440381},{"$f":"Kold!$P$32","v":144.00668067440381},{"$f":"Kold!$P$32","v":144.00668067440381},{"$f":"Kold!$P$32","v":144.00668067440381},{"$f":"Kold!$P$32","v":144.00668067440381},{"$f":"Kold!$P$32","v":144.00668067440381},{"$f":"Kold!$P$32","v":144.00668067440381},{"$f":"Kold!$P$32","v":144.00668067440381},{"$f":"Kold!$P$32","v":144.00668067440381},{"$f":"Kold!$P$32","v":144.00668067440381},{"$f":"Kold!$P$32","v":144.00668067440381},{"$f":"Kold!$P$32","v":144.00668067440381},{"$f":"Kold!$P$32","v":144.00668067440381},{"$f":"Kold!$P$32","v":144.00668067440381},{"$f":"Kold!$P$32","v":144.00668067440381},{"$f":"Kold!$P$32","v":144.00668067440381},{"$f":"Kold!$P$32","v":144.00668067440381},{"$f":"Kold!$P$32","v":144.00668067440381},{"$f":"Kold!$P$32","v":144.00668067440381},{"$f":"Kold!$P$32","v":144.00668067440381},{"$f":"Kold!$P$32","v":144.00668067440381},{"$f":"Kold!$P$32","v":144.00668067440381},{"$f":"Kold!$P$32","v":144.00668067440381},{"$f":"Kold!$P$32","v":144.00668067440381},{"$f":"Kold!$P$32","v":144.00668067440381},{"$f":"Kold!$P$32","v":144.00668067440381},{"$f":"Kold!$P$32","v":144.00668067440381},{"$f":"Kold!$P$32","v":144.00668067440381},{"$f":"Kold!$P$32","v":144.00668067440381},{"$f":"Kold!$P$32","v":144.00668067440381}]
[null,null,null,null,null,null,null,null,null,null,{"$f":"550/1.3","v":423.07692307692304},12,65,900," :             ",null,null,null,null,null,null,null,null,null,null,null,null,null,null,null,null,null,null,null,null,null,null,null,null,null,null,null,null,null,null,null,null,null,null,null,null,null,null,null,null,null,{"$f":"1.1*MAX(P56:BD56)","v":3.0250000000000003E-5},0,0,{"$f":"1.1*MAX(P56:BD56)","v":3.0250000000000003E-5}]
[null,null,null,null,null,null,null,null,null,null,null,null,null,null,null,null,null,null,null,0,null,null,null,0,null,null,null,0,null,null,null,0,null,null,null,0,null,null,null,0,null,null,null,0,null,null,null,0,null,null,null,0]
[null,null,null,null,null,null,null,null,"EXCENTRICITET",null,null,null,null,null,null,{"$f":"IF(P52>=P53,IF(P52=0,0,SUMPRODUCT($D$38:$D$43,P38:P43)/P52),IF(P53=0,0,SUMPRODUCT($D$38:$D$43,P45:P50)/P53))","v":0},{"$f":"IF(Q52>=Q53,IF(Q52=0,0,SUMPRODUCT($D$38:$D$43,Q38:Q43)/Q52),IF(Q53=0,0,SUMPRODUCT($D$38:$D$43,Q45:Q50)/Q53))","v":25},25,25,25,25,25,25,25,25,25,25,25,25,25,25,25,25,25,25,25,25,25,25,25,25,25,25,25,24.999999999999996,25,25,25,25,25,25,25,25,25,25,25]
[]
[]
[]
[null,null,null,null,null,null,null,null,null,null,null,null,null,null,null,0,1,2,3,4,5,6,7,8,9,10,11,12,13,14,15,16,17,18,19,20,21,22,23,24,25,26,27,28,29,30,31,32,33,34,35,36,37,38,39,40]
[null,null,null,null,null,null,null,null,"UDBØJNINGER",null,null,null,null,null,null,0,{"$f":"Q65*($BD$4-$P$4)/40","v":2.5000000000000004E-7},5.0000000000000008E-7,7.5000000000000012E-7,1.0000000000000002E-6,1.2500000000000001E-6,1.5000000000000002E-6,1.7500000000000002E-6,2.0000000000000003E-6,2.2500000000000001E-6,2.5000000000000002E-6,2.7499999999999999E-6,3.0000000000000005E-6,3.2500000000000002E-6,3.5000000000000004E-6,3.7500000000000005E-6,4.0000000000000007E-6,4.25E-6,4.5000000000000001E-6,4.7500000000000003E-6,5.0000000000000004E-6,5.2500000000000006E-6,5.4999999999999999E-6,5.75E-6,6.000000000000001E-6,6.2500000000000003E-6,6.5000000000000004E-6,6.7499999999999997E-6,7.0000000000000007E-6,7.25E-6,7.500000000000001E-6,7.7500000000000003E-6,8.0000000000000013E-6,8.2500000000000006E-6,8.4999999999999999E-6,8.7500000000000009E-6,9.0000000000000002E-6,9.2500000000000012E-6,9.5000000000000005E-6,9.7500000000000015E-6,{"$f":"$D$4","v":1.0000000000000001E-5}]
[]
[null,null,null,null,null,null,null,null,null,"L",null,null,null,null,"a1",0,{"$f":"P68+(0.5*(Q31+P31)/$D$5)*(Q66-P66)","v":-7.4950555828728898E-12},{"$f":"Q68+(0.5*(R31+Q31)/$D$5)*(R66-Q66)","v":-2.9980222331492018E-11},-6.7455500245858298E-11,-1.1992088932597267E-10,-1.8737638957183601E-10,-2.6982200098344932E-10,-3.672577235608134E-10,-4.7968355730392937E-10,-6.0709950221279773E-10,-7.4950555828741994E-10,-9.0690172552779642E-10,-1.0792880039339288E-9,-1.266664393505817E-9,-1.4690308942434629E-9,-1.6863875061468668E-9,-1.9187342292160301E-9,-2.1660710634509523E-9,-2.4283980088516364E-9,-2.7057150654180826E-9,-2.9980222331502915E-9,-3.3053195120482642E-9,-3.6276069021120004E-9,-3.9648844033415034E-9,-4.317152015736774E-9,-4.6844097392978097E-9,-5.0666575740246147E-9,-5.4638955199171872E-9,-5.8761235769755332E-9,-6.3033417451996476E-9,-6.745550024589537E-9,-7.2027484151451965E-9,-7.6749369168666319E-9,-8.1621155297538398E-9,-8.6642842538068236E-9,-9.1814430890255866E-9,-9.7135920354101238E-9,-1.0260731092960444E-8,-1.0822860261676539E-8,-1.1399979541558419E-8,{"$f":"BC68+(0.5*(BD31+BC31)/$D$5)*(BD66-BC66)","v":-1.1992088932606076E-8}]
[null,null,null,null,null,null,null,null,null,null,null,null,null,null,"u1",0,{"$f":"P69+P68*(Q66-P66)+0.5*(0.5*(Q31+P31)/$D$5)*(Q66-P66)^2","v":-9.3688194785911134E-19},-5.6212916871547258E-18,-1.7800757009323519E-17,-4.1222805705802395E-17,-7.963496556802847E-17,-1.3678476438743916E-16,-2.1641972995547198E-16,-3.2228739006356487E-16,-4.5813527250315559E-16,-6.2771090506568286E-16,-8.3476181554258469E-16,-1.0830355317253011E-15,-1.376279581405269E-15,-1.7182414923739292E-15,-2.1126687924227207E-15,-2.5633090093430832E-15,-3.0739096709264544E-15,-3.6482183049642783E-15,-4.2899824392479938E-15,-5.002949601569041E-15,-5.7908673197188609E-15,-6.657483121488891E-15,-7.6065445346705795E-15,-8.6417990870553679E-15,-9.7669943064346869E-15,-1.098587772059999E-14,-1.2302196857342712E-14,-1.3719699244454307E-14,-1.5242132409726198E-14,-1.6873243880949853E-14,-1.861678118591669E-14,-2.0476491852418178E-14,-2.2456123408245733E-14,-2.4559423381190809E-14,-2.6790139299044868E-14,-2.9152018689599324E-14,-3.1648809080645657E-14,-3.4284257999975271E-14,-3.7062112975379651E-14,-3.99861215346502E-14]
[null,null,null,null,null,null,null,null,null,null,null,null,null,null,"u2",0,{"$f":"-(Q69-Q65*$BD$69/40)","v":-9.9871615641839605E-16},{"$f":"-(R69-R65*$BD$69/40)","v":-1.9936847850453556E-15},-2.9811583580894412E-15,-3.957389347759218E-15,-4.9186302262632463E-15,-5.8611334658100907E-15,-6.7811515386083128E-15,-7.6749369168664755E-15,-8.5387420727931403E-15,-9.3688194785968673E-15,-1.016142160648622E-14,-1.0912800928669758E-14,-1.1619209917356045E-14,-1.227690104475364E-14,-1.2882126783071103E-14,-1.3431139604516998E-14,-1.3920191981299881E-14,-1.4345536385628313E-14,-1.4703425289710851E-14,-1.4990111165756059E-14,-1.5201846485972494E-14,-1.5334883722568718E-14,-1.5385475347753286E-14,-1.534987383373475E-14,-1.5224331652721688E-14,-1.5005101276922637E-14,-1.4688435178546173E-14,-1.4270585829800831E-14,-1.3747805702895197E-14,-1.3116347270037794E-14,-1.2372463003437215E-14,-1.1512405375301985E-14,-1.0532426857840681E-14,-9.4287799232618635E-15,-8.1977170437740557E-15,-6.8354906915858582E-15,-5.3383533389057764E-15,-3.70255745794242E-15,-1.9243555209042914E-15,0]
[]
[null,null,null,null,null,null,null,null,null,"K",null,null,null,null,"a1",0,{"$f":"P72+(0.5*(Q32-Q31+P32-P31)/$D$6)*(Q66-P66)","v":-1.0102677887719368E-12},-4.0410711550877473E-12,-9.0924100989474334E-12,-1.6164284620350993E-11,-2.5256694719298428E-11,-3.6369640395789753E-11,-4.9503121649824942E-11,-6.4657138481404009E-11,-8.1831690890526928E-11,-1.0102677887719376E-10,-1.2224240244140445E-10,-1.4547856158315909E-10,-1.7073525630245753E-10,-1.9801248659929987E-10,-2.2731025247368609E-10,-2.5862855392561619E-10,-2.9196739095509001E-10,-3.2732676356210781E-10,-3.6470667174666954E-10,-4.0410711550877515E-10,-4.4552809484842464E-10,-4.8896960976561779E-10,-5.3443166026035503E-10,-5.8191424633263636E-10,-6.3141736798246125E-10,-6.8294102520983022E-10,-7.3648521801474287E-10,-7.920499463971997E-10,-8.496352103572E-10,-9.0924100989474469E-10,-9.7086734500983274E-10,-1.034514215702465E-9,-1.1001816219726407E-9,-1.1678695638203605E-9,-1.2375780412456245E-9,-1.3093070542484319E-9,-1.3830566028287837E-9,-1.4588266869866788E-9,-1.5366173067221184E-9,-1.6164284620351012E-9]
[null,null,null,null,null,null,null,null,null,null,null,null,null,null,"u1",0,{"$f":"P73+P72*(Q66-P66)+0.5*(0.5*(Q32-Q31+P32-P31)/$D$6)*(Q66-P66)^2","v":-1.2628347359649212E-19},-7.5770084157895276E-19,-2.3993859983333503E-18,-5.5564728382456535E-18,-1.073409525570183E-17,-1.8437387145087857E-17,-2.917148240078969E-17,-4.3441514917193322E-17,-6.1752618588684677E-17,-8.4609927309649771E-17,-1.1251857497447452E-16,-1.4598369547754504E-16,-1.8551042271324708E-16,-2.3160389057596682E-16,-2.8476923296009014E-16,-3.4551158376000298E-16,-4.1433607687009108E-16,-4.9174784618474084E-16,-5.7825202559833809E-16,-6.743537490052688E-16,-7.8055815029991885E-16,-8.973703633766739E-16,-1.0252955221299206E-15,-1.1648387604540451E-15,-1.3165052122434319E-15,-1.4808000113924684E-15,-1.6582282917955396E-15,-1.8492951873470331E-15,-2.0545058319413325E-15,-2.2743653594728263E-15,-2.509378903835898E-15,-2.7600515989249361E-15,-3.0268885786343236E-15,-3.3103949768584482E-15,-3.6110759274916979E-15,-3.9294365644284537E-15,-4.2659820215631077E-15,-4.6212174327900396E-15,-4.9956479320036406E-15,-5.3897786530982915E-15]
[null,null,null,null,null,null,null,null,null,null,null,null,null,null,"u2",0,{"$f":"-(Q73-Q65*$BD$73/40)+Q70","v":-1.1333343392722569E-15},{"$f":"-(R73-R65*$BD$73/40)+R70","v":-2.2624160168586913E-15},-3.3829923710734797E-15,-4.4908107402308017E-15,-5.581618462644831E-15,-6.6511628766297465E-15,-7.6951913204997237E-15,-8.7094511325689407E-15,-9.6896896511515712E-15,-1.063165421456179E-14,-1.1531092161113775E-14,-1.23837508291217E-14,-1.3185377556899743E-14,-1.3931719682762075E-14,-1.4618524545022872E-14,-1.5241539481996311E-14,-1.5796511831996564E-14,-1.6279188933337803E-14,-1.66853181243342E-14,-1.7010646743299936E-14,-1.7250922128549179E-14,-1.7401891618396104E-14,-1.7459302551154883E-14,-1.741890226513968E-14,-1.727643809866469E-14,-1.7027657390044058E-14,-1.6668307477591982E-14,-1.6194135699622601E-14,-1.5600889394450126E-14,-1.4884315900388686E-14,-1.4040162555752494E-14,-1.3064176698855682E-14,-1.1952105668012448E-14,-1.0699696801536963E-14,-9.3026974377433616E-15,-7.7568549149458673E-15,-6.0579165714585883E-15,-4.2016297455957577E-15,-2.1837417756714854E-15,0]
[]
[]
[]
[null,null,"ϒg",{"$f":"Kold!H22","v":1.1000000000000001},null,null,null,null,"Bøjlekapacitet"]
[null,null,"ϒq",{"$f":"Kold!I22","v":0},null,null,null,null,null,null,{"$f":"2*MAX(Kold!P31,Kold!P32)*Kold2!D4/(Kold2!D4-Kold!P15*Kold!K34/1000)^2","v":1.7825534661587746E-3},0,{"$f":"Kold!M8","v":5},null,null,{"$f":"IF(P$36<=$L79,$K79*($M79-$L79)*($D$4-0.5*($L79+$M79))/$D$4,IF(P$36<=$M79,$K79*($M79-P$36)*($D$4-0.5*(P$36+$M79))/$D$4,0))","v":-2228.1829199311373},{"$f":"IF(Q$36<=$L79,$K79*($M79-$L79)*($D$4-0.5*($L79+$M79))/$D$4,IF(Q$36<=$M79,$K79*($M79-Q$36)*($D$4-0.5*(Q$36+$M79))/$D$4,0))","v":-2228.1829199315775},{"$f":"IF(R$36<=$L79,$K79*($M79-$L79)*($D$4-0.5*($L79+$M79))/$D$4,IF(R$36<=$M79,$K79*($M79-R$36)*($D$4-0.5*(R$36+$M79))/$D$4,0))","v":-2228.1829199320064},-2228.1829199324243,-2228.1829199328308,-2228.182919933226,-2228.1829199336103,-2228.1829199339841,-2228.1829199343456,-2228.1829199346967,-2228.1829199350368,-2228.1829199353651,-2228.1829199356825,-2228.1829199359895,-2228.1829199362842,-2228.1829199365684,-2228.1829199368417,-2228.1829199371032,-2228.1829199373537,-2228.1829199375934,-2228.1829199378217,-2228.182919938039,-2228.182919938245,-2228.1829199384397,-2228.1829199386239,-2228.1829199387967,-2228.1829199389585,-2228.1829199391086,-2228.1829199392478,-2228.1829199393765,-2228.1829199394929,-2228.1829199395988,-2228.1829199396939,-2228.1829199397771,-2228.1829199398494,-2228.1829199399108,-2228.1829199399608,-2228.1829199399999,-2228.1829199400277,-2228.182919940044,-2228.1829199400499]
[null,null,"ψ1",{"$f":"Kold!J22","v":0},null,null,null,null,null,null,{"$f":"2*MAX(Kold!P31,Kold!P32)*Kold2!D4/(Kold2!D4-Kold!P15*Kold!K34/1000)^2","v":1.7825534661587746E-3},0,{"$f":"Kold!M8","v":5},null,null,{"$f":"IF(P$36<$L80,0,IF(P$36<$M80,$K80*(P$36-$L80)*0.5*($L80+P$36)/$D$4,$K80*($M80-$L80)*0.5*($L80+$M80)/$D$4))","v":0},{"$f":"IF(Q$36<$L80,0,IF(Q$36<$M80,$K80*(Q$36-$L80)*0.5*($L80+Q$36)/$D$4,$K80*($M80-$L80)*0.5*($L80+$M80)/$D$4))","v":5.5704795817461729E-12},{"$f":"IF(R$36<$L80,0,IF(R$36<$M80,$K80*(R$36-$L80)*0.5*($L80+R$36)/$D$4,$K80*($M80-$L80)*0.5*($L80+$M80)/$D$4))","v":2.2281918326984692E-11},5.0134316235715548E-11,8.9127673307938767E-11,1.3926198954365427E-10,2.0053726494286219E-10,2.7295349950556241E-10,3.5651069323175507E-10,4.5120884612143979E-10,5.5704795817461708E-10,6.7402802939128659E-10,8.0214905977144877E-10,9.4141104931510302E-10,1.0918139980222496E-9,1.2533579058928887E-9,1.4260427729270203E-9,1.6098685991246431E-9,1.8048353844857591E-9,2.0109431290103675E-9,2.2281918326984683E-9,2.4565814955500614E-9,2.6961121175651463E-9,2.946783698743724E-9,3.2085962390857951E-9,3.4815497385913572E-9,3.7656441972604121E-9,4.0608796150929579E-9,4.3672559920889985E-9,4.6847733282485297E-9,5.0134316235715549E-9,5.3532308780580706E-9,5.7041710917080811E-9,6.0662522645215805E-9,6.4394743964985722E-9,6.8238374876390603E-9,7.2193415379430366E-9,7.6259865474105092E-9,8.04377251604147E-9,8.472699443835928E-9,8.9127673307938733E-9]
[null,null,"ψ2",{"$f":"Kold!K22","v":0},null,null,null,null,{"$f":"MAX(Q81:BC81)","v":0},null,null,null,null,null,null,null,{"$f":"IF(Q56>MAX(Q79:Q80,Kold!$P$32,Kold!$P$31),1,0)","v":0},{"$f":"IF(R56>MAX(R79:R80,Kold!$P$32,Kold!$P$31),1,0)","v":0},{"$f":"IF(S56>MAX(S79:S80,Kold!$P$32,Kold!$P$31),1,0)","v":0},{"$f":"IF(T56>MAX(T79:T80,Kold!$P$32,Kold!$P$31),1,0)","v":0},{"$f":"IF(U56>MAX(U79:U80,Kold!$P$32,Kold!$P$31),1,0)","v":0},{"$f":"IF(V56>MAX(V79:V80,Kold!$P$32,Kold!$P$31),1,0)","v":0},{"$f":"IF(W56>MAX(W79:W80,Kold!$P$32,Kold!$P$31),1,0)","v":0},{"$f":"IF(X56>MAX(X79:X80,Kold!$P$32,Kold!$P$31),1,0)","v":0},{"$f":"IF(Y56>MAX(Y79:Y80,Kold!$P$32,Kold!$P$31),1,0)","v":0},{"$f":"IF(Z56>MAX(Z79:Z80,Kold!$P$32,Kold!$P$31),1,0)","v":0},{"$f":"IF(AA56>MAX(AA79:AA80,Kold!$P$32,Kold!$P$31),1,0)","v":0},{"$f":"IF(AB56>MAX(AB79:AB80,Kold!$P$32,Kold!$P$31),1,0)","v":0},{"$f":"IF(AC56>MAX(AC79:AC80,Kold!$P$32,Kold!$P$31),1,0)","v":0},{"$f":"IF(AD56>MAX(AD79:AD80,Kold!$P$32,Kold!$P$31),1,0)","v":0},{"$f":"IF(AE56>MAX(AE79:AE80,Kold!$P$32,Kold!$P$31),1,0)","v":0},{"$f":"IF(AF56>MAX(AF79:AF80,Kold!$P$32,Kold!$P$31),1,0)","v":0},{"$f":"IF(AG56>MAX(AG79:AG80,Kold!$P$32,Kold!$P$31),1,0)","v":0},{"$f":"IF(AH56>MAX(AH79:AH80,Kold!$P$32,Kold!$P$31),1,0)","v":0},{"$f":"IF(AI56>MAX(AI79:AI80,Kold!$P$32,Kold!$P$31),1,0)","v":0},{"$f":"IF(AJ56>MAX(AJ79:AJ80,Kold!$P$32,Kold!$P$31),1,0)","v":0},{"$f":"IF(AK56>MAX(AK79:AK80,Kold!$P$32,Kold!$P$31),1,0)","v":0},{"$f":"IF(AL56>MAX(AL79:AL80,Kold!$P$32,Kold!$P$31),1,0)","v":0},{"$f":"IF(AM56>MAX(AM79:AM80,Kold!$P$32,Kold!$P$31),1,0)","v":0},{"$f":"IF(AN56>MAX(AN79:AN80,Kold!$P$32,Kold!$P$31),1,0)","v":0},{"$f":"IF(AO56>MAX(AO79:AO80,Kold!$P$32,Kold!$P$31),1,0)","v":0},{"$f":"IF(AP56>MAX(AP79:AP80,Kold!$P$32,Kold!$P$31),1,0)","v":0},{"$f":"IF(AQ56>MAX(AQ79:AQ80,Kold!$P$32,Kold!$P$31),1,0)","v":0},{"$f":"IF(AR56>MAX(AR79:AR80,Kold!$P$32,Kold!$P$31),1,0)","v":0},{"$f":"IF(AS56>MAX(AS79:AS80,Kold!$P$32,Kold!$P$31),1,0)","v":0},{"$f":"IF(AT56>MAX(AT79:AT80,Kold!$P$32,Kold!$P$31),1,0)","v":0},{"$f":"IF(AU56>MAX(AU79:AU80,Kold!$P$32,Kold!$P$31),1,0)","v":0},{"$f":"IF(AV56>MAX(AV79:AV80,Kold!$P$32,Kold!$P$31),1,0)","v":0},{"$f":"IF(AW56>MAX(AW79:AW80,Kold!$P$32,Kold!$P$31),1,0)","v":0},{"$f":"IF(AX56>MAX(AX79:AX80,Kold!$P$32,Kold!$P$31),1,0)","v":0},{"$f":"IF(AY56>MAX(AY79:AY80,Kold!$P$32,Kold!$P$31),1,0)","v":0},{"$f":"IF(AZ56>MAX(AZ79:AZ80,Kold!$P$32,Kold!$P$31),1,0)","v":0},{"$f":"IF(BA56>MAX(BA79:BA80,Kold!$P$32,Kold!$P$31),1,0)","v":0},{"$f":"IF(BB56>MAX(BB79:BB80,Kold!$P$32,Kold!$P$31),1,0)","v":0},{"$f":"IF(BC56>MAX(BC79:BC80,Kold!$P$32,Kold!$P$31),1,0)","v":0}]
[]
[]
[]
[null,null,"Jævnt fordelte laste",null,null,null,"Punktlaste"]
[null,null,null,"p1","p2","p3",null,"P1","P2","P3"]
[null,"Langtidsværdi","(kN/m)",{"$f":"B95+C95*J95","v":5},{"$f":"B96+C96*J96","v":7.5},{"$f":"B97+C97*J97","v":6.5},"(kN)",{"$f":"B99+C99*J99","v":15},{"$f":"B100+C100*J100","v":12},{"$f":"B101+C101*J101","v":19.5}]
[null,"Kar. værdi","(kN/m)",{"$f":"B95+C95","v":5},{"$f":"B96+C96","v":9},{"$f":"B97+C97","v":10},"(kN)",{"$f":"B99+C99","v":15},{"$f":"B100+C100","v":12},{"$f":"B101+C101","v":22}]
[null,"Regnm. værdi","(kN/m)",{"$f":"G95*B95+C95*H95","v":5.5},{"$f":"G96*B96+C96*H96","v":11.55},{"$f":"G97*B97+C97*H97","v":14.85},"(kN)",{"$f":"G99*B99+C99*H99","v":16.5},{"$f":"G100*B100+C100*H100","v":13.200000000000001},{"$f":"G101*B101+C101*H101","v":26.950000000000003}]
[null,"Excentricitet, exc.","(mm)",{"$f":"Kold!E22","v":25},{"$f":"Kold!E23","v":15},{"$f":"Kold!E24","v":25},"(mm)",{"$f":"Kold!E26","v":10},{"$f":"Kold!E27","v":15},{"$f":"Kold!E28","v":20}]
[null,"x1","(m)",{"$f":"Kold!F22","v":0},{"$f":"Kold!F23","v":1},{"$f":"Kold!F24","v":2},"(m)",{"$f":"Kold!F26","v":1},{"$f":"Kold!F27","v":1.5},{"$f":"Kold!F28","v":2}]
[null,"x2","(m)",{"$f":"Kold!G22","v":5},{"$f":"Kold!G23","v":3},{"$f":"Kold!G24","v":4}]
[]
[{"$f":"Kold!B21","v":"Lastparametre:"},{"$f":"Kold!C21","v":"gk [kN/m]"},{"$f":"Kold!D21","v":"qk [kN/m]"},{"$f":"Kold!E21","v":"e [mm]"},{"$f":"Kold!F21","v":"x1 [m]"},{"$f":"Kold!G21","v":"x2 [m]"},{"$f":"Kold!H21","v":"ϒg"},{"$f":"Kold!I21","v":"ϒq"},{"$f":"Kold!J21","v":"ψ1"},{"$f":"Kold!K21","v":"ψ2"}]
[{"$f":"Kold!B22","v":"p1"},{"$f":"Kold!C22","v":5},{"$f":"Kold!D22","v":0},{"$f":"Kold!E22","v":25},{"$f":"Kold!F22","v":0},{"$f":"Kold!G22","v":5},{"$f":"Kold!H22","v":1.1000000000000001},{"$f":"Kold!I22","v":0},{"$f":"Kold!J22","v":0},{"$f":"Kold!K22","v":0}]
[{"$f":"Kold!B23","v":"p2"},{"$f":"Kold!C23","v":6},{"$f":"Kold!D23","v":3},{"$f":"Kold!E23","v":15},{"$f":"Kold!F23","v":1},{"$f":"Kold!G23","v":3},{"$f":"Kold!H23","v":1.1000000000000001},{"$f":"Kold!I23","v":1.65},{"$f":"Kold!J23","v":0.6},{"$f":"Kold!K23","v":0.5}]
[{"$f":"Kold!B24","v":"p3"},{"$f":"Kold!C24","v":3},{"$f":"Kold!D24","v":7},{"$f":"Kold!E24","v":25},{"$f":"Kold!F24","v":2},{"$f":"Kold!G24","v":4},{"$f":"Kold!H24","v":1.1000000000000001},{"$f":"Kold!I24","v":1.65},{"$f":"Kold!J24","v":0.6},{"$f":"Kold!K24","v":0.5}]
[{"$f":"Kold!B25","v":0},{"$f":"Kold!C25","v":"Gk [kN]"},{"$f":"Kold!D25","v":"Qk [kN]"},{"$f":"Kold!E25","v":"e [mm]"},{"$f":"Kold!F25","v":"x1 [m]"},{"$f":"Kold!G25","v":0}]
[{"$f":"Kold!B26","v":"P1"},{"$f":"Kold!C26","v":15},{"$f":"Kold!D26","v":0},{"$f":"Kold!E26","v":10},{"$f":"Kold!F26","v":1},{"$f":"Kold!G26","v":0},{"$f":"Kold!H26","v":1.1000000000000001},{"$f":"Kold!I26","v":1.65},{"$f":"Kold!J26","v":0.6},{"$f":"Kold!K26","v":0.5}]
[{"$f":"Kold!B27","v":"P2"},{"$f":"Kold!C27","v":12},{"$f":"Kold!D27","v":0},{"$f":"Kold!E27","v":15},{"$f":"Kold!F27","v":1.5},{"$f":"Kold!G27","v":0},{"$f":"Kold!H27","v":1.1000000000000001},{"$f":"Kold!I27","v":1.65},{"$f":"Kold!J27","v":0.6},{"$f":"Kold!K27","v":0.5}]
[{"$f":"Kold!B28","v":"P3"},{"$f":"Kold!C28","v":17},{"$f":"Kold!D28","v":5},{"$f":"Kold!E28","v":20},{"$f":"Kold!F28","v":2},{"$f":"Kold!G28","v":0},{"$f":"Kold!H28","v":1.1000000000000001},{"$f":"Kold!I28","v":1.65},{"$f":"Kold!J28","v":0.6},{"$f":"Kold!K28","v":0.5}]

{"sheet":"Brand","index":2,"n_rows":66,"n_cols":213,"rows_kept":66,"cut":false,"hidden":false,"merged":[[1,10,1,11],[1,12,1,14],[1,2,1,9],[2,8,2,9],[3,8,3,9],[2,2,2,6],[3,2,3,6],[28,8,28,9],[30,16,31,19],[28,2,28,4],[28,5,28,7],[2,10,5,14],[4,8,4,9],[4,2,4,6]]}
[]
[null,"Bruger:",{"$f":"Kold!D2","v":0},null,null,null,null,null,null,null,{"$f":"Kold!L2","v":"Bjælkeberegning"},null,{"$f":"Kold!N2","v":" Betonelement-Foreningen feb 2019"}]
[null,"Sagsnavn:",{"$f":"Kold!D3","v":"Betonelementhuset"},null,null,null,null,"Sag nr.:",{"$f":"Kold!J3","v":"23 - 4545"},null,{"$f":"BD15","v":""},null,null,null,null,null,null,null,null,null,null,null,null,null,null,null,null,null,null,null,null,null,null,null,null,null,null,null,null,null,null,null,null,null,2]
[null,"Bygningsdel:",{"$f":"Kold!D4","v":"Bjælke i modul D-E/12, stueetage"},null,null,null,null,"Dato:",{"$f":"Kold!J4","v":"2008-03-01"},null,null,null,null,null,null,null,null,null,null,null,null,null,null,null,null,null,null,null,null,null,null,null,null,null,null,null,null,null,null,null,null,null,null,null,"Tilslag: Kvartsholdigt"]
[null,"Emne:","Brandlastkombinationer",null,null,null,null,"Init:",{"$f":"Kold!J5","v":"JFJ"},null,null,null,null,null,null,null,null,null,null,null,null,null,null,null,null,null,null,null,null,null,null,null,null,null,null,null,null,null,null,null,null,null,null,null,"Tilslag: Søsand / granit"]
[]
[null,null,null,null,null,null,null,null,null,null,"Spændvidde",null,"Tværsnit","h",{"$f":"Kold!P7","v":700}]
[null,null,null,null,null,null,null,null,null,null,"L",{"$f":"Kold!M8","v":5},null,"b",{"$f":"Kold!P8","v":300},null,null,null,null,null,null,null,null,null,null,null,null,null,null,null,null,null,null,null,null,null,null,null,null,null,null,null,null,null,null,null,null,null,null,null,null,null,null,null,null,null,null,null,null,"BRUDLAST, MOMENTKAPACITET"]
[null,null,null,null,null,null,null,null,null,null,"Længdearmering                c' =",null,{"$f":"Kold!N9","v":40},"beff",{"$f":"Kold!P9","v":300},null,null,null,null,null,null,null,null,null,null,null,null,null,null,null,null,null,null,null,null,null,null,null,null,null,null,null,null,"A_1",{"$f":"O11*0.25*PI()*M11^2","v":1608.4954386379741},"mm2",null,null,"a","y","EI","s_b","s_o","s_2","s_3","s_m","w",null,null,"L","h","b","fck","fcd","Ecd","Ac","ac","Esc","fyd_c","At","at","Est","fyd_t","At","at","Est","fyd_t","Modenhed","1+f","uterm","   emax","e1","k","Tilstand:","Nf",null,null,null,null,null,null,null,null,null,null,null,null,null,null,null,null,null,null,null,null,null,null,null,null,null,null,null,null,null,null,null,null,null,null,null,null,null,null,null,null,null,null,null,null,null,null,null,null,null,null,null,null,null,null,null,null,null,null,null,null,null,null,null,null,null,null,null,null,null,null,null,null,null,null,null,null,null,null,null,null,null,null,null,null,null,null,null,null,null,null,null,null,null,null,null,null,null,null,null,null,null,null,null,null,null,null,null,null,null,null,null,null,null,null,null,null,null,null,null,null,null,null,null,{"$f":"Makro!A20","v":0},null,null,"Bruger skal registreres",1]
[null,null,null,null,null,null,null,null,null,null,null,null,"d (mm)","c (mm)","antal",null,null,null,null,null,null,null,null,null,null,null,null,null,null,null,null,null,null,null,null,null,null,null,null,null,null,null,null,"A_2",{"$f":"O12*0.25*PI()*M12^2","v":0},"mm2",null,"Langtid","\"-\"","\"-\"","\"-\"","\"-\"","\"-\"","\"-\"","\"-\"","\"-\"","\"-\"",null,null,"(m)","(m)","(m)","(Mpa)","(Mpa)","(Mpa)","(m2)","(m)","(Mpa)","(Mpa)","(m2)","(m)","(Mpa)","(Mpa)","(m2)","(m)","(Mpa)","(Mpa)","(døgn)",null,"(m)"]
[null,null,null,null,null,null,null,null,null,null,"Tryklag   t",null,{"$f":"Kold!N11","v":16},{"$f":"Kold!O11","v":40},{"$f":"Kold!P11","v":8},null,null,null,null,null,null,null,null,null,null,null,null,null,null,null,null,null,null,null,null,null,null,null,null,null,null,null,null,"A_3",{"$f":"O13*0.25*PI()*M13^2","v":1608.4954386379741},"mm2",null,"Korttid","\"-\"","\"-\"","\"-\"","\"-\"","\"-\"","\"-\"","\"-\"","\"-\"","\"-\"",null,null,{"$f":"L8","v":5},{"$f":"AT32/1000","v":0.68348707030313294},{"$f":"AT33/1000","v":0.26697414060626584},{"$f":"L21","v":35},{"$f":"AT28","v":35},{"$f":"22000*((BK11+8)/10)^0.3/L18","v":34077.14619918933},{"$f":"AS9/1000000","v":1.6084954386379742E-3},{"$f":"AT34/1000","v":0.04},{"$f":"AT24*200000","v":199852.91319895096},{"$f":"AS24*O18/L19","v":489.48506847638299},{"$f":"AS11/1000000","v":1.6084954386379742E-3},{"$f":"AT36/1000","v":2.3487070303132934E-2},{"$f":"AT26*200000","v":197398.99999742728},{"$f":"AS26*O18/L19","v":442.28448990581501},{"$f":"AS10/1000000","v":0},{"$f":"AT35/1000","v":8.3487070303132932E-2},{"$f":"AT25*200000","v":200000},{"$f":"AS25*O19","v":500},null,1,0,{"$f":"IF(CF11=1,Kold!CE11,MIN(2*CD11,Firsidig!$G$21))","v":5.0000000000000001E-3},{"$f":"IF(CF11=1,Kold!CF11,Firsidig!$F$21)","v":2.5000000000000001E-3},{"$f":"Kold!CG11","v":2.2964539096862753},{"$f":"IF(AND(L23>0.1,MAX(AT38:AT40)>0),-1,1)","v":-1},0]
[null,null,null,null,null,null,null,null,null,null,"Træklag 1",null,{"$f":"Kold!N12","v":14},{"$f":"Kold!O12","v":100},{"$f":"Kold!P12","v":0},null,null,null,null,null,null,null,null,null,null,null,null,null,null,null,null,null,null,null,null,null,null,null,null,null,null,null,null,"E_sk",200000,"Mpa",null,"Kar. last",null,null,null,"\"-\"","\"-\"","\"-\"","\"-\"","\"-\"","\"-\"",null,null,"hc","e0","a'","b'","N'","tN'","t'","Nc","sac","Nac","sat","Nat","sat","Nat","Mtot","N","N","A","B1","B2","B2'","B3","C1","C2","C2'"]
[null,null,null,null,null,null,null,null,null,null,"Træklag 2",null,{"$f":"Kold!N13","v":16},{"$f":"Kold!O13","v":40},{"$f":"Kold!P13","v":8},null,null,null,null,null,null,null,null,null,null,null,null,null,null,null,null,null,null,null,null,null,null,null,null,null,null,null,null,"E_sd",{"$f":"AS12/L19","v":200000},"MPa"]
[null,null,null,null,null,null,null,null,null,null,"Bøjler",null,"d (mm)","a (mm)","cotq",null,null,null,null,null,null,null,null,null,null,null,null,null,null,null,null,null,null,null,null,null,null,null,null,null,null,null,null,"c_w",{"$f":"(AS11*AT36+AS10*AT35)/(AS10+AS11)","v":23.487070303132935},null,null,null,null,null,null,null,null,null,null,null,null,null,null,{"$f":"0.5*(-(BZ14+CA14+CB14+CC14)+SQRT(MAX((BZ14+CA14+CB14+CC14)^2+4*BY14*(CD14+CE14+CF14),0)))/BY14","v":0.18999180445803851},{"$f":"0.025*$CC$11","v":1.25E-4},{"$f":"IF($CF$11=1,BI14/($CE$11*$CD$11),2^(1/3)*$CD$11/BI14)","v":25.198420997897465},{"$f":"IF($CF$11=1,-($CE$11-2)*BI14/$CD$11,3*($CD$11/BI14)^2)","v":1200},{"$f":"IF(CF$11=1,0.5*(CE$11*BI14*BL$11/CD$11)*(1-CG13^2+(BJ14-BK14)*(BK14^2*(1-CG13^2)+2*BK14*(1-CG13)+2*LN((1-BK14)/(1-BK14*CG13)))/(BK14^3)),BL$11*BK14*(LN((1-BJ14+BJ14^2)/(1+BJ14)^2)/(6*BJ14)+ATAN((2-BJ14)/(BJ14*3^0.5))/(BJ14*3^0.5)-LN((CG13^2-BJ14*CG13+BJ14^2)/(CG13+BJ14)^2)/(6*BJ14)-ATAN((2*CG13-BJ14)/(BJ14*3^0.5))/(BJ14*3^0.5)))","v":1.3124671887816339},{"$f":"IF(CF$11=1,(CE$11*BI14*BL$11/CD$11)*(1-CG13^3-(BJ14-BK14)*(-2*BK14^3*(1-CG13^3)-3*BK14^2*(1-CG13^2)-6*BK14*(1-CG13)-6*LN((1-BK14)/(1-BK14*CG13)))/(2*BK14^4))/3,BL$11*BK14*(LN((1+BJ14^3)/(BJ14^3+CG13^3)))/3)","v":0.8749726573903388},{"$f":"BM14/BL14","v":0.66666250011368111},{"$f":"BL14*BH14*BJ$11","v":6.6572140286505863E-2},{"$f":"MAX(MIN(BQ$11,CA$11*BP$11*BI14*(BH14-BO$11)/BH14),-BQ$11)","v":19.72210009427469},{"$f":"BP14*BN$11","v":3.1722908042002403E-2},{"$f":"MIN(BU$11,CA$11*BT$11*BI14*(BI$11-BH14-BS$11)/BH14)","v":61.04154601249499},{"$f":"BR14*BR$11","v":9.8185048328508218E-2},{"$f":"MIN($BY$11,CA$11*$BX$11*BI14*(BI$11-BH14-$BW$11)/BH14)","v":53.950773917792283},{"$f":"BT14*$BV$11","v":0},{"$f":"(0.5*BI$11-BH14+BN14*BH14)*BO14+(0.5*BI$11-BO$11)*BQ14+(0.5*BI$11-BS$11)*BS14+(0.5*BI$11-BW$11)*BU14","v":5.9354700978213146E-2},{"$f":"BO14+BQ14-BS14-BU14","v":1.100000000000545E-4},{"$f":"$CG$11+0.00001","v":1.0000000000000001E-5},{"$f":"BL14*BJ$11","v":0.35039479979889837},{"$f":"IF(BP13<BQ$11,CA$11*BI14*BN$11*BP$11,BN$11*BQ$11)","v":4.0182812409877956E-2},{"$f":"IF(BR13<BU$11,CA$11*BI14*BR$11*BT$11,-BR$11*BU$11)","v":3.9689423885944909E-2},{"$f":"IF(BT13<BY$11,CA$11*BI14*$BV$11*$BX$11,-$BV$11*BY$11)","v":0},{"$f":"-(BX14+0.0001)","v":-1.1E-4},{"$f":"IF(BP13<BQ$11,BO$11*CA$11*BI14*BN$11*BP$11,0)","v":1.6073124963951182E-3},{"$f":"IF(BR13<BU$11,(BI$11-BS$11)*CA$11*BI14*BR$11*BT$11,0)","v":2.6195019764723639E-2},{"$f":"IF(BT13<BY$11,(BI$11-$BW$11)*CA$11*BI14*$BV$11*$BX$11,0)","v":0},{"$f":"IF(BV14>BV13,BI14,CG13)","v":1.25E-4},{"$f":"IF(BV14>BV13,BP14,CH13)","v":19.72210009427469},{"$f":"IF(BV14>BV13,BR14,CI13)","v":61.04154601249499},{"$f":"IF(BV14>BV13,BT14,CJ13)","v":53.950773917792283}]
[null,null,null,null,null,null,null,null,null,null,"Type 1",null,{"$f":"Kold!N15","v":6},{"$f":"Kold!O15","v":150},2.5,null,null,null,null,null,null,null,null,null,null,null,null,null,null,null,null,null,null,null,null,null,null,null,null,null,null,null,null,"a_w",{"$f":"AS14*2*AT33/(O12*M12+O13*M13)","v":97.975631399029112},null,null,"Fejltabel",null,null,null,null,null,null,"Fejl",{"$f":"BD16&BD17&BD18&BD19&BD20&BD21&BD22&BD23&BD24&BD25&BD26&BD27&BD28&BD29&BD30&BD31&BD32&BD33&BD34&BD35&BD36&BD37&BD38&BD39&BD40&BD41&BD42&BD43&BD44&BD45","v":""},"NB'er",null,null,{"$f":"0.5*(-(BZ15+CA15+CB15+CC15)+SQRT(MAX((BZ15+CA15+CB15+CC15)^2+4*BY15*(CD15+CE15+CF15),0)))/BY15","v":0.18995312107775378},{"$f":"0.025*$CC$11+BI14","v":2.5000000000000001E-4},12.599210498948732,300,2.624475122987274,1.7495626457753681,{"$f":"BM15/BL15","v":0.66663335097036536},0.13309388168202152,39.442058020195724,6.3442370415979152E-2,122.11800380629526,0.19642625209800071,107.93370400963329,{"$f":"BT15*$BV$11","v":0},0.11871318167557517,{"$f":"BO15+BQ15-BS15-BU15","v":1.0999999999997123E-4},1.0000000000000001E-5,0.70066699050205139,{"$f":"IF(2*BP14-BP13<BQ$11,CA$11*BI15*BN$11*BP$11,BN$11*BQ$11)","v":8.0365624819755913E-2},{"$f":"IF(2*BR14-BR13<BU$11,CA$11*BI15*BR$11*BT$11,-BR$11*BU$11)","v":7.9378847771889818E-2},{"$f":"IF(2*BT14-BT13<BY$11,CA$11*BI15*$BV$11*$BX$11,-$BV$11*BY$11)","v":0},{"$f":"-(BX15+0.0001)","v":-1.1E-4},{"$f":"IF(2*BP14-BP13<BQ$11,BO$11*CA$11*BI15*BN$11*BP$11,0)","v":3.2146249927902364E-3},{"$f":"IF(2*BR14-BR13<BU$11,(BI$11-BS$11)*CA$11*BI15*BR$11*BT$11,0)","v":5.2390039529447277E-2},{"$f":"IF(2*BT14-BT13<BY$11,(BI$11-$BW$11)*CA$11*BI15*$BV$11*$BX$11,0)","v":0},2.5000000000000001E-4,39.442058020195724,122.11800380629526,{"$f":"IF(BV15>BV14,BT15,CJ14)","v":107.93370400963329}]
[null,null,null,null,null,null,null,null,null,null,"Type 2",null,{"$f":"Kold!N16","v":6},{"$f":"Kold!O16","v":150},{"$f":"O15","v":2.5},null,null,null,null,null,null,null,null,null,null,null,null,null,null,null,null,null,null,null,null,null,null,null,null,null,null,null,null,"h_int",{"$f":"O7-BH56*(1-BN56)*1000-(AS10*N12+AS11*N13)/(AS10+AS11)","v":637.72762703806711},"mm",null,"Negative inddata accepteres ikke; ",null,null,null,null,null,null,{"$f":"IF(MIN(O15,L18,L19,L23)<0,1,0)","v":0},{"$f":"IF(BC16=1,AV16,\"\")","v":""}," ",null,null,0.18996493812105278,3.7500000000000001E-4,8.3994736659658216,133.33333333333334,3.9348447411321721,2.6227876447589789,{"$f":"BM16/BL16","v":0.6665542905269306},0.19955850813803436,59.164068757179443,9.5165134727186615E-2,183.16100611058681,0.29461364286522101,161.88581927326143,0,0.1780353573936409,1.0999999999994348E-4,1.0000000000000001E-5,1.0505017931828462,{"$f":"IF(2*BP15-BP14<BQ$11,CA$11*BI16*BN$11*BP$11,BN$11*BQ$11)","v":0.12054843722963385},{"$f":"IF(2*BR15-BR14<BU$11,CA$11*BI16*BR$11*BT$11,-BR$11*BU$11)","v":0.11906827165783472},{"$f":"IF(2*BT15-BT14<BY$11,CA$11*BI16*$BV$11*$BX$11,-$BV$11*BY$11)","v":0},{"$f":"-(BX16+0.0001)","v":-1.1E-4},{"$f":"IF(2*BP15-BP14<BQ$11,BO$11*CA$11*BI16*BN$11*BP$11,0)","v":4.8219374891853538E-3},{"$f":"IF(2*BR15-BR14<BU$11,(BI$11-BS$11)*CA$11*BI16*BR$11*BT$11,0)","v":7.8585059294170923E-2},{"$f":"IF(2*BT15-BT14<BY$11,(BI$11-$BW$11)*CA$11*BI16*$BV$11*$BX$11,0)","v":0},3.7500000000000001E-4,59.164068757179443,183.16100611058681,161.88581927326143]
[null,null,null,null,null,null,null,null,null,null,"Partialkoefficienter",null,"Længdearmering",null,null,null,null,null,null,null,null,null,null,null,null,null,null,null,null,null,null,null,null,null,null,null,null,null,null,null,null,null,null,"Min arm",{"$f":"CEILING(AT33*AT32*0.45*SQRT(L21/10)/O18,1)","v":308},"mm2",null,null,null,null,null,null,null,null,null,null,null,null,null,0.19001153487913353,5.0000000000000001E-4,6.2996052494743662,75,5.2416202008191766,3.4930186106606613,0.6664005549495482,0.26589778085976368,78.890584927150158,0.12689514600680274,244.13058155705966,0.39268292686656642,215.77030330377599,0,0.23727785759243963,1.0999999999999899E-4,1.0000000000000001E-5,1.3993770484981423,0.16073124963951183,0.15875769554377964,0,-1.1E-4,6.4292499855804729E-3,0.10478007905889455,0,5.0000000000000001E-4,78.890584927150158,244.13058155705966,215.77030330377599]
[null,null,null,null,null,null,null,null,null,null,"gc",1,null,"fyk",{"$f":"Kold!P18","v":500},null,null,null,null,null,null,null,null,null,null,null,null,null,null,null,null,null,null,null,null,null,null,null,null,null,null,null,null,"Akt. arm",{"$f":"CEILING((M12^2*O12+M13^2*O13)*PI()/4,1)","v":1609},"mm2",null,null,null,null,null,null,null,null,null,null,null,null,null,0.19009669686753555,6.2500000000000001E-4,5.0396841995794928,48,6.542090117194947,4.3579986470039467,0.66614775537095883,0.33201697623359383,98.62501106285572,0.15863788043022317,304.97124510293628,0.49054485666381664,269.53605052518088,0,0.29638048721653765,1.1000000000038757E-4,1.0000000000000001E-5,1.7465688868068661,0.20091406204938975,0.19844711942972451,0,-1.1E-4,8.0365624819755902E-3,0.13097509882361821,0,6.2500000000000001E-4,98.62501106285572,304.97124510293628,269.53605052518088]
[null,{"$f":"IF(AS21>L30,\" \"&TEXT(AS21,\"0,0\")&\" kNm > \",\" \"&TEXT(AS21,\"0,0\")&\" kNm < \")","v":" 85,1 kNm < "},{"$f":"IF(AS21>L30,\"!\",\" \")","v":" "},null,null,null,null,null,null,null,"gs",1,null,"fyd",{"$f":"O18/L19","v":500},null,null,null,null,null,null,null,null,null,null,null,null,null,null,null,null,null,null,null,null,null,null,null,null,null,null,null,null,null,null,null,null,null,null,null,null,null,null,null,null,null,null,null,null,0.19022726040764137,7.5000000000000002E-4,4.1997368329829108,33.333333333333336,7.832827242662197,5.2148782414640324,0.66577215096239195,0.39779607951080376,118.37166070478136,0.19040027630764275,365.612697239863,0.58808635581844626,323.11831021031054,0,0.35526699995450917,1.1000000000027654E-4,1.0000000000000001E-5,2.0911623216270869,0.2410968744592677,0.23813654331566944,0,-1.1E-4,9.6438749783707076E-3,0.15717011858834185,0,7.5000000000000002E-4,118.37166070478136,365.612697239863,323.11831021031054]
[null,null,null,null,null,null,null,null,null,null,"Beton",null,"Bøjlearmering",null,null,null,null,null,null,null,null,null,null,null,null,null,null,null,null,null,null,null,null,null,null,null,null,null,null,null,null,null,null,"M_k",{"$f":"MAX(Brand2!P31:BG31)","v":94.300000000000011},"kNm",null,"x_2 skal være større end x_1; ",null,null,null,null,null,null,{"$f":"IF(OR(Brand2!D91>Brand2!D92,Brand2!E91>Brand2!E92,Brand2!F91>Brand2!F92),1,0)","v":0},{"$f":"IF(BC20=1,AV20,\"\")","v":""}," ",null,null,0.19041066096097092,8.7500000000000002E-4,3.5997744282710662,24.489795918367349,9.109751401273245,6.0602711034558858,0.6652509861694863,0.46309168518658583,138.13568809819608,0.2221906242190663,425.97093715468372,0.68517230940565188,376.4397117791749,0,0.4138463284406132,1.1000000000027654E-4,1.0000000000000001E-5,2.4320680514916506,0.28127968686914567,0.27782596720161434,0,-1.1E-4,1.1251187474765828E-2,0.18336513835306548,0,8.7500000000000002E-4,138.13568809819608,425.97093715468372,376.4397117791749]
[null,"Lastparametre:","g [kN/m]","q [kN/m]","e [mm]","x1 [m]","x2 [m]","ϒg","ϒq","ψ1","fck",{"$f":"Kold!M21","v":35},null,"fyk ",{"$f":"Kold!P21","v":410},null,null,null,null,null,null,null,null,null,null,null,null,null,null,null,null,null,null,null,null,null,null,null,null,null,null,null,null,"M_d",{"$f":"MAX(Brand2!P32:BG32)","v":85.14},"kNm",null,"x_2 skal være mindre end L; ",null,null,null,null,null,null,{"$f":"IF(OR(Brand2!D92>L8,Brand2!E92>L8,Brand2!F92>L8),1,0)","v":0},{"$f":"IF(BC21=1,AV21,\"\")","v":""}," ",null,null,0.16848629280623648,1E-3,3.1498026247371831,18.75,10.368218936357911,6.8903334145479755,0.66456287785222756,0.4663778661680415,152.40622543099423,0.24514471842578503,442.28448990581501,0.71141258459382661,500,0,0.43340603754286194,1.0999999999994348E-4,1.0000000000000001E-5,2.768046340151765,0.32146249927902365,-0.71141258459382661,0,-1.1E-4,1.2858499971160946E-2,0,0,1E-3,152.40622543099423,442.28448990581501,500]
[null,"p1",{"$f":"Kold!C22","v":5},{"$f":"Kold!D22","v":0},{"$f":"Kold!E22","v":25},{"$f":"Kold!F22","v":0},{"$f":"Kold!G22","v":5},{"$f":"Kold!H22","v":1.1000000000000001},{"$f":"Kold!I22","v":0},{"$f":"Kold!J22","v":0},"fcd",{"$f":"L21/L18","v":35},null,"fyd ",{"$f":"O21/L19","v":410},null,null,null,null,null,null,null,null,null,null,null,null,null,null,null,null,null,null,null,null,null,null,null,null,null,null,null,null,"maks V_d",{"$f":"MAX(Brand2!P55:BD55)","v":60.019999999999996},"kN",null,"x_1 skal være mindre end L; ",null,null,null,null,null,null,{"$f":"IF(OR(Brand2!H91>L8,Brand2!I91>L8,Brand2!J91>L8),1,0)","v":0},{"$f":"IF(BC22=1,AV22,\"\")","v":""}," ",null,null,0.14512402276958372,1.1250000000000001E-3,2.7998245553219401,14.814814814814811,11.603139756137548,7.7008673196691335,0.6636882327988608,0.44955623846477394,162.86421449281693,0.26196634612905267,442.28448990581501,0.71141258459382661,500,0,0.4371497899554132,1.100000000000545E-4,1.0000000000000001E-5,3.0977382647292186,0.36164531168890163,-0.71141258459382661,0,-1.1E-4,1.4465812467556063E-2,0,0,1.1250000000000001E-3,162.86421449281693,442.28448990581501,500]
[null,"p2",{"$f":"Kold!C23","v":6},{"$f":"Kold!D23","v":3},{"$f":"Kold!E23","v":15},{"$f":"Kold!F23","v":1},{"$f":"Kold!G23","v":3},{"$f":"Kold!H23","v":1.1000000000000001},{"$f":"Kold!I23","v":1.65},{"$f":"Kold!J23","v":0.6},"Brand, tid:",60,"Stålreduktioner",null,null,null,null,null,null,null,null,null,null,null,null,null,null,null,null,null,null,null,null,null,null,null,null,null,null,null,null,null,null,"Længdearmering","zs,0.2","Espk / Esk",null,null,null,null,null,null,null,null,null,null,null,null,null,0.12744237499933317,1.2500000000000002E-3,2.5198420997897459,11.999999999999995,12.809120375020873,8.4874470418424135,0.66260967133963578,0.43581518732578356,171.40701219613268,0.27570739726804305,442.28448990581501,0.71141258459382661,500,0,0.43980249666623561,1.100000000000545E-4,1.0000000000000001E-5,3.4197039040434074,0.40182812409877955,-0.71141258459382661,0,-1.1E-4,1.6073124963951184E-2,0,0,1.2500000000000002E-3,171.40701219613268,442.28448990581501,500]
[null,"p3",{"$f":"Kold!C24","v":3},{"$f":"Kold!D24","v":7},{"$f":"Kold!E24","v":25},{"$f":"Kold!F24","v":2},{"$f":"Kold!G24","v":4},{"$f":"Kold!H24","v":1.1000000000000001},{"$f":"Kold!I24","v":1.65},{"$f":"Kold!J24","v":0.6},"Bund:",{"$f":"IF(Makro!A1=1,\"NEJ\",\"JA\")","v":"JA"},null,"fsy,q / fyk","Es,q / Es",null,null,null,null,null,null,null,null,null,null,null,null,null,null,null,null,null,null,null,null,null,null,null,null,null,null,null,null,"Tryklag",{"$f":"Firsidig!E47","v":0.97897013695276602},{"$f":"Firsidig!E46","v":0.99926456599475477},null,"Grænse forskydningstrykbrud (V_ud_0) overskredet; ",null,null,null,null,null,null,0,{"$f":"IF(BE24=1,AV24,\"\")","v":""},{"$f":"IF(AS22>O30,1,0)","v":0},null,null,0.1138237598669863,1.3750000000000004E-3,2.2907655452634055,9.9173553719008218,13.980628396056304,9.2455633298325548,0.66131242944992163,0.42484334228511067,178.22819724715379,0.286679242308716,442.28448990581501,0.71141258459382661,500,0,0.44172472279427377,1.100000000000545E-4,1.0000000000000001E-5,3.7324662511726885,0.44201093650865758,-0.71141258459382661,0,-1.1E-4,1.7680437460346303E-2,0,0,1.3750000000000004E-3,178.22819724715379,442.28448990581501,500]
[null,null,"G [kN]","Q [kN]","e [mm]","x1 [m]",null,null,null,null,"Sider:",{"$f":"IF(Makro!A2=1,\"NEJ\",\"JA\")","v":"JA"},"Tryklag  t:",{"$f":"AS24","v":0.97897013695276602},0.99926456599475477,null,null,null,null,null,null,null,null,null,null,null,null,null,null,null,null,null,null,null,null,null,null,null,null,null,null,null,null,"Træklag 1",{"$f":"Firsidig!E35","v":1},{"$f":"Firsidig!E34","v":1},null,null,null,null,null,null,null,null,null,null,null,null,null,0.10317590859464602,1.5000000000000005E-3,2.0998684164914549,8.3333333333333286,15.112171034850878,9.9707793931991713,0.65978471062861155,0.41626927767826366,183.55868460875135,0.29525330691556306,442.28448990581501,0.71141258459382661,500,0,0.44314787216823898,1.100000000000545E-4,1.0000000000000001E-5,4.0345588747242163,0.48219374891853556,-0.71141258459382661,0,-1.1E-4,1.9287749956741422E-2,0,0,1.5000000000000005E-3,183.55868460875135,442.28448990581501,500]
[null,"P1",{"$f":"Kold!C26","v":15},{"$f":"Kold!D26","v":0},{"$f":"Kold!E26","v":10},{"$f":"Kold!F26","v":1},{"$f":"Kold!G26","v":0},{"$f":"Kold!H26","v":1.1000000000000001},{"$f":"Kold!I26","v":1.65},{"$f":"Kold!J26","v":0.6},"Betonreduktioner",null,"Træklag 1:",1,1,null,null,null,null,null,null,null,null,null,null,null,null,null,null,null,null,null,null,null,null,null,null,null,null,null,null,null,null,"Træklag 2",{"$f":"Firsidig!E41","v":0.88456897981162996},{"$f":"Firsidig!E40","v":0.98699499998713647},null,"Partialkoefficienter skal være større end 1; ",null,null,null,null,null,null,{"$f":"IF(MIN(L18:L19)<1,1,0)","v":0},{"$f":"IF(BC26=1,AV26,\"\")","v":""}," ",null,null,9.4738114010213467E-2,1.6250000000000006E-3,1.9383400767613428,7.1005917159763268,16.19847798617139,10.65888944846464,0.65801796054938699,0.40970205471526761,187.64152053432716,0.30182052987855901,442.28448990581501,0.71141258459382661,500,0,0.44422324876391428,1.100000000000545E-4,1.0000000000000001E-5,4.3245747394876224,0.52237656132841359,-0.71141258459382661,0,-1.1E-4,2.0895062453136541E-2,0,0,1.6250000000000006E-3,187.64152053432716,442.28448990581501,500]
[null,"P2",{"$f":"Kold!C27","v":12},{"$f":"Kold!D27","v":0},{"$f":"Kold!E27","v":15},{"$f":"Kold!F27","v":1.5},{"$f":"Kold!G27","v":0},{"$f":"Kold!H27","v":1.1000000000000001},{"$f":"Kold!I27","v":1.65},{"$f":"Kold!J27","v":0.6},"Randzone:",{"$f":"Firsidig!E23*1000","v":16.512929696867065},"Træklag 2:",0.88456897981162996,0.98699499998713647,null,null,null,null,null,null,null,null,null,null,null,null,null,null,null,null,null,null,null,null,null,null,null,null,null,null,null,null,"Bøjler","zs,0.2",{"$f":"Firsidig!E49","v":0.79802349856253441},null,"M_d > M_ud  !",null,null,null,null,null,null,null,{"$f":"IF(BE27=1,AV27,\"\")","v":""},{"$f":"IF(AS21>L30,1,0)","v":0},null,null,8.7968733729162099E-2,1.7500000000000007E-3,1.7998872141355324,6.122448979591832,17.234677597298397,11.306069873557433,0.65600704218161321,0.40476290235515267,190.71218659993775,0.30675968223867406,442.28448990581501,0.71141258459382661,500,0,0.4450511319651751,1.100000000000545E-4,1.0000000000000001E-5,4.6012132401648023,0.56255937373829146,-0.71141258459382661,0,-1.1E-4,2.2502374949531664E-2,0,0,1.7500000000000007E-3,190.71218659993775,442.28448990581501,500]
[null,"P3",{"$f":"Kold!C28","v":17},{"$f":"Kold!D28","v":5},{"$f":"Kold!E28","v":20},{"$f":"Kold!F28","v":2},{"$f":"Kold!G28","v":0},{"$f":"Kold!H28","v":1.1000000000000001},{"$f":"Kold!I28","v":1.65},{"$f":"Kold!J28","v":0.6},"kc,M",{"$f":"Firsidig!E21","v":1},"Bøjlearmering:",{"$f":"AT27","v":0.79802349856253441},null,null,null,null,null,null,null,null,null,null,null,null,null,null,null,null,null,null,null,null,null,null,null,null,null,null,null,null,null,"Beton","Red f_cd",{"$f":"AT29*L21/L18","v":35},null,null,null,null,null,null,null,null,null,null,null,null,null,8.247560618826652E-2,1.8750000000000008E-3,1.6798947331931637,5.3333333333333286,18.216455228209032,11.909013005190696,0.65375029642150317,0.4011054695811363,192.98600888513693,0.31041711501269031,442.28448990581501,0.71141258459382661,500,0,0.44569878227694038,1.100000000000545E-4,1.0000000000000001E-5,4.8633224794436245,0.60274218614816955,-0.71141258459382661,0,-1.1E-4,2.4109687445926779E-2,0,0,1.8750000000000008E-3,192.98600888513693,442.28448990581501,500]
[null,null,"Jævnt fordelte laste [kN/m]",null,null,"Punktlaste [kN]",null,null,"Kontrolparametre",null,"Momentkapacitet",null,"Forskydningskapacitet",null,null,null,null,null,null,null,null,null,null,null,null,null,null,null,null,null,null,null,null,null,null,null,null,null,null,null,null,null,null,null,"zc,M  =",{"$f":"L28","v":1},null,null,null,null,null,null,null,null,null,null,null,null,null,7.797085714005772E-2,2.0000000000000009E-3,1.5749013123685909,4.6874999999999964,19.140183931618406,12.465034878980854,0.65124948242474212,0.39842594608736714,194.65186595218464,0.31309663850645936,442.28448990581501,0.71141258459382661,500,0,0.44621188363425079,1.0999999999983245E-4,1.0000000000000001E-5,5.1099341561896825,0.64292499855804752,-0.71141258459382661,0,-1.1E-4,2.5716999942321902E-2,0,0,2.0000000000000009E-3,194.65186595218464,442.28448990581501,500]
[null,null,"p1","p2","p3","P1","P2","P3","M (kNm)",{"$f":"L30","v":447.93826577449755},"MRd",{"$f":"BV56*1000","v":447.93826577449755},"v/ trykbrud i krop:","VRd,0",{"$f":"BJ64","v":851.06149826442231},null,null,null,null,null,null,null,null,null,null,null,null,null,null,null,null,null,null,null,null,null,null,null,null,null,null,null,null,null,null,null,null,null,null,null,null,null,null,null,null,null,null,null,null,7.4240533109004581E-2,2.125000000000001E-3,1.4822600586998502,4.152249134948093,20.003020017230536,12.972150542094331,0.64850960159616711,0.39646590815369021,195.87041956856095,0.31505667644013646,442.28448990581501,0.71141258459382661,500,0,0.44662191828115805,1.100000000000545E-4,1.0000000000000001E-5,5.3402890786300556,0.6831078109679255,-0.71141258459382661,0,-1.1E-4,2.7324312438717021E-2,0,0,2.125000000000001E-3,195.87041956856095,442.28448990581501,500]
[null,"Regnm. værdi",{"$f":"Kold2!D96","v":15},{"$f":"Kold2!E96","v":1},{"$f":"Kold2!F96","v":3},{"$f":"Kold2!H96","v":1.65},{"$f":"Kold2!I96","v":0.6},{"$f":"Kold2!J96","v":0.5},"x (mm)",{"$f":"BH56*1000","v":57.203758460411649},{"$f":"INDEX(AS4:AS5,Makro!A3,1)","v":"Tilslag: Søsand / granit"},null,"v/ type 1 bøjler:","VRd,1",{"$f":"BJ65","v":173.31200436000364},null,"NB:  Resultaterne skal altid kontrolleres af ansvarlig statiker",null,null,null,null,null,null,null,null,null,null,null,null,null,null,null,null,null,null,null,null,null,null,null,null,null,null,null,null,null,null,null,null,null,null,null,null,null,null,null,null,null,null,7.1123736181455274E-2,2.2500000000000011E-3,1.3999122776609696,3.7037037037036997,20.802959301014468,13.429113602965158,0.64553861826332948,0.39501071734463822,196.77511023419584,0.31651186724918856,442.28448990581501,0.71141258459382661,500,0,0.44695095870848978,1.1000000000016552E-4,1.0000000000000001E-5,5.5538521814554622,0.72329062337780348,-0.71141258459382661,0,-1.1E-4,2.8931624935112144E-2,0,0,2.2500000000000011E-3,196.77511023419584,442.28448990581501,500]
[null,null,null,null,null,null,null,null,"e0 (o/oo)",{"$f":"BI56*1000","v":3.3750000000000022},{"$f":"INDEX(AR33:AR35,Makro!A4,1)","v":"Stål: Bratkølet"},null,"v/ type 2 bøjler:","VRd,2",{"$f":"BJ66","v":173.31200436000364},null,null,null,null,null,null,null,null,null,null,null,null,null,null,null,null,null,null,null,null,null,null,null,null,null,null,null,null,2,"h_red",{"$f":"O7-L27*AT39","v":683.4870703031329},null,null,null,null,null,null,null,null,null,null,null,null,null,6.8498070566135091E-2,2.3750000000000012E-3,1.3262326840998659,3.3240997229916864,21.538853377979798,13.835419946181604,0.64234709728449224,0.39388561075468742,197.47458787207043,0.31763697383913908,442.28448990581501,0.71141258459382661,500,0,0.44721479873127001,1.0999999999983245E-4,1.0000000000000001E-5,5.750316870230523,0.76347343578768156,-0.71141258459382661,0,-1.1E-4,3.0538937431507259E-2,0,0,2.3750000000000012E-3,197.47458787207043,442.28448990581501,500]
[null,null,null,null,null,null,null,null,"sst (MPa)",{"$f":"IF(AND(AS11=0,AS10=0),0,BR56)","v":442.28448990581501},"Forskydningskraftens største excentricitet, exc.:",null,null,null,{"$f":"MAX(Brand2!P60:BD60)","v":21.215596330275229},null,"Vejledning",null,null,"Betonelementbyggeriers statik",null,null,null,null,null,null,null,null,null,null,null,null,null,null,null,null,null,null,null,null,null,null,null,"Stål: Varmvalset","b_red",{"$f":"O8-2*L27*AT40","v":266.97414060626585},null,"Forskydningsarmering bør vurderes nærmere !",null,null,null,null,null,null,null,{"$f":"IF(BE33=1,AV33,\"\")","v":""},{"$f":"IF(Brand2!I68=1,1,0)","v":0},null,null,6.6269377993162307E-2,2.5000000000000014E-3,1.2599210498948725,2.9999999999999964,22.210388575083257,14.191278549347276,0.6389477834380517,0.39295086414329439,198.0557189023111,0.31857172045053223,442.28448990581501,0.71141258459382661,500,0,0.44742500907681648,1.100000000000545E-4,1.0000000000000001E-5,5.9295994023640777,0.80365624819755943,-0.71141258459382661,0,-1.1E-4,3.2146249927902375E-2,0,0,2.5000000000000014E-3,198.0557189023111,442.28448990581501,500]
[null,null,null,null,null,null,null,null,"z (mm)",{"$f":"AS16","v":637.72762703806711},"Forankringskrav til hovedarmering over lejer, Na :",null,null,null,{"$f":"CD66","v":84.334160866852187},null,null,null,null,"Polyteknisk Forlag 2011, eller www.bef.dk ",null,null,null,null,null,null,null,null,null,null,null,null,null,null,null,null,null,null,null,null,null,null,null,"Stål: Bratkølet","a_t_red",{"$f":"N11","v":40},null,null,null,null,null,null,null,null,null,null,null,null,null,6.4364429065132872E-2,2.6250000000000015E-3,1.1999248094236881,2.7210884353741469,22.818032910946371,14.497554702758476,0.63535514911995949,0.39209682050053929,198.58667697793888,0.31942576409328749,442.28448990581501,0.71141258459382661,500,0,0.44759029287038421,1.1000000000016552E-4,1.0000000000000001E-5,6.091824726725398,0.84383906060743741,-0.71141258459382661,0,-1.1E-4,3.3753562424297501E-2,0,0,2.6250000000000015E-3,198.58667697793888,442.28448990581501,500]
[null,null,null,null,null,null,null,null,null,null,null,null,null,null,null,null,null,null,null,null,null,null,null,null,null,null,null,null,null,null,null,null,null,null,null,null,null,null,null,null,null,null,null,"Stål: Kolddeformeret","a_1_red",{"$f":"N12-L27*AT39","v":83.487070303132938},null,null,null,null,null,null,null,null,null,{"$f":"IF(BC35=1,AV35,\"\")","v":""}," ",null,null,6.2725672040906483E-2,2.7500000000000016E-3,1.1453827726317023,2.4793388429752041,23.362958147988095,14.755692422722083,0.63158493583111486,0.39123919009981911,199.11986493739383,0.32028339449400745,442.28448990581501,0.71141258459382661,500,0,0.44771738312369946,1.0999999999994348E-4,1.0000000000000001E-5,6.2373056735792778,0.8840218730173155,-0.71141258459382661,0,-1.1E-4,3.536087492069262E-2,0,0,2.7500000000000016E-3,199.11986493739383,442.28448990581501,500]
[null,null,null,null,null,null,null,null,null,null,null,null,null,null,null,null,null,null,null,null,null,null,null,null,null,null,null,null,null,null,null,null,null,null,null,null,null,null,null,null,null,null,null,{"$f":"IF(Makro!A4=1,\"Q\",IF(Makro!A4=2,\"AC\",\"C\"))","v":"AC"},"a_2_red",{"$f":"N13-L27*AT39","v":23.487070303132935},null,null,null,null,null,null,null,null,null,""," ",null,null,6.1307425154255336E-2,2.8750000000000017E-3,1.0955835216477152,2.2684310018903568,23.846944796361701,14.967623414858634,0.62765371173007567,0.39031480083184356,199.69455681762605,0.32120778376198328,442.28448990581501,0.71141258459382661,500,0,0.44781163916746602,1.1000000000027654E-4,1.0000000000000001E-5,6.3665175930937279,0.92420468542719336,-0.71141258459382661,0,-1.1E-4,3.6968187417087739E-2,0,0,2.8750000000000017E-3,199.69455681762605,442.28448990581501,500]
[null,null,null,null,null,null,null,null,null,null,null,null,null,null,null,null,null,null,null,null,null,null,null,null,null,null,null,null,null,null,null,null,null,null,null,null,null,null,null,null,null,null,null,null,null,null,null,null,null,null,null,null,null,null,null,""," ",null,null,6.0073089390306221E-2,3.0000000000000018E-3,1.049934208245727,2.0833333333333304,24.272277809316702,15.135669687920521,0.62357846292080699,0.38927785492455391,200.33922504756362,0.32224472966927264,442.28448990581501,0.71141258459382661,500,0,0.44787744434783405,1.0999999999994348E-4,1.0000000000000001E-5,6.480070508698863,0.96438749783707134,-0.71141258459382661,0,-1.1E-4,3.8575499913482858E-2,0,0,3.0000000000000018E-3,200.33922504756362,442.28448990581501,500]
[null,null,null,null,null,null,null,null,null,null,null,null,null,null,null,null,null,null,null,null,null,null,null,null,null,null,null,null,null,null,null,null,null,null,null,null,null,null,null,null,null,null,null,"Brand, trykside",1,{"$f":"AS38-1","v":0},null,null,null,null,null,null,null,null,null,""," ",null,null,5.8993088199605845E-2,3.1250000000000019E-3,1.0079368399158979,1.9199999999999977,24.641639899723572,15.262446045072041,0.61937623093190541,0.38809668695870003,201.07355598657713,0.32342589763512664,442.28448990581501,0.71141258459382661,500,0,0.44791847211698077,1.100000000000545E-4,1.0000000000000001E-5,6.5786806353577711,1.0045703102469494,-0.71141258459382661,0,-1.1E-4,4.0182812409877977E-2,0,0,3.1250000000000019E-3,201.07355598657713,442.28448990581501,500]
[null,null,null,null,null,null,null,null,null,null,null,null,null,null,null,null,null,null,null,null,null,null,null,null,null,null,null,null,null,null,null,null,null,null,null,null,null,null,null,null,null,null,null,"Brand, trækside",2,{"$f":"Makro!A1-1","v":1},null,null,null,null,null,null,null,null,null,""," ",null,null,5.8043329256740106E-2,3.250000000000002E-3,0.96917003838067117,1.7751479289940806,24.958008159570625,15.350767431584751,0.61506380370735658,0.38675099024363646,201.91017428386178,0.32477159435019004,442.28448990581501,0.71141258459382661,500,0,0.4479378648316833,1.0999999999983245E-4,1.0000000000000001E-5,6.663142779645538,1.0447531226568274,-0.71141258459382661,0,-1.1E-4,4.1790124906273096E-2,0,0,3.250000000000002E-3,201.91017428386178,442.28448990581501,500]
[null,null,null,null,null,null,null,null,null,null,null,null,null,null,null,null,null,null,null,null,null,null,null,null,null,null,null,null,null,null,null,null,null,null,null,null,null,null,null,null,null,null,null,"Brand, sider",2,{"$f":"Makro!A2-1","v":1},null,null,null,null,null,null,null,null,null,""," ",null,null,5.7204044332207216E-2,3.3750000000000021E-3,0.93327485177397962,1.6460905349794217,25.224558223809815,15.403564726952837,0.61065746286938716,0.38522946769294197,202.85610332670888,0.32629311690088481,442.28448990581501,0.71141258459382661,500,0,0.44793835466224208,1.1000000000016552E-4,1.0000000000000001E-5,6.7343047539743406,1.0849359350667054,-0.71141258459382661,0,-1.1E-4,4.3397437402668215E-2,0,0,3.3750000000000021E-3,202.85610332670888,442.28448990581501,500]
[null,null,null,null,null,null,null,null,null,null,null,null,null,null,null,null,null,null,null,null,null,null,null,null,null,null,null,null,null,null,null,null,null,null,null,null,null,null,null,null,null,null,null,null,null,null,null,null,null,null,null,null,null,null,null,""," ",null,null,5.645890548764311E-2,3.5000000000000022E-3,0.89994360706776599,1.5306122448979571,25.444578788808954,15.423811221271272,0.60617278632472316,0.38352786051711824,203.91399080027537,0.32799472407670877,442.28448990581501,0.71141258459382661,500,0,0.44792234618517879,1.1000000000038757E-4,1.0000000000000001E-5,6.7930445552306908,1.1251187474765834,-0.71141258459382661,0,-1.1E-4,4.5004749899063341E-2,0,0,3.3750000000000021E-3,202.85610332670888,442.28448990581501,500]
[null,null,null,null,null,null,null,null,null,null,null,null,null,null,null,null,null,null,null,null,null,null,null,null,null,null,null,null,null,null,null,null,null,null,null,null,null,null,null,null,null,null,null,null,null,"NEJ",null,null,null,null,null,null,null,null,null,""," ",null,null,5.5794322749319759E-2,3.6250000000000024E-3,0.8689110688930155,1.4268727705112945,25.621430724732324,15.414460948347546,0.60162373889089626,0.38164764337757306,205.0829199090436,0.3298749412162536,442.28448990581501,0.71141258459382661,500,0,0.44789196678108301,1.100000000000545E-4,1.0000000000000001E-5,6.8402594488383874,1.1653015598864613,-0.71141258459382661,0,-1.1E-4,4.6612062395458453E-2,0,0,3.3750000000000021E-3,202.85610332670888,442.28448990581501,500]
[null,null,null,null,null,null,null,null,null,null,null,null,null,null,null,null,null,null,null,null,null,null,null,null,null,null,null,null,null,null,null,null,null,null,null,null,null,null,null,null,null,null,null,null,null,"JA",null,null,null,null,null,null,null,null,null,""," ",null,null,5.5198982835452375E-2,3.7500000000000025E-3,0.83994736659658165,1.3333333333333319,25.75839119638897,15.378398444587333,0.59702480358102517,0.37959370942675624,206.35984858504668,0.33192887516707059,442.28448990581501,0.71141258459382661,500,0,0.44784912810778177,1.1000000000027654E-4,1.0000000000000001E-5,6.876824353055949,1.2054843722963393,-0.71141258459382661,0,-1.1E-4,4.8219374891853566E-2,0,0,3.3750000000000021E-3,202.85610332670888,442.28448990581501,500]
[null,null,null,null,null,null,null,null,null,null,null,null,null,null,null,null,null,null,null,null,null,null,null,null,null,null,null,null,null,null,null,null,null,null,null,null,null,null,null,null,null,null,null,null,null,null,null,null,null,null,null,null,null,null,null,""," ",null,null,5.4663368020453434E-2,3.8750000000000026E-3,0.81285229025475636,1.2486992715920897,25.858695753647659,15.318400416415136,0.5923887485413607,0.3773741956121065,207.73971809622736,0.33414838898172033,442.28448990581501,0.71141258459382661,500,0,0.44779553520736615,1.1000000000027654E-4,1.0000000000000001E-5,6.9036030760289799,1.2456671847062173,-0.71141258459382661,0,-1.1E-4,4.9826687388248692E-2,0,0,3.3750000000000021E-3,202.85610332670888,442.28448990581501,500]
[null,null,null,null,null,null,null,null,null,null,null,null,null,null,null,null,null,null,null,null,null,null,null,null,null,null,null,null,null,null,null,null,null,null,null,null,null,null,null,null,null,null,null,null,null,null,null,null,null,null,null,null,null,null,null,""," ",null,null,5.4179451012887847E-2,4.0000000000000027E-3,0.78745065618429522,1.1718749999999982,25.925470977642604,15.237107253216442,0.58772730749449043,0.37499929572379764,209.21619097346465,0.33652328887002919,442.28448990581501,0.71141258459382661,500,0,0.4477327162418705,1.1000000000027654E-4,1.0000000000000001E-5,6.9214303340688206,1.2858499971160953,-0.71141258459382661,0,-1.1E-4,5.1433999884643818E-2,0,0,3.3750000000000021E-3,202.85610332670888,442.28448990581501,500]
[null,null,null,null,null,null,null,null,null,null,null,null,null,null,null,null,null,null,null,null,null,null,null,null,null,null,null,null,null,null,null,null,null,null,null,null,null,null,null,null,null,null,null,null,null,null,null,null,null,null,null,null,null,null,null,null,null,null,null,5.3740433774964326E-2,4.1250000000000028E-3,0.76358851508780146,1.1019283746556459,25.961706461813254,15.137003598154648,0.58305118041525794,0.37248055007996173,210.78209261255688,0.33904203451386478,442.28448990581501,0.71141258459382661,500,0,0.4476620406709485,1.0999999999983245E-4,1.0000000000000001E-5,6.9311042713147319,1.3260328095259732,-0.71141258459382661,0,-1.1E-4,5.304131238103893E-2,0,0,3.3750000000000021E-3,202.85610332670888,442.28448990581501,500]
[null,null,null,null,null,null,null,null,null,null,null,null,null,null,null,null,null,null,null,null,null,null,null,null,null,null,null,null,null,null,null,null,null,null,null,null,null,null,null,null,null,null,null,null,null,null,null,null,null,null,null,null,null,null,null,null,null,null,null,5.3340537653242252E-2,4.2500000000000029E-3,0.74113002934992489,1.0380622837370228,25.97023542758388,15.020406494410937,0.57837005506916761,0.36983028547664387,212.42975945677387,0.3416922991171828,442.28448990581501,0.71141258459382661,500,0,0.44758473438756896,1.100000000000545E-4,1.0000000000000001E-5,6.9333812846216052,1.3662156219358512,-0.71141258459382661,0,-1.1E-4,5.4648624877434049E-2,0,0,3.3750000000000021E-3,202.85610332670888,442.28448990581501,500]
[null,null,null,null,null,null,null,null,null,null,null,null,null,null,null,null,null,null,null,null,null,null,null,null,null,null,null,null,null,null,null,null,null,null,null,null,null,null,null,null,null,null,null,null,null,null,null,null,null,null,null,null,null,null,null,null,null,null,null,5.2974833540612283E-2,4.375000000000003E-3,0.71995488565421284,0.97959183673469263,25.953722590798758,14.889459738064181,0.57369264412739251,0.36706117985105963,214.15130964527128,0.34446140474276726,442.28448990581501,0.71141258459382661,500,0,0.44750189280645231,1.1000000000027654E-4,1.0000000000000001E-5,6.9289727842119255,1.4063984343457294,-0.71141258459382661,0,-1.1E-4,5.6255937373829175E-2,0,0,3.3750000000000021E-3,202.85610332670888,442.28448990581501,500]
[null,null,null,null,null,null,null,null,null,null,null,null,null,null,null,null,null,null,null,null,null,null,null,null,null,null,null,null,null,null,null,null,null,null,null,null,null,null,null,null,null,null,null,null,null,null,null,null,null,null,null,null,null,null,null,null,null,null,null,5.263910353425371E-2,4.5000000000000031E-3,0.69995613883048469,0.92592592592592449,25.914657953124571,14.746133160450668,0.56902673333076748,0.36418592950515549,215.93884989987006,0.34733665508867118,442.28448990581501,0.71141258459382661,500,0,0.44741449252055365,1.100000000000545E-4,1.0000000000000001E-5,6.9185435361407643,1.4465812467556072,-0.71141258459382661,0,-1.1E-4,5.7863249870224287E-2,0,0,3.3750000000000021E-3,202.85610332670888,442.28448990581501,500]
[null,null,null,null,null,null,null,null,null,null,null,null,null,null,null,null,null,null,null,null,null,null,null,null,null,null,null,null,null,null,null,null,null,null,null,null,null,null,null,null,null,null,null,null,null,null,null,null,null,null,null,null,null,null,null,null,null,null,null,5.232972757269494E-2,4.6250000000000032E-3,0.68103840534857962,0.87655222790357779,25.855355305780343,14.592225698235481,0.56437923693793435,0.36121699989688594,217.78463045787012,0.3503055846969409,442.28448990581501,0.71141258459382661,500,0,0.44732340189749137,1.1000000000027654E-4,1.0000000000000001E-5,6.9027112628303628,1.4867640591654852,-0.71141258459382661,0,-1.1E-4,5.9470562366619406E-2,0,0,3.3750000000000021E-3,202.85610332670888,442.28448990581501,500]
[null,null,null,null,null,null,null,null,null,null,null,null,null,null,null,null,null,null,null,null,null,null,null,null,null,null,null,null,null,null,null,null,null,null,null,null,null,null,null,null,null,null,null,null,null,null,null,null,null,null,null,null,null,null,null,null,null,null,null,5.2043590032250821E-2,4.7500000000000034E-3,0.66311634204993286,0.83102493074792139,25.777954375242402,14.429371264818835,0.55975625741183932,0.35816644388782282,219.68115806732754,0.35335614070600418,442.28448990581501,0.71141258459382661,500,0,0.4472293908351278,1.1000000000038757E-4,1.0000000000000001E-5,6.8820472159178712,1.5269468715753631,-0.71141258459382661,0,-1.1E-4,6.1077874863014532E-2,0,0,3.3750000000000021E-3,202.85610332670888,442.28448990581501,500]
[null,null,null,null,null,null,null,null,null,null,null,null,null,null,null,null,null,null,null,null,null,null,null,null,null,null,null,null,null,null,null,null,null,null,null,null,null,null,null,null,null,null,null,null,null,null,null,null,null,null,null,null,null,null,null,null,null,null,null,5.1778002383286989E-2,4.8750000000000035E-3,0.64611335892044741,0.78895463510848007,25.684425693164656,14.259046595318694,0.55516314694602753,0.35504577391532582,221.62127545748879,0.35647681067850073,442.28448990581501,0.71141258459382661,500,0,0.44713313980253078,1.0999999999994348E-4,1.0000000000000001E-5,6.8570774763981275,1.5671296839852411,-0.71141258459382661,0,-1.1E-4,6.2685187359409644E-2,0,0,3.3750000000000021E-3,202.85610332670888,442.28448990581501,500]
[null,null,null,null,null,null,null,null,null,null,null,null,null,null,null,null,null,null,null,null,null,null,null,null,null,null,null,null,null,null,null,null,null,null,null,null,null,null,null,null,null,null,null,null,null,null,null,null,null,null,null,null,null,null,null,null,null,null,null,5.1530638852195963E-2,5.0000000000000036E-3,0.62996052494743615,0.749999999999999,25.576577422880575,14.082580388280897,0.55060456899455001,0.35186587682988107,223.59821428433256,0.35965670776394526,442.28448990581501,0.71141258459382661,500,0,0.44703524823821983,1.0999999999972143E-4,1.0000000000000001E-5,6.8282847771231632,1.6073124963951193,-0.71141258459382661,0,-1.1E-4,6.4292499855804763E-2,0,0,3.3750000000000021E-3,202.85610332670888,442.28448990581501,500]
[null,null,null,null,null,null,null,null,null,null,null,null,null,null,null,null,null,null,null,null,null,null,null,null,null,null,null,null,null,null,null,null,null,null,null,null,null,null,null,null,null,null,null,null,null,null,null,null,null,null,null,null,null,null,null,null,null,null,null,null,null,null,null,null,null,null,null,{"$f":"CH53","v":202.85610332670888},0.32629311690088481,{"$f":"CI53","v":442.28448990581501},0.71141258459382661,{"$f":"CJ53","v":500},0]
[null,null,null,null,null,null,null,null,null,null,null,null,null,null,null,null,null,null,null,null,null,null,null,null,null,null,null,null,null,null,null,null,null,null,null,null,null,null,null,null,null,null,null,null,null,null,null,null,null,null,null,null,null,null,null,null,null,null,null,5.7203758460411647E-2,{"$f":"CG53","v":3.3750000000000021E-3},{"$f":"IF($CF$11=1,BI55/($CE$11*$CD$11),2^(1/3)*$CD$11/BI55)","v":0.93327485177397962},{"$f":"IF($CF$11=1,-($CE$11-2)*BI55/$CD$11,3*($CD$11/BI55)^2)","v":1.6460905349794217},{"$f":"IF(CF$11=1,0.5*(CE$11*BI55*BL$11/CD$11)*(1-CG54^2+(BJ55-BK55)*(BK55^2*(1-CG54^2)+2*BK55*(1-CG54)+2*LN((1-BK55)/(1-BK55*CG54)))/(BK55^3)),BL$11*BK55*(LN((1-BJ55+BJ55^2)/(1+BJ55)^2)/(6*BJ55)+ATAN((2-BJ55)/(BJ55*3^0.5))/(BJ55*3^0.5)-LN((CG54^2-BJ55*CG54+BJ55^2)/(CG54+BJ55)^2)/(6*BJ55)-ATAN((2*CG54-BJ55)/(BJ55*3^0.5))/(BJ55*3^0.5)))","v":25.22493253239724},{"$f":"IF(CF$11=1,(CE$11*BI55*BL$11/CD$11)*(1-CG54^3-(BJ55-BK55)*(-2*BK55^3*(1-CG54^3)-3*BK55^2*(1-CG54^2)-6*BK55*(1-CG54)-6*LN((1-BK55)/(1-BK55*CG54)))/(2*BK55^4))/3,BL$11*BK55*(LN((1+BJ55^3)/(BJ55^3+CG54^3)))/3)","v":15.403565537954769},{"$f":"BM55/BL55","v":0.6106484335754494},{"$f":"BL55*BH55*BJ$11","v":0.38523325895754501},{"$f":"MAX(MIN(BQ$11,CA$11*BP$11*BI55*(BH55-BO$11)/BH55),-BQ$11)","v":202.85374630130974},0.32628932563628155,{"$f":"MIN(BU$11,CA$11*BT$11*BI55*(BI$11-BH55-BS$11)/BH55)","v":442.28448990581501},0.71141258459382661,{"$f":"MIN($BY$11,CA$11*$BX$11*BI55*(BI$11-BH55-$BW$11)/BH55)","v":500},0,{"$f":"(0.5*BI$11-BH55+BN55*BH55)*BO55+(0.5*BI$11-BO$11)*BQ55+(0.5*BI$11-BS$11)*BS55+(0.5*BI$11-BW$11)*BU55","v":0.44793826577449758},{"$f":"BO55+BQ55-BS55-BU55","v":1.0999999999994348E-4},{"$f":"$CG$11+0.00001","v":1.0000000000000001E-5},{"$f":"BL55*BJ$11","v":6.7344046846877905},{"$f":"IF(BP54<BQ$11,CA$11*BI55*BN$11*BP$11,BN$11*BQ$11)","v":1.0849359350667054},{"$f":"IF(BR54<BU$11,CA$11*BI55*BR$11*BT$11,-BR$11*BU$11)","v":-0.71141258459382661},{"$f":"IF(BT54<BY$11,CA$11*BI55*$BV$11*$BX$11,-$BV$11*BY$11)","v":0},{"$f":"-(BX55+0.0001)","v":-1.1E-4},{"$f":"IF(BP54<BQ$11,BO$11*CA$11*BI55*BN$11*BP$11,0)","v":4.3397437402668215E-2},{"$f":"IF(BR54<BU$11,(BI$11-BS$11)*CA$11*BI55*BR$11*BT$11,0)","v":0},{"$f":"IF(BT54<BY$11,(BI$11-$BW$11)*CA$11*BI55*$BV$11*$BX$11,0)","v":0}]
[null,null,null,null,null,null,null,null,null,null,null,null,null,null,null,null,null,null,null,null,null,null,null,null,null,null,null,null,null,null,null,null,null,null,null,null,null,null,null,null,null,null,null,null,null,null,null,null,null,null,null,null,null,null,null,null,null,null,null,5.7203758460411647E-2,{"$f":"BI55","v":3.3750000000000021E-3},{"$f":"IF($CF$11=1,BI56/($CE$11*$CD$11),2^(1/3)*$CD$11/BI56)","v":0.93327485177397962},{"$f":"IF($CF$11=1,-($CE$11-2)*BI56/$CD$11,3*($CD$11/BI56)^2)","v":1.6460905349794217},{"$f":"IF(CF$11=1,0.5*(CE$11*BI56*BL$11/CD$11)*(1-CG55^2+(BJ56-BK56)*(BK56^2*(1-CG55^2)+2*BK56*(1-CG55)+2*LN((1-BK56)/(1-BK56*CG55)))/(BK56^3)),BL$11*BK56*(LN((1-BJ56+BJ56^2)/(1+BJ56)^2)/(6*BJ56)+ATAN((2-BJ56)/(BJ56*3^0.5))/(BJ56*3^0.5)-LN((CG55^2-BJ56*CG55+BJ56^2)/(CG55+BJ56)^2)/(6*BJ56)-ATAN((2*CG55-BJ56)/(BJ56*3^0.5))/(BJ56*3^0.5)))","v":25.22493253239724},{"$f":"IF(CF$11=1,(CE$11*BI56*BL$11/CD$11)*(1-CG55^3-(BJ56-BK56)*(-2*BK56^3*(1-CG55^3)-3*BK56^2*(1-CG55^2)-6*BK56*(1-CG55)-6*LN((1-BK56)/(1-BK56*CG55)))/(2*BK56^4))/3,BL$11*BK56*(LN((1+BJ56^3)/(BJ56^3+CG55^3)))/3)","v":15.403565537954769},{"$f":"BM56/BL56","v":0.6106484335754494},{"$f":"BL56*BH56*BJ$11","v":0.38523325895754501},{"$f":"MAX(MIN(BQ$11,CA$11*BP$11*BI56*(BH56-BO$11)/BH56),-BQ$11)","v":202.85374630130974},0.32628932563628155,{"$f":"MIN(BU$11,CA$11*BT$11*BI56*(BI$11-BH56-BS$11)/BH56)","v":442.28448990581501},0.71141258459382661,{"$f":"MIN($BY$11,CA$11*$BX$11*BI56*(BI$11-BH56-$BW$11)/BH56)","v":500},0,{"$f":"(0.5*BI$11-BH56+BN56*BH56)*BO56+(0.5*BI$11-BO$11)*BQ56+(0.5*BI$11-BS$11)*BS56+(0.5*BI$11-BW$11)*BU56","v":0.44793826577449758},{"$f":"BO56+BQ56-BS56-BU56","v":1.0999999999994348E-4},{"$f":"$CG$11+0.00001","v":1.0000000000000001E-5},{"$f":"BL56*BJ$11","v":6.7344046846877905},{"$f":"IF(BP55<BQ$11,CA$11*BI56*BN$11*BP$11,BN$11*BQ$11)","v":1.0849359350667054},{"$f":"IF(BR55<BU$11,CA$11*BI56*BR$11*BT$11,-BR$11*BU$11)","v":-0.71141258459382661},{"$f":"IF(BT55<BY$11,CA$11*BI56*$BV$11*$BX$11,-$BV$11*BY$11)","v":0},{"$f":"-(BX56+0.0001)","v":-1.1E-4},{"$f":"IF(BP55<BQ$11,BO$11*CA$11*BI56*BN$11*BP$11,0)","v":4.3397437402668215E-2},{"$f":"IF(BR55<BU$11,(BI$11-BS$11)*CA$11*BI56*BR$11*BT$11,0)","v":0},{"$f":"IF(BT55<BY$11,(BI$11-$BW$11)*CA$11*BI56*$BV$11*$BX$11,0)","v":0}]
[null,null,null,null,null,null,null,null,null,null,null,null,null,null,null,null,null,null,null,null,null,null,null,null,null,null,null,null,null,null,null,null,null,null,null,null,null,null,null,null,null,null,null,null,null,null,null,null,null,null,null,null,null,null,null,null,null,null,null,"hc","e0","a'","b'","N'","tN'","t'","Nc","sac","Nac","sat","Nat","sat","Nat","Mtot","N","N","A","B1","B2'","B2","B3","C1","C2","C2'"]
[]
[]
[]
[null,null,null,null,null,null,null,null,null,null,null,null,null,null,null,null,null,null,null,null,null,null,null,null,null,null,null,null,null,null,null,null,null,null,null,null,null,null,null,null,null,null,null,null,null,null,null,null,null,null,null,null,null,null,null,null,null,null,null,"FORSKYDNING"]
[]
[null,null,null,null,null,null,null,null,null,null,null,null,null,null,null,null,null,null,null,null,null,null,null,null,null,null,null,null,null,null,null,null,null,null,null,null,null,null,null,null,null,null,null,null,null,null,null,null,null,null,null,null,null,null,null,null,null,null,null,null,null,"V","v","f_cd","b","h","h_int","c","b","cot0","w","a","d","A","f_yd"]
[null,null,null,null,null,null,null,null,null,null,null,null,null,null,null,null,null,null,null,null,null,null,null,null,null,null,null,null,null,null,null,null,null,null,null,null,null,null,null,null,null,null,null,null,null,null,null,null,null,null,null,null,null,null,null,null,null,null,null," Betontrykbrud",null,{"$f":"1000*(BK64*BL64*BR64)/((1+BR64^2)*(1/(BM64*BO64)+BS64/((1.4*BQ64)*(BM64-BQ64*BM64)*(BN64-BQ64*BM64))))","v":851.06149826442231},{"$f":"0.7-$L$21/200","v":0.52499999999999991},{"$f":"AT29*$L$22","v":35},{"$f":"BJ11","v":0.26697414060626584},{"$f":"BI11","v":0.68348707030313294},{"$f":"$J$34/1000","v":0.63772762703806707},{"$f":"($N$13-AT40*L27)/1000","v":2.3487070303132934E-2},{"$f":"MIN(BN64/(2*(BM64+BN64)),0.5)","v":0.3595554781500101},{"$f":"$O$15","v":2.5},{"$f":"$O$33/(1000*BM64)","v":7.9466858783016167E-2}]
[null,null,null,null,null,null,null,null,null,null,null,null,null,null,null,null,null,null,null,null,null,null,null,null,null,null,null,null,null,null,null,null,null,null,null,null,null,null,null,null,null,null,null,null,null,null,null,null,null,null,null,null,null,null,null,null,null,null,null," Bøjler, type 1",null,{"$f":"MIN($BJ$64,1000*BV65*BW65*BR65/(BT65*(1/BO65+BS65*BM65/((BM65-BQ65*BM65)*(BN65-BQ65*BM65)))))","v":173.31200436000364},null,null,{"$f":"BM64","v":0.26697414060626584},{"$f":"BN64","v":0.68348707030313294},{"$f":"BO64","v":0.63772762703806707},{"$f":"BP64","v":2.3487070303132934E-2},{"$f":"MIN(BN65/(2*(BM65+BN65)),0.5)","v":0.3595554781500101},{"$f":"$O$15","v":2.5},{"$f":"BS64","v":7.9466858783016167E-2},{"$f":"$N$15/1000","v":0.15},{"$f":"M15","v":6},{"$f":"2*PI()*(BU65/1000)^2/4","v":5.6548667764616275E-5},{"$f":"AT27*O22","v":327.18963441063909}]
[null,null,null,null,null,null,null,null,null,null,null,null,null,null,null,null,null,null,null,null,null,null,null,null,null,null,null,null,null,null,null,null,null,null,null,null,null,null,null,null,null,null,null,null,null,null,null,null,null,null,null,null,null,null,null,null,null,null,null," Bøjler, type 2",null,{"$f":"MIN($BJ$64,1000*BV66*BW66*BR66/(BT66*(1/BO66+BS66*BM66/((BM66-BQ66*BM66)*(BN66-BQ66*BM66)))))","v":173.31200436000364},null,null,{"$f":"BM64","v":0.26697414060626584},{"$f":"BN65","v":0.68348707030313294},{"$f":"$J$34/1000","v":0.63772762703806707},{"$f":"BP64","v":2.3487070303132934E-2},0.3595554781500101,{"$f":"$O$15","v":2.5},{"$f":"BS64","v":7.9466858783016167E-2},{"$f":"$N$16/1000","v":0.15},{"$f":"M16","v":6},{"$f":"2*PI()*(BU66/1000)^2/4","v":5.6548667764616275E-5},{"$f":"BW65","v":327.18963441063909},null,null,null,null,"Vederlagsforankring",null,{"$f":"0.5*BS64*BM64*$AS$22*BR64/(MIN(BN64,BM64)*(1-BQ64))+0.5*$AS$22*BR64","v":84.334160866852187},"KN"]

{"sheet":"Brand2","index":3,"n_rows":101,"n_cols":66,"rows_kept":101,"cut":false,"hidden":false,"merged":[[84,2,84,5],[84,6,84,9]]}
[]
[]
[null,"Nedbøjninger",null,null,null,null,null,null,null,null,"p/P","x1","x2","R1","R2",0,1,2,3,4,5,6,7,8,9,10,11,12,13,14,15,16,17,18,19,20,21,22,23,24,25,26,27,28,29,30,31,32,33,34,35,36,37,38,39,40]
[null,"L","(m)",{"$f":"Brand!L8","v":5},null,null,null,null,null,null,null,null,null,null,null,0,{"$f":"Q3*($BD$4-$P$4)/40","v":0.125},0.25,0.375,0.5,0.625,0.75,0.875,1,1.125,1.25,1.375,1.5,1.625,1.75,1.875,2,2.125,2.25,2.375,2.5,2.625,2.75,2.875,3,3.125,3.25,3.375,3.5,3.625,3.75,3.875,4,4.125,4.25,4.375,4.5,4.625,4.75,4.875,{"$f":"$D$4","v":5},{"$f":"L18","v":1},{"$f":"L22","v":1.5},{"$f":"L26","v":2}]
[]
[null,null,null,null,null,null,null,null,"p1","L",{"$f":"D12","v":0},{"$f":"D16","v":0},{"$f":"D17","v":5},{"$f":"(M6-L6)*K6-O6","v":0},{"$f":"0.5*K6*(M6^2-L6^2)/$D$4","v":0},{"$f":"$N6*P$4-IF(P$4>$L6,0.5*($L6-P$4)^2*$K6)+IF(P$4>$M6,0.5*(P$4-$M6)^2*$K6)","v":0},0,0,0,0,0,0,0,0,0,{"$f":"$N6*Z$4-IF(Z$4>$L6,0.5*($L6-Z$4)^2*$K6)+IF(Z$4>$M6,0.5*(Z$4-$M6)^2*$K6)","v":0},0,0,0,0,0,0,0,0,0,{"$f":"$N6*AJ$4-IF(AJ$4>$L6,0.5*($L6-AJ$4)^2*$K6)+IF(AJ$4>$M6,0.5*(AJ$4-$M6)^2*$K6)","v":0},0,0,0,0,0,0,0,0,0,{"$f":"$N6*AT$4-IF(AT$4>$L6,0.5*($L6-AT$4)^2*$K6)+IF(AT$4>$M6,0.5*(AT$4-$M6)^2*$K6)","v":0},0,0,0,0,0,0,0,0,0,0,0,0,0]
[null,null,null,null,null,null,null,null,"p1","K",{"$f":"D13","v":5},{"$f":"D16","v":0},{"$f":"D17","v":5},{"$f":"(M7-L7)*K7-O7","v":12.5},{"$f":"0.5*K7*(M7^2-L7^2)/$D$4","v":12.5},0,1.5234375,2.96875,4.3359375,5.625,6.8359375,7.96875,9.0234375,10,10.8984375,11.71875,12.4609375,13.125,13.7109375,14.21875,14.6484375,15,15.2734375,15.46875,15.5859375,15.625,15.5859375,15.46875,15.2734375,15,14.6484375,14.21875,13.7109375,13.125,12.4609375,11.71875,10.8984375,10,9.0234375,7.96875,6.8359375,5.625,4.3359375,2.96875,1.5234375,0,10,13.125,15]
[null,null,null,null,null,null,null,null,"p1","d",{"$f":"D14","v":5},{"$f":"D16","v":0},{"$f":"D17","v":5},{"$f":"(M8-L8)*K8-O8","v":12.5},{"$f":"0.5*K8*(M8^2-L8^2)/$D$4","v":12.5},0,1.5234375,2.96875,4.3359375,5.625,6.8359375,7.96875,9.0234375,10,10.8984375,11.71875,12.4609375,13.125,13.7109375,14.21875,14.6484375,15,15.2734375,15.46875,15.5859375,15.625,15.5859375,15.46875,15.2734375,15,14.6484375,14.21875,13.7109375,13.125,12.4609375,11.71875,10.8984375,10,9.0234375,7.96875,6.8359375,5.625,4.3359375,2.96875,1.5234375,0,10,13.125,15]
[]
[null,null,null,null,null,null,null,null,"p2","L",{"$f":"E12","v":0},{"$f":"E16","v":1},{"$f":"E17","v":3},{"$f":"(M10-L10)*K10-O10","v":0},{"$f":"0.5*K10*(M10^2-L10^2)/$D$4","v":0},{"$f":"$N10*P$4-IF(P$4>$L10,0.5*($L10-P$4)^2*$K10)+IF(P$4>$M10,0.5*(P$4-$M10)^2*$K10)+IF(P$4>$D$4,(P$4-$D$4)*$O10)","v":0},{"$f":"$N10*Q$4-IF(Q$4>$L10,0.5*($L10-Q$4)^2*$K10)+IF(Q$4>$M10,0.5*(Q$4-$M10)^2*$K10)","v":0},0,0,0,0,0,0,0,0,0,{"$f":"$N10*AA$4-IF(AA$4>$L10,0.5*($L10-AA$4)^2*$K10)+IF(AA$4>$M10,0.5*(AA$4-$M10)^2*$K10)","v":0},0,0,0,0,0,0,0,0,0,{"$f":"$N10*AK$4-IF(AK$4>$L10,0.5*($L10-AK$4)^2*$K10)+IF(AK$4>$M10,0.5*(AK$4-$M10)^2*$K10)","v":0},0,0,0,0,0,0,0,0,0,{"$f":"$N10*AU$4-IF(AU$4>$L10,0.5*($L10-AU$4)^2*$K10)+IF(AU$4>$M10,0.5*(AU$4-$M10)^2*$K10)","v":0},0,0,0,0,0,0,0,0,0,0,0,0]
[null,"Jævnt fordelte laste",null,"p1","p2","p3",null,null,"p2","K",{"$f":"E13","v":9},{"$f":"E16","v":1},{"$f":"E17","v":3},{"$f":"(M11-L11)*K11-O11","v":10.8},{"$f":"0.5*K11*(M11^2-L11^2)/$D$4","v":7.2},{"$f":"$N11*P$4-IF(P$4>$L11,0.5*($L11-P$4)^2*$K11)+IF(P$4>$M11,0.5*(P$4-$M11)^2*$K11)+IF(P$4>$D$4,(P$4-$D$4)*$O11)","v":0},1.35,2.7,4.0500000000000007,5.4,6.75,8.1000000000000014,9.4500000000000011,10.8,12.0796875,13.21875,14.217187500000001,15.075000000000003,15.792187500000001,16.368750000000002,16.8046875,17.100000000000001,17.254687500000003,17.268750000000001,17.142187500000002,16.875,16.467187500000001,15.918750000000003,15.229687500000001,14.400000000000006,13.5,12.600000000000001,11.700000000000003,10.800000000000004,9.9000000000000057,9,8.1000000000000014,7.2000000000000028,6.3000000000000043,5.4000000000000057,4.5,3.6000000000000014,2.7000000000000028,1.8000000000000043,0.90000000000000568,0,10.8,15.075000000000003,17.100000000000001]
[null,null,null,null,null,null,null,null,"p2","d",{"$f":"E14","v":7.8},{"$f":"E16","v":1},{"$f":"E17","v":3},{"$f":"(M12-L12)*K12-O12","v":9.36},{"$f":"0.5*K12*(M12^2-L12^2)/$D$4","v":6.24},{"$f":"$N12*P$4-IF(P$4>$L12,0.5*($L12-P$4)^2*$K12)+IF(P$4>$M12,0.5*(P$4-$M12)^2*$K12)+IF(P$4>$D$4,(P$4-$D$4)*$O12)","v":0},1.17,2.34,3.51,4.68,5.85,7.02,8.19,9.36,10.4690625,11.456249999999999,12.321562499999999,13.065,13.686562499999999,14.186249999999999,14.564062499999997,14.819999999999999,14.954062500000001,14.966249999999999,14.856562499999997,14.624999999999998,14.2715625,13.796249999999999,13.199062499999997,12.479999999999999,11.700000000000001,10.92,10.139999999999999,9.3599999999999977,8.5800000000000018,7.7999999999999954,7.0199999999999978,6.2399999999999967,5.4599999999999991,4.68,3.8999999999999968,3.1199999999999992,2.3399999999999981,1.5599999999999934,0.77999999999999403,0,9.36,13.065,14.819999999999999]
[null,"Kar. værdi","(kN/m)",{"$f":"Brand2!D88*D26","v":5},{"$f":"Brand2!E88*D26","v":9},{"$f":"Brand2!F88*D26","v":10}]
[null,"Regnm. værdi","(kN/m)",{"$f":"Brand2!D89*D26","v":5},{"$f":"Brand2!E89*D26","v":7.8},{"$f":"Brand2!F89*D26","v":7.2},null,null,"p3","L",{"$f":"F12","v":0},{"$f":"F16","v":2},{"$f":"F17","v":4},{"$f":"(M14-L14)*K14-O14","v":0},{"$f":"0.5*K14*(M14^2-L14^2)/$D$4","v":0},{"$f":"$N14*P$4-IF(P$4>$L14,0.5*($L14-P$4)^2*$K14)+IF(P$4>$M14,0.5*(P$4-$M14)^2*$K14)+IF(P$4>$D$4,(P$4-$D$4)*$O14)","v":0},{"$f":"$N14*Q$4-IF(Q$4>$L14,0.5*($L14-Q$4)^2*$K14)+IF(Q$4>$M14,0.5*(Q$4-$M14)^2*$K14)","v":0},0,0,0,0,0,0,0,0,0,{"$f":"$N14*AA$4-IF(AA$4>$L14,0.5*($L14-AA$4)^2*$K14)+IF(AA$4>$M14,0.5*(AA$4-$M14)^2*$K14)","v":0},0,0,0,0,0,0,0,0,0,{"$f":"$N14*AK$4-IF(AK$4>$L14,0.5*($L14-AK$4)^2*$K14)+IF(AK$4>$M14,0.5*(AK$4-$M14)^2*$K14)","v":0},0,0,0,0,0,0,0,0,0,{"$f":"$N14*AU$4-IF(AU$4>$L14,0.5*($L14-AU$4)^2*$K14)+IF(AU$4>$M14,0.5*(AU$4-$M14)^2*$K14)","v":0},0,0,0,0,0,0,0,0,0,0,0,0]
[null,"exc","(m)",{"$f":"Brand2!D90","v":25},{"$f":"Brand2!E90","v":15},{"$f":"Brand2!F90","v":25},null,null,"p3","K",{"$f":"F13","v":10},{"$f":"F16","v":2},{"$f":"F17","v":4},{"$f":"(M15-L15)*K15-O15","v":8},{"$f":"0.5*K15*(M15^2-L15^2)/$D$4","v":12},{"$f":"$N15*P$4-IF(P$4>$L15,0.5*($L15-P$4)^2*$K15)+IF(P$4>$M15,0.5*(P$4-$M15)^2*$K15)+IF(P$4>$D$4,(P$4-$D$4)*$O15)","v":0},1,2,3,4,5,6,7,8,9,10,11,12,13,14,15,16,16.921875,17.6875,18.296875,18.75,19.046875,19.1875,19.171875,19,18.671875,18.1875,17.546875,16.75,15.796875,14.6875,13.421875,12,10.5,9,7.5,6,4.5,3,1.5,0,8,12,16]
[null,"x1","(m)",{"$f":"Brand2!D91","v":0},{"$f":"Brand2!E91","v":1},{"$f":"Brand2!F91","v":2},null,null,"p3","d",{"$f":"F14","v":7.2},{"$f":"F16","v":2},{"$f":"F17","v":4},{"$f":"(M16-L16)*K16-O16","v":5.76},{"$f":"0.5*K16*(M16^2-L16^2)/$D$4","v":8.64},{"$f":"$N16*P$4-IF(P$4>$L16,0.5*($L16-P$4)^2*$K16)+IF(P$4>$M16,0.5*(P$4-$M16)^2*$K16)+IF(P$4>$D$4,(P$4-$D$4)*$O16)","v":0},0.72,1.44,2.16,2.88,3.5999999999999996,4.32,5.04,5.76,6.4799999999999995,7.1999999999999993,7.92,8.64,9.36,10.08,10.799999999999999,11.52,12.18375,12.734999999999999,13.17375,13.499999999999998,13.713749999999999,13.815,13.803749999999999,13.680000000000001,13.44375,13.094999999999999,12.633749999999997,12.06,11.373749999999999,10.574999999999998,9.6637500000000003,8.6399999999999988,7.5599999999999969,6.4799999999999986,5.3999999999999968,4.3199999999999985,3.2399999999999984,2.1599999999999979,1.079999999999997,0,5.76,8.64,11.52]
[null,"x2","(m)",{"$f":"Brand2!D92","v":5},{"$f":"Brand2!E92","v":3},{"$f":"Brand2!F92","v":4}]
[null,null,null,null,null,null,null,null,"P1","L",{"$f":"D20","v":0},{"$f":"D24","v":1},null,{"$f":"K18-O18","v":0},{"$f":"K18*L18/$D$4","v":0},{"$f":"$N18*P$4-IF(P$4>$L18,(P$4-$L18)*$K18)","v":0},0,0,0,0,0,0,0,0,0,{"$f":"$N18*Z$4-IF(Z$4>$L18,(Z$4-$L18)*$K18)","v":0},0,0,0,0,0,0,0,0,0,{"$f":"$N18*AJ$4-IF(AJ$4>$L18,(AJ$4-$L18)*$K18)","v":0},0,0,0,0,0,0,0,0,0,{"$f":"$N18*AT$4-IF(AT$4>$L18,(AT$4-$L18)*$K18)","v":0},0,0,0,0,0,0,0,0,0,0,0,0,0]
[null,"Punktlaste",null,"P1","P2","P3",null,null,"P1","K",{"$f":"D21","v":15},{"$f":"D24","v":1},null,{"$f":"K19-O19","v":12},{"$f":"K19*L19/$D$4","v":3},0,1.5,3,4.5,6,7.5,9,10.5,12,11.625,11.25,10.875,10.5,10.125,9.75,9.375,9,8.625,8.25,7.875,7.5,7.125,6.75,6.375,6,5.625,5.25,4.875,4.5,4.125,3.75,3.375,3,2.625,2.25,1.875,1.5,1.125,0.75,0.375,0,12,10.5,9]
[null,null,null,null,null,null,null,null,"P1","d",{"$f":"D22","v":15},{"$f":"D24","v":1},null,{"$f":"K20-O20","v":12},{"$f":"K20*L20/$D$4","v":3},0,1.5,3,4.5,6,7.5,9,10.5,12,11.625,11.25,10.875,10.5,10.125,9.75,9.375,9,8.625,8.25,7.875,7.5,7.125,6.75,6.375,6,5.625,5.25,4.875,4.5,4.125,3.75,3.375,3,2.625,2.25,1.875,1.5,1.125,0.75,0.375,0,12,10.5,9]
[null,"Kar. værdi","(kN)",{"$f":"Brand2!H88*D26","v":15},{"$f":"Brand2!I88*D26","v":12},{"$f":"Brand2!J88*D26","v":22}]
[null,"Regnm. værdi","(kN)",{"$f":"Brand2!H89*D26","v":15},{"$f":"Brand2!I89*D26","v":12},{"$f":"Brand2!J89*D26","v":20},null,null,"P2","L",{"$f":"E20","v":0},{"$f":"E24","v":1.5},null,{"$f":"K22-O22","v":0},{"$f":"K22*L22/$D$4","v":0},{"$f":"$N22*P$4-IF(P$4>$L22,(P$4-$L22)*$K22)","v":0},0,0,0,0,0,0,0,0,0,{"$f":"$N22*Z$4-IF(Z$4>$L22,(Z$4-$L22)*$K22)","v":0},0,0,0,0,0,0,0,0,0,{"$f":"$N22*AJ$4-IF(AJ$4>$L22,(AJ$4-$L22)*$K22)","v":0},0,0,0,0,0,0,0,0,0,{"$f":"$N22*AT$4-IF(AT$4>$L22,(AT$4-$L22)*$K22)","v":0},0,0,0,0,0,0,0,0,0,0,0,0,0]
[null,"exc","(m)",{"$f":"Brand2!H90","v":10},{"$f":"Brand2!I90","v":15},{"$f":"Brand2!J90","v":20},null,null,"P2","K",{"$f":"E21","v":12},{"$f":"E24","v":1.5},null,{"$f":"K23-O23","v":8.4},{"$f":"K23*L23/$D$4","v":3.6},0,1.05,2.1,3.1500000000000004,4.2,5.25,6.3000000000000007,7.3500000000000005,8.4,9.4500000000000011,10.5,11.55,12.600000000000001,12.15,11.700000000000001,11.25,10.8,10.350000000000001,9.9000000000000021,9.4499999999999993,9,8.5500000000000007,8.1000000000000014,7.6500000000000021,7.2000000000000028,6.75,6.3000000000000007,5.8500000000000014,5.4000000000000021,4.9500000000000028,4.5,4.0500000000000043,3.6000000000000014,3.1499999999999986,2.7000000000000028,2.25,1.8000000000000043,1.3500000000000014,0.89999999999999858,0.45000000000000284,0,8.4,12.600000000000001,10.8]
[null,"x","(m)",{"$f":"Brand2!H91","v":1},{"$f":"Brand2!I91","v":1.5},{"$f":"Brand2!J91","v":2},null,null,"P2","d",{"$f":"E22","v":12},{"$f":"E24","v":1.5},null,{"$f":"K24-O24","v":8.4},{"$f":"K24*L24/$D$4","v":3.6},0,1.05,2.1,3.1500000000000004,4.2,5.25,6.3000000000000007,7.3500000000000005,8.4,9.4500000000000011,10.5,11.55,12.600000000000001,12.15,11.700000000000001,11.25,10.8,10.350000000000001,9.9000000000000021,9.4499999999999993,9,8.5500000000000007,8.1000000000000014,7.6500000000000021,7.2000000000000028,6.75,6.3000000000000007,5.8500000000000014,5.4000000000000021,4.9500000000000028,4.5,4.0500000000000043,3.6000000000000014,3.1499999999999986,2.7000000000000028,2.25,1.8000000000000043,1.3500000000000014,0.89999999999999858,0.45000000000000284,0,8.4,12.600000000000001,10.8]
[]
[null,"Inddatatest",{"$f":"MAX(Brand!BC16:BC45)","v":0},{"$f":"IF(C26=1,0,1)","v":1},null,null,null,null,"P3","L",{"$f":"F20","v":0},{"$f":"F24","v":2},null,{"$f":"K26-O26","v":0},{"$f":"K26*L26/$D$4","v":0},{"$f":"$N26*P$4-IF(P$4>$L26,(P$4-$L26)*$K26)","v":0},0,0,0,0,0,0,0,0,0,{"$f":"$N26*Z$4-IF(Z$4>$L26,(Z$4-$L26)*$K26)","v":0},0,0,0,0,0,0,0,0,0,{"$f":"$N26*AJ$4-IF(AJ$4>$L26,(AJ$4-$L26)*$K26)","v":0},0,0,0,0,0,0,0,0,0,{"$f":"$N26*AT$4-IF(AT$4>$L26,(AT$4-$L26)*$K26)","v":0},0,0,0,0,0,0,0,0,0,0,0,0,0]
[null,null,null,null,null,null,null,null,"P3","K",{"$f":"F21","v":22},{"$f":"F24","v":2},null,{"$f":"K27-O27","v":13.2},{"$f":"K27*L27/$D$4","v":8.8000000000000007},0,1.65,3.3,4.9499999999999993,6.6,8.25,9.8999999999999986,11.549999999999999,13.2,14.85,16.5,18.149999999999999,19.799999999999997,21.45,23.099999999999998,24.75,26.4,25.299999999999997,24.2,23.099999999999998,22,20.9,19.799999999999997,18.699999999999996,17.599999999999994,16.5,15.399999999999999,14.299999999999997,13.199999999999996,12.099999999999994,11,9.8999999999999986,8.7999999999999972,7.6999999999999957,6.5999999999999943,5.5,4.3999999999999986,3.2999999999999972,2.1999999999999957,1.0999999999999943,0,13.2,19.799999999999997,26.4]
[null,null,null,null,null,null,null,null,"P3","d",{"$f":"F22","v":20},{"$f":"F24","v":2},null,{"$f":"K28-O28","v":12},{"$f":"K28*L28/$D$4","v":8},0,1.5,3,4.5,6,7.5,9,10.5,12,13.5,15,16.5,18,19.5,21,22.5,24,23,22,21,20,19,18,17,16,15,14,13,12,11,10,9,8,7,6,5,4,3,2,1,0,12,18,24]
[]
[null,null,null,null,null,null,null,null,"MOMENTER",null,null,null,null,null,"punkt",{"$f":"P3","v":0},1,2,3,4,5,6,7,8,9,10,11,12,13,14,15,16,17,18,19,20,21,22,23,24,25,26,27,28,29,30,31,32,33,34,35,36,37,38,39,40,{"$f":"BE4*40/$D$4","v":8},{"$f":"BF4*40/$D$4","v":12},{"$f":"BG4*40/$D$4","v":16}]
[null,null,null,null,null,null,null,null,null,null,null,null,null,null," :    ",{"$f":"P7+P11+P15+P19+P23+P27","v":0},8.0734374999999989,16.068749999999998,23.985937500000002,31.824999999999996,39.5859375,47.268750000000004,54.873437500000001,62.399999999999991,67.903125000000003,73.1875,78.253125000000011,83.1,86.228125000000006,89.137500000000003,91.828125,94.300000000000011,93.725000000000009,92.775000000000006,91.45,89.75,87.675000000000011,85.225000000000009,82.4,79.2,75.6953125,71.956250000000011,67.982812499999994,63.774999999999999,59.332812500000003,54.65625,49.745312500000004,44.6,39.298437499999999,33.918750000000003,28.4609375,22.925000000000004,17.310937500000001,11.618749999999999,5.8484375000000028,0,62.399999999999991,83.1,94.300000000000011]
[null,null,null,null,null,null,null,null,null,null,null,null,null,null," :    ",{"$f":"P8+P12+P16+P20+P24+P28","v":0},7.4634374999999995,14.848749999999999,22.1559375,29.384999999999998,36.535937500000003,43.608750000000001,50.603437499999998,57.519999999999996,62.422499999999999,67.125,71.627499999999998,75.930000000000007,78.532499999999999,80.935000000000002,83.137499999999989,85.14,84.38624999999999,83.320000000000007,81.941249999999997,80.25,78.246250000000003,75.930000000000007,73.301249999999996,70.36,67.167187500000011,63.783749999999998,60.209687500000001,56.445000000000007,52.489687500000002,48.343749999999993,44.007187500000001,39.479999999999997,34.818437499999995,30.078749999999999,25.260937499999994,20.365000000000002,15.390937499999998,10.33874999999999,5.2084374999999934,0,57.519999999999996,75.930000000000007,85.14]
[]
[null,null,null,null,null,null,null,null,null,null,"p/P","x1","x2",null,null,0,1,2,3,4,5,6,7,8,9,10,11,12,13,14,15,16,17,18,19,20,21,22,23,24,25,26,27,28,29,30,31,32,33,34,35,36,37,38,39,40,null,null,null,null,null,"hi cot 0","L-hi cot 0",null,"½hi cot 0","L-½hi cot 0"]
[null,null,null,null,null,null,null,null,null,null,null,null,null,null,null,0,{"$f":"Q34*($BD$4-$P$4)/40","v":0.125},0.25,0.375,0.5,0.625,0.75,0.875,1,1.125,1.25,1.375,1.5,1.625,1.75,1.875,2,2.125,2.25,2.375,2.5,2.625,2.75,2.875,3,3.125,3.25,3.375,3.5,3.625,3.75,3.875,4,4.125,4.25,4.375,4.5,4.625,4.75,4.875,{"$f":"$D$4","v":5},0,{"$f":"Brand!AS16*Brand!O15/1000","v":1.5943190675951677},{"$f":"BH35-Brand!AS16*Brand!O15/1000","v":3.4056809324048323},{"$f":"Brand!L8","v":5},null,{"$f":"BF35","v":1.5943190675951677},{"$f":"BG35","v":3.4056809324048323},null,{"$f":"0.5*BJ35","v":0.79715953379758386},{"$f":"BH35-BM35","v":4.2028404662024164}]
[null,null,null,null,null,null,null,null,"Venstresidig forskydning"]
[null,"Excentriciteter",null,null,null,null,null,null,{"$f":"I8","v":"p1"},{"$f":"J8","v":"d"},{"$f":"K8","v":5},{"$f":"L8","v":0},{"$f":"M8","v":5},null,null,{"$f":"IF(P$35<=$L37,$K37*($M37-$L37)*($D$4-0.5*($L37+$M37))/$D$4,IF(P$35<=$M37,$K37*($M37-P$35)*($D$4-0.5*(P$35+$M37))/$D$4,0))","v":12.5},11.8828125,11.28125,10.6953125,10.125,9.5703125,9.03125,8.5078125,8,7.5078125,{"$f":"IF(Z$35<=$L37,$K37*($M37-$L37)*($D$4-0.5*($L37+$M37))/$D$4,IF(Z$35<=$M37,$K37*($M37-Z$35)*($D$4-0.5*(Z$35+$M37))/$D$4,0))","v":7.03125},6.5703125,6.125,5.6953125,5.28125,4.8828125,4.5,4.1328125,3.78125,3.4453125,{"$f":"IF(AJ$35<=$L37,$K37*($M37-$L37)*($D$4-0.5*($L37+$M37))/$D$4,IF(AJ$35<=$M37,$K37*($M37-AJ$35)*($D$4-0.5*(AJ$35+$M37))/$D$4,0))","v":3.125},2.8203125,2.53125,2.2578125,2,1.7578125,1.53125,1.3203125,1.125,0.9453125,{"$f":"IF(AT$35<=$L37,$K37*($M37-$L37)*($D$4-0.5*($L37+$M37))/$D$4,IF(AT$35<=$M37,$K37*($M37-AT$35)*($D$4-0.5*(AT$35+$M37))/$D$4,0))","v":0.78125},0.6328125,0.5,0.3828125,0.28125,0.1953125,0.125,7.03125E-2,3.125E-2,7.8125E-3,0,null,null,null,null,null,{"$f":"IF(BJ$35<=$L37,$K37*($M37-$L37)*($D$4-0.5*($L37+$M37))/$D$4,IF(BJ$35<=$M37,$K37*($M37-BJ$35)*($D$4-0.5*(BJ$35+$M37))/$D$4,0))","v":5.7993313066729248},1.2709266446487621,null,{"$f":"IF(BM$35<=$L37,$K37*($M37-$L37)*($D$4-0.5*($L37+$M37))/$D$4,IF(BM$35<=$M37,$K37*($M37-BM$35)*($D$4-0.5*(BM$35+$M37))/$D$4,0))","v":8.8319339921742728},0.31773166116219009]
[null,"exc. p_1","(mm)",{"$f":"D15","v":25},null,null,null,null,{"$f":"I12","v":"p2"},{"$f":"J12","v":"d"},{"$f":"K12","v":7.8},{"$f":"L12","v":1},{"$f":"M12","v":3},null,null,9.36,9.36,9.36,9.36,9.36,9.36,9.36,9.36,9.36,8.5921874999999996,7.8487499999999999,7.1296875000000002,6.4349999999999996,5.7646875,5.1187500000000004,4.4971875000000008,3.9,3.3271875,2.7787499999999996,2.2546875000000002,1.7550000000000001,1.2796875000000001,0.82874999999999999,0.40218749999999998,0,0,0,0,0,0,0,0,0,0,0,0,0,0,0,0,0,null,null,null,null,null,5.9269568384097617,0,null,9.36,0]
[null,"exc. p_2","(mm)",{"$f":"E15","v":15},null,null,null,null,{"$f":"I16","v":"p3"},{"$f":"J16","v":"d"},{"$f":"K16","v":7.2},{"$f":"L16","v":2},{"$f":"M16","v":4},null,null,5.76,5.76,5.76,5.76,5.76,5.76,5.76,5.76,5.76,5.76,5.76,5.76,5.76,5.76,5.76,5.76,5.76,5.2312500000000002,4.7249999999999996,4.24125,3.7800000000000002,3.3412500000000001,2.9249999999999998,2.53125,2.16,1.81125,1.4850000000000001,1.1812499999999999,0.9,0.6412500000000001,0.40499999999999997,0.19125,0,0,0,0,0,0,0,0,0,null,null,null,null,null,5.76,1.110134368294218,null,5.76,0]
[null,"exc. p_3","(mm)",{"$f":"F15","v":25},null,null,null,null,{"$f":"I20","v":"P1"},{"$f":"J20","v":"d"},{"$f":"K20","v":15},{"$f":"L20","v":1},{"$f":"M20","v":0},null,null,{"$f":"IF(P$35<=$L40,$K40*($D$4-$L40)/$D$4,0)","v":12},12,12,12,12,12,12,12,12,0,{"$f":"IF(Z$35<=$L40,$K40*($D$4-$L40)/$D$4,0)","v":0},0,0,0,0,0,0,0,0,0,{"$f":"IF(AJ$35<=$L40,$K40*($D$4-$L40)/$D$4,0)","v":0},0,0,0,0,0,0,0,0,0,{"$f":"IF(AT$35<=$L40,$K40*($D$4-$L40)/$D$4,0)","v":0},0,0,0,0,0,0,0,0,0,0,null,null,null,null,null,{"$f":"IF(BJ$35<=$L40,$K40*($D$4-$L40)/$D$4,0)","v":0},0,null,{"$f":"IF(BM$35<=$L40,$K40*($D$4-$L40)/$D$4,0)","v":12},0]
[null,"exc. P_1","(mm)",{"$f":"D23","v":10},null,null,null,null,{"$f":"I24","v":"P2"},{"$f":"J24","v":"d"},{"$f":"K24","v":12},{"$f":"L24","v":1.5},{"$f":"M24","v":0},null,null,8.4,8.4,8.4,8.4,8.4,8.4,8.4,8.4,8.4,8.4,8.4,8.4,8.4,0,0,0,0,0,0,0,0,0,0,0,0,0,0,0,0,0,0,0,0,0,0,0,0,0,0,0,0,null,null,null,null,null,0,0,null,8.4,0]
[null,"exc. P_2","(mm)",{"$f":"E23","v":15},null,null,null,null,{"$f":"I28","v":"P3"},{"$f":"J28","v":"d"},{"$f":"K28","v":20},{"$f":"L28","v":2},{"$f":"M28","v":0},null,null,12,12,12,12,12,12,12,12,12,12,12,12,12,12,12,12,12,0,0,0,0,0,0,0,0,0,0,0,0,0,0,0,0,0,0,0,0,0,0,0,0,null,null,null,null,null,12,0,null,12,0]
[null,"exc. P_3","(mm)",{"$f":"F23","v":20},null,null,null,null,"Højresidig forskydning"]
[null,null,null,null,null,null,null,null,{"$f":"I37","v":"p1"},"d",5,0,5,null,null,{"$f":"IF(P$35<$L44,0,IF(P$35<$M44,$K44*(P$35-$L44)*0.5*($L44+P$35)/$D$4,$K44*($M44-$L44)*0.5*($L44+$M44)/$D$4))","v":0},7.8125E-3,3.125E-2,7.03125E-2,0.125,0.1953125,0.28125,0.3828125,0.5,0.6328125,{"$f":"IF(Z$35<$L44,0,IF(Z$35<$M44,$K44*(Z$35-$L44)*0.5*($L44+Z$35)/$D$4,$K44*($M44-$L44)*0.5*($L44+$M44)/$D$4))","v":0.78125},0.9453125,1.125,1.3203125,1.53125,1.7578125,2,2.2578125,2.53125,2.8203125,{"$f":"IF(AJ$35<$L44,0,IF(AJ$35<$M44,$K44*(AJ$35-$L44)*0.5*($L44+AJ$35)/$D$4,$K44*($M44-$L44)*0.5*($L44+$M44)/$D$4))","v":3.125},3.4453125,3.78125,4.1328125,4.5,4.8828125,5.28125,5.6953125,6.125,6.5703125,{"$f":"IF(AT$35<$L44,0,IF(AT$35<$M44,$K44*(AT$35-$L44)*0.5*($L44+AT$35)/$D$4,$K44*($M44-$L44)*0.5*($L44+$M44)/$D$4))","v":7.03125},7.5078125,8,8.5078125,9.03125,9.5703125,10.125,10.6953125,11.28125,11.8828125,12.5,null,null,null,null,null,{"$f":"IF(BJ$35<$L44,0,IF(BJ$35<$M44,$K44*(BJ$35-$L44)*0.5*($L44+BJ$35)/$D$4,$K44*($M44-$L44)*0.5*($L44+$M44)/$D$4))","v":1.2709266446487626},5.799331306672924,null,{"$f":"IF(BM$35<$L44,0,IF(BM$35<$M44,$K44*(BM$35-$L44)*0.5*($L44+BM$35)/$D$4,$K44*($M44-$L44)*0.5*($L44+$M44)/$D$4))","v":0.31773166116219065},8.8319339921742728]
[null,null,null,null,null,null,null,null,"p2","d",7.8,1,3,null,null,0,0,0,0,0,0,0,0,0,0.2071875,0.43875000000000003,0.6946874999999999,0.97499999999999998,1.2796875000000001,1.6087499999999999,1.9621875,2.34,2.7421875,3.1687500000000002,3.6196874999999999,4.0949999999999998,4.5946875,5.1187500000000004,5.6671874999999998,6.24,6.24,6.24,6.24,6.24,6.24,6.24,6.24,6.24,6.24,6.24,6.24,6.24,6.24,6.24,6.24,6.24,null,null,null,null,null,1.2026455656520694,6.24,null,0,6.24]
[null,null,null,null,null,null,null,null,"p3","d",7.2,2,4,null,null,0,0,0,0,0,0,0,0,0,0,0,0,0,0,0,0,0,0.37124999999999997,0.76500000000000001,1.1812499999999999,1.6199999999999999,2.0812499999999998,2.5650000000000004,3.07125,3.6,4.1512499999999992,4.7249999999999996,5.32125,5.94,6.5812499999999998,7.2450000000000001,7.9312500000000004,8.64,8.64,8.64,8.64,8.64,8.64,8.64,8.64,8.64,null,null,null,null,null,0,5.471037081609011,null,0,8.64]
[null,null,null,null,null,null,null,null,"P1","d",15,1,0,null,null,{"$f":"IF(P$35<$L47,0,$K47*$L47/$D$4)","v":0},0,0,0,0,0,0,0,3,3,{"$f":"IF(Z$35<$L47,0,$K47*$L47/$D$4)","v":3},3,3,3,3,3,3,3,3,3,{"$f":"IF(AJ$35<$L47,0,$K47*$L47/$D$4)","v":3},3,3,3,3,3,3,3,3,3,{"$f":"IF(AT$35<$L47,0,$K47*$L47/$D$4)","v":3},3,3,3,3,3,3,3,3,3,3,null,null,null,null,null,{"$f":"IF(BJ$35<$L47,0,$K47*$L47/$D$4)","v":3},3,null,{"$f":"IF(BM$35<$L47,0,$K47*$L47/$D$4)","v":0},3]
[null,null,null,null,null,null,null,null,"P2","d",12,1.5,0,null,null,0,0,0,0,0,0,0,0,0,0,0,0,3.6,3.6,3.6,3.6,3.6,3.6,3.6,3.6,3.6,3.6,3.6,3.6,3.6,3.6,3.6,3.6,3.6,3.6,3.6,3.6,3.6,3.6,3.6,3.6,3.6,3.6,3.6,3.6,3.6,null,null,null,null,null,3.6,3.6,null,0,3.6]
[null,null,null,null,null,null,null,null,"P3","d",20,2,0,null,null,0,0,0,0,0,0,0,0,0,0,0,0,0,0,0,0,8,8,8,8,8,8,8,8,8,8,8,8,8,8,8,8,8,8,8,8,8,8,8,8,8,null,null,null,null,null,0,8,null,0,8]
[]
[null,null,null,null,null,null,null,null,"V_d - venstre",null,null,null,null,null,null,{"$f":"SUM(P37:P42)","v":60.019999999999996},59.402812499999996,58.801249999999996,58.215312499999996,57.644999999999996,57.090312499999996,56.551249999999996,56.027812499999996,55.519999999999996,42.26,41.04,39.86,38.72,29.22,28.16,27.14,26.16,12.69125,11.285,9.9412500000000001,8.66,7.4412500000000001,6.2850000000000001,5.1912500000000001,4.16,3.5690625000000002,3.0162500000000003,2.5015624999999999,2.0249999999999999,1.5865625000000001,1.18625,0.82406250000000003,0.5,0.3828125,0.28125,0.1953125,0.125,7.03125E-2,3.125E-2,7.8125E-3,0,null,null,null,null,null,{"$f":"SUM(BJ37:BJ42)","v":29.486288145082689},{"$f":"SUM(BK37:BK42)","v":2.3810610129429799},null,{"$f":"SUM(BM37:BM42)","v":56.351933992174267},{"$f":"SUM(BN37:BN42)","v":0.31773166116219009}]
[null,null,null,null,null,null,null,null,"V_d - højre",null,null,null,null,null,null,{"$f":"SUM(P44:P49)","v":0},7.8125E-3,3.125E-2,7.03125E-2,0.125,0.1953125,0.28125,0.3828125,3.5,3.84,4.22,4.6399999999999997,8.6999999999999993,9.1999999999999993,9.74,10.32,18.939999999999998,19.971249999999998,21.064999999999998,22.221249999999998,23.439999999999998,24.721250000000001,26.065000000000001,27.471250000000001,28.94,29.874062500000001,30.846250000000001,31.856562500000003,32.905000000000001,33.991562500000001,35.116250000000001,36.279062500000002,37.480000000000004,37.987812500000004,38.511250000000004,39.050312500000004,39.605000000000004,40.175312500000004,40.761250000000004,41.362812500000004,41.980000000000004,null,null,null,null,null,{"$f":"SUM(BJ44:BJ49)","v":9.0735722103008314},{"$f":"SUM(BK44:BK49)","v":32.110368388281941},null,{"$f":"SUM(BM44:BM49)","v":0.31773166116219065},{"$f":"SUM(BN44:BN49)","v":38.311933992174275}]
[]
[null,null,null,null,null,null,null,null,"FORSKYDNING",null,null,null,null,null,null,{"$f":"P34","v":0},1,2,3,4,5,6,7,8,9,10,11,12,13,14,15,16,17,18,19,20,21,22,23,24,25,26,27,28,29,30,31,32,33,34,35,36,37,38,39,40,{"$f":"BF54","v":12.754552540761342},{"$f":"40*BF35/Brand!$L$8","v":12.754552540761342},{"$f":"40*BG35/Brand!$L$8","v":27.245447459238658},{"$f":"BG54","v":27.245447459238658}]
[null,null,null,null,null,null,null,null,null,null,null,null,null,null," :",{"$f":"MAX(P52,P51)","v":60.019999999999996},59.402812499999996,58.801249999999996,58.215312499999996,57.644999999999996,57.090312499999996,56.551249999999996,56.027812499999996,55.519999999999996,42.26,41.04,39.86,38.72,29.22,28.16,27.14,26.16,19.971249999999998,21.064999999999998,22.221249999999998,23.439999999999998,24.721250000000001,26.065000000000001,27.471250000000001,28.94,29.874062500000001,30.846250000000001,31.856562500000003,32.905000000000001,33.991562500000001,35.116250000000001,36.279062500000002,37.480000000000004,37.987812500000004,38.511250000000004,39.050312500000004,39.605000000000004,40.175312500000004,40.761250000000004,41.362812500000004,41.980000000000004]
[null,null,null,null,null,null,null,null,null,null,null,null,null,null," :",{"$f":"Brand!$O$31","v":173.31200436000364},{"$f":"Brand!$O$31","v":173.31200436000364},{"$f":"Brand!$O$31","v":173.31200436000364},{"$f":"Brand!$O$31","v":173.31200436000364},{"$f":"Brand!$O$31","v":173.31200436000364},{"$f":"Brand!$O$31","v":173.31200436000364},{"$f":"Brand!$O$31","v":173.31200436000364},{"$f":"Brand!$O$31","v":173.31200436000364},{"$f":"Brand!$O$31","v":173.31200436000364},{"$f":"Brand!$O$31","v":173.31200436000364},{"$f":"Brand!$O$31","v":173.31200436000364},{"$f":"Brand!$O$31","v":173.31200436000364},{"$f":"Brand!$O$31","v":173.31200436000364},{"$f":"Brand!$O$31","v":173.31200436000364},{"$f":"Brand!$O$31","v":173.31200436000364},{"$f":"Brand!$O$31","v":173.31200436000364},{"$f":"Brand!$O$31","v":173.31200436000364},{"$f":"Brand!$O$31","v":173.31200436000364},{"$f":"Brand!$O$31","v":173.31200436000364},{"$f":"Brand!$O$31","v":173.31200436000364},{"$f":"Brand!$O$31","v":173.31200436000364},{"$f":"Brand!$O$31","v":173.31200436000364},{"$f":"Brand!$O$31","v":173.31200436000364},{"$f":"Brand!$O$31","v":173.31200436000364},{"$f":"Brand!$O$31","v":173.31200436000364},{"$f":"Brand!$O$31","v":173.31200436000364},{"$f":"Brand!$O$31","v":173.31200436000364},{"$f":"Brand!$O$31","v":173.31200436000364},{"$f":"Brand!$O$31","v":173.31200436000364},{"$f":"Brand!$O$31","v":173.31200436000364},{"$f":"Brand!$O$31","v":173.31200436000364},{"$f":"Brand!$O$31","v":173.31200436000364},{"$f":"Brand!$O$31","v":173.31200436000364},{"$f":"Brand!$O$31","v":173.31200436000364},{"$f":"Brand!$O$31","v":173.31200436000364},{"$f":"Brand!$O$31","v":173.31200436000364},{"$f":"Brand!$O$31","v":173.31200436000364},{"$f":"Brand!$O$31","v":173.31200436000364},{"$f":"Brand!$O$31","v":173.31200436000364},{"$f":"Brand!$O$31","v":173.31200436000364},{"$f":"Brand!$O$31","v":173.31200436000364}]
[null,null,null,null,null,null,null,null,null,null,null,null,null,null," :",{"$f":"Brand!$O$32","v":173.31200436000364},{"$f":"Brand!$O$32","v":173.31200436000364},{"$f":"Brand!$O$32","v":173.31200436000364},{"$f":"Brand!$O$32","v":173.31200436000364},{"$f":"Brand!$O$32","v":173.31200436000364},{"$f":"Brand!$O$32","v":173.31200436000364},{"$f":"Brand!$O$32","v":173.31200436000364},{"$f":"Brand!$O$32","v":173.31200436000364},{"$f":"Brand!$O$32","v":173.31200436000364},{"$f":"Brand!$O$32","v":173.31200436000364},{"$f":"Brand!$O$32","v":173.31200436000364},{"$f":"Brand!$O$32","v":173.31200436000364},{"$f":"Brand!$O$32","v":173.31200436000364},{"$f":"Brand!$O$32","v":173.31200436000364},{"$f":"Brand!$O$32","v":173.31200436000364},{"$f":"Brand!$O$32","v":173.31200436000364},{"$f":"Brand!$O$32","v":173.31200436000364},{"$f":"Brand!$O$32","v":173.31200436000364},{"$f":"Brand!$O$32","v":173.31200436000364},{"$f":"Brand!$O$32","v":173.31200436000364},{"$f":"Brand!$O$32","v":173.31200436000364},{"$f":"Brand!$O$32","v":173.31200436000364},{"$f":"Brand!$O$32","v":173.31200436000364},{"$f":"Brand!$O$32","v":173.31200436000364},{"$f":"Brand!$O$32","v":173.31200436000364},{"$f":"Brand!$O$32","v":173.31200436000364},{"$f":"Brand!$O$32","v":173.31200436000364},{"$f":"Brand!$O$32","v":173.31200436000364},{"$f":"Brand!$O$32","v":173.31200436000364},{"$f":"Brand!$O$32","v":173.31200436000364},{"$f":"Brand!$O$32","v":173.31200436000364},{"$f":"Brand!$O$32","v":173.31200436000364},{"$f":"Brand!$O$32","v":173.31200436000364},{"$f":"Brand!$O$32","v":173.31200436000364},{"$f":"Brand!$O$32","v":173.31200436000364},{"$f":"Brand!$O$32","v":173.31200436000364},{"$f":"Brand!$O$32","v":173.31200436000364},{"$f":"Brand!$O$32","v":173.31200436000364},{"$f":"Brand!$O$32","v":173.31200436000364},{"$f":"Brand!$O$32","v":173.31200436000364},{"$f":"Brand!$O$32","v":173.31200436000364}]
[null,null,null,null,null,null,null,null,null,null,null,null,null,null," :",null,null,null,null,null,null,null,null,null,null,null,null,null,null,null,null,null,null,null,null,null,null,null,null,null,null,null,null,null,null,null,null,null,null,null,null,null,null,null,null,null,{"$f":"1.1*MAX(P55:BD55)","v":66.022000000000006},0,0,{"$f":"1.1*MAX(P55:BD55)","v":66.022000000000006}]
[null,null,null,null,null,null,null,null,null,null,null,null,null,null,null,null,null,null,null,0,null,null,null,0,null,null,null,0,null,null,null,0,null,null,null,null,0,null,null,0,null,null,null,0,null,null,null,0,null,null,null,0]
[null,null,null,null,null,null,null,null,"EXCENTRICITET",null,null,null,null,null,null,{"$f":"IF(P51>=P52,IF(P51=0,0,SUMPRODUCT($D$38:$D$43,P37:P42)/P51),IF(P52=0,0,SUMPRODUCT($D$38:$D$43,P44:P49)/P52))","v":18.042319226924363},17.970029828133139,17.89811015922281,17.82662959165598,17.755659640905542,17.685273880748156,17.615547843770031,17.546558907685359,17.478386167146976,19.559349858021772,19.578764619883042,19.598673482187657,19.619059917355372,20.973755133470227,21.051580255681817,21.132207995578483,21.215596330275229,17.568223070664082,17.751602183717068,17.925831130111945,18.090870307167236,18.246827122414928,18.393919048532513,18.532443008599898,18.662750518313754,18.860895216377084,19.054382623495563,19.242944448259287,19.426378969761434,19.604543406911642,19.777346669988965,19.944742577071828,20.106723585912484,20.172135800133265,20.237755201402187,20.303494690343385,20.369271556621637,20.435007506164386,20.500628660799165,20.566065532898662,20.631252977608384]
[]
[]
[]
[]
[null,null,null,null,null,null,null,null,"Bøjlekapacitet"]
[null,null,null,null,null,null,null,null,null,null,{"$f":"IF(Brand2!D4-Brand!J34*Brand!O15/1000>0,2*MAX(Brand!O31,Brand!O32)*Brand2!D4/(Brand2!D4-Brand!J34*Brand!O15/1000)^2,2*Brand!O30/Brand!L8)","v":149.42412770984859},0,{"$f":"Brand!L8","v":5},null,null,{"$f":"IF(P$35<=$L66,$K66*($M66-$L66)*($D$4-0.5*($L66+$M66))/$D$4,IF(P$35<=$M66,$K66*($M66-P$35)*($D$4-0.5*(P$35+$M66))/$D$4,0))","v":373.56031927462146},355.11577851043705,337.13818814534591,319.62754817934803,302.58385861244335,286.00711944463211,269.89733067591402,254.25449230628928,239.07860433575775,224.36966676431948,210.12767959197458,196.3526428187229,183.04455644456453,170.20342046949941,157.8292348935276,145.92199971664903,134.48171493886375,123.50838056017172,113.00199658057299,102.96256300006753,93.390079818655366,84.284547036336477,75.645964653110838,67.474332668978505,59.769651083939436,52.531919897993646,45.761139111141134,39.4573087233819,33.620428734715937,28.250499145143248,23.347519954663841,18.911491163277709,14.942412770984859,11.440284777785283,8.4051071836789841,5.8368799886659604,3.7356031927462148,2.101276795919746,0.93390079818655369,0.23347519954663842,0]
[null,null,null,null,null,null,null,null,null,null,{"$f":"IF(Brand2!D4-Brand!J34*Brand!O15/1000>0,2*MAX(Brand!O31,Brand!O32)*Brand2!D4/(Brand2!D4-Brand!J34*Brand!O15/1000)^2,2*Brand!O30/Brand!L8)","v":149.42412770984859},0,{"$f":"Brand!L8","v":5},null,null,{"$f":"IF(P$35<$L67,0,IF(P$35<$M67,$K67*(P$35-$L67)*0.5*($L67+P$35)/$D$4,$K67*($M67-$L67)*0.5*($L67+$M67)/$D$4))","v":0},0.23347519954663842,0.93390079818655369,2.101276795919746,3.7356031927462148,5.8368799886659604,8.4051071836789841,11.440284777785283,14.942412770984859,18.911491163277709,23.347519954663841,28.250499145143248,33.620428734715937,39.4573087233819,45.761139111141134,52.531919897993646,59.769651083939436,67.474332668978505,75.645964653110838,84.284547036336477,93.390079818655366,102.96256300006753,113.00199658057299,123.50838056017172,134.48171493886375,145.92199971664903,157.8292348935276,170.20342046949941,183.04455644456453,196.3526428187229,210.12767959197458,224.36966676431948,239.07860433575775,254.25449230628928,269.89733067591402,286.00711944463211,302.58385861244335,319.62754817934803,337.13818814534591,355.11577851043705,373.56031927462146]
[null,null,null,null,null,null,null,null,{"$f":"MAX(Q68:BC68)","v":0},null,null,null,null,null,null,null,{"$f":"IF(Q55>MAX(Q66:Q67,Brand!$O$32,Brand!$O$31),1,0)","v":0},{"$f":"IF(R55>MAX(R66:R67,Brand!$O$32,Brand!$O$31),1,0)","v":0},{"$f":"IF(S55>MAX(S66:S67,Brand!$O$32,Brand!$O$31),1,0)","v":0},{"$f":"IF(T55>MAX(T66:T67,Brand!$O$32,Brand!$O$31),1,0)","v":0},{"$f":"IF(U55>MAX(U66:U67,Brand!$O$32,Brand!$O$31),1,0)","v":0},{"$f":"IF(V55>MAX(V66:V67,Brand!$O$32,Brand!$O$31),1,0)","v":0},{"$f":"IF(W55>MAX(W66:W67,Brand!$O$32,Brand!$O$31),1,0)","v":0},{"$f":"IF(X55>MAX(X66:X67,Brand!$O$32,Brand!$O$31),1,0)","v":0},{"$f":"IF(Y55>MAX(Y66:Y67,Brand!$O$32,Brand!$O$31),1,0)","v":0},{"$f":"IF(Z55>MAX(Z66:Z67,Brand!$O$32,Brand!$O$31),1,0)","v":0},{"$f":"IF(AA55>MAX(AA66:AA67,Brand!$O$32,Brand!$O$31),1,0)","v":0},{"$f":"IF(AB55>MAX(AB66:AB67,Brand!$O$32,Brand!$O$31),1,0)","v":0},{"$f":"IF(AC55>MAX(AC66:AC67,Brand!$O$32,Brand!$O$31),1,0)","v":0},{"$f":"IF(AD55>MAX(AD66:AD67,Brand!$O$32,Brand!$O$31),1,0)","v":0},{"$f":"IF(AE55>MAX(AE66:AE67,Brand!$O$32,Brand!$O$31),1,0)","v":0},{"$f":"IF(AF55>MAX(AF66:AF67,Brand!$O$32,Brand!$O$31),1,0)","v":0},{"$f":"IF(AG55>MAX(AG66:AG67,Brand!$O$32,Brand!$O$31),1,0)","v":0},{"$f":"IF(AH55>MAX(AH66:AH67,Brand!$O$32,Brand!$O$31),1,0)","v":0},{"$f":"IF(AI55>MAX(AI66:AI67,Brand!$O$32,Brand!$O$31),1,0)","v":0},{"$f":"IF(AJ55>MAX(AJ66:AJ67,Brand!$O$32,Brand!$O$31),1,0)","v":0},{"$f":"IF(AK55>MAX(AK66:AK67,Brand!$O$32,Brand!$O$31),1,0)","v":0},{"$f":"IF(AL55>MAX(AL66:AL67,Brand!$O$32,Brand!$O$31),1,0)","v":0},{"$f":"IF(AM55>MAX(AM66:AM67,Brand!$O$32,Brand!$O$31),1,0)","v":0},{"$f":"IF(AN55>MAX(AN66:AN67,Brand!$O$32,Brand!$O$31),1,0)","v":0},{"$f":"IF(AO55>MAX(AO66:AO67,Brand!$O$32,Brand!$O$31),1,0)","v":0},{"$f":"IF(AP55>MAX(AP66:AP67,Brand!$O$32,Brand!$O$31),1,0)","v":0},{"$f":"IF(AQ55>MAX(AQ66:AQ67,Brand!$O$32,Brand!$O$31),1,0)","v":0},{"$f":"IF(AR55>MAX(AR66:AR67,Brand!$O$32,Brand!$O$31),1,0)","v":0},{"$f":"IF(AS55>MAX(AS66:AS67,Brand!$O$32,Brand!$O$31),1,0)","v":0},{"$f":"IF(AT55>MAX(AT66:AT67,Brand!$O$32,Brand!$O$31),1,0)","v":0},{"$f":"IF(AU55>MAX(AU66:AU67,Brand!$O$32,Brand!$O$31),1,0)","v":0},{"$f":"IF(AV55>MAX(AV66:AV67,Brand!$O$32,Brand!$O$31),1,0)","v":0},{"$f":"IF(AW55>MAX(AW66:AW67,Brand!$O$32,Brand!$O$31),1,0)","v":0},{"$f":"IF(AX55>MAX(AX66:AX67,Brand!$O$32,Brand!$O$31),1,0)","v":0},{"$f":"IF(AY55>MAX(AY66:AY67,Brand!$O$32,Brand!$O$31),1,0)","v":0},{"$f":"IF(AZ55>MAX(AZ66:AZ67,Brand!$O$32,Brand!$O$31),1,0)","v":0},{"$f":"IF(BA55>MAX(BA66:BA67,Brand!$O$32,Brand!$O$31),1,0)","v":0},{"$f":"IF(BB55>MAX(BB66:BB67,Brand!$O$32,Brand!$O$31),1,0)","v":0},{"$f":"IF(BC55>MAX(BC66:BC67,Brand!$O$32,Brand!$O$31),1,0)","v":0}]
[]
[]
[]
[]
[]
[]
[]
[]
[]
[]
[]
[]
[]
[]
[]
[]
[null,null,"Jævnt fordelte laste",null,null,null,"Punktlaste"]
[null,null,null,"p1","p2","p3",null,"P1","P2","P3"]
[]
[null,"Kar. værdi","(kN/m)",{"$f":"Kold2!D88","v":5},{"$f":"Kold2!E88","v":9},{"$f":"Kold2!F88","v":10},"(kN)",{"$f":"Kold2!H88","v":15},{"$f":"Kold2!I88","v":12},{"$f":"Kold2!J88","v":22}]
[null,"Regnm. værdi","(kN/m)",{"$f":"B95+C95*I95","v":5},{"$f":"B96+C96*I96","v":7.8},{"$f":"B97+C97*I97","v":7.2},"(kN)",{"$f":"B99+C99*I99","v":15},{"$f":"B100+C100*I100","v":12},{"$f":"B101+C101*I101","v":20}]
[null,"Excentricitet, exc.","(mm)",{"$f":"Kold2!D90","v":25},{"$f":"Kold2!E90","v":15},{"$f":"Kold2!F90","v":25},"(mm)",{"$f":"Kold2!H90","v":10},{"$f":"Kold2!I90","v":15},{"$f":"Kold2!J90","v":20}]
[null,"x1","(m)",{"$f":"Kold2!D91","v":0},{"$f":"Kold2!E91","v":1},{"$f":"Kold2!F91","v":2},"(m)",{"$f":"Kold2!H91","v":1},{"$f":"Kold2!I91","v":1.5},{"$f":"Kold2!J91","v":2}]
[null,"x2","(m)",{"$f":"Kold2!D92","v":5},{"$f":"Kold2!E92","v":3},{"$f":"Kold2!F92","v":4}]
[]
[{"$f":"Kold!B21","v":"Lastparametre:"},{"$f":"Kold!C21","v":"gk [kN/m]"},{"$f":"Kold!D21","v":"qk [kN/m]"},{"$f":"Kold!E21","v":"e [mm]"},{"$f":"Kold!F21","v":"x1 [m]"},{"$f":"Kold!G21","v":"x2 [m]"},{"$f":"Kold!H21","v":"ϒg"},{"$f":"Kold!I21","v":"ϒq"},{"$f":"Kold!J21","v":"ψ1"},{"$f":"Kold!K21","v":"ψ2"}]
[{"$f":"Kold!B22","v":"p1"},{"$f":"Kold!C22","v":5},{"$f":"Kold!D22","v":0},{"$f":"Kold!E22","v":25},{"$f":"Kold!F22","v":0},{"$f":"Kold!G22","v":5},{"$f":"Kold!H22","v":1.1000000000000001},{"$f":"Kold!I22","v":0},{"$f":"Kold!J22","v":0},{"$f":"Kold!K22","v":0}]
[{"$f":"Kold!B23","v":"p2"},{"$f":"Kold!C23","v":6},{"$f":"Kold!D23","v":3},{"$f":"Kold!E23","v":15},{"$f":"Kold!F23","v":1},{"$f":"Kold!G23","v":3},{"$f":"Kold!H23","v":1.1000000000000001},{"$f":"Kold!I23","v":1.65},{"$f":"Kold!J23","v":0.6},{"$f":"Kold!K23","v":0.5}]
[{"$f":"Kold!B24","v":"p3"},{"$f":"Kold!C24","v":3},{"$f":"Kold!D24","v":7},{"$f":"Kold!E24","v":25},{"$f":"Kold!F24","v":2},{"$f":"Kold!G24","v":4},{"$f":"Kold!H24","v":1.1000000000000001},{"$f":"Kold!I24","v":1.65},{"$f":"Kold!J24","v":0.6},{"$f":"Kold!K24","v":0.5}]
[{"$f":"Kold!B25","v":0},{"$f":"Kold!C25","v":"Gk [kN]"},{"$f":"Kold!D25","v":"Qk [kN]"},{"$f":"Kold!E25","v":"e [mm]"},{"$f":"Kold!F25","v":"x1 [m]"},{"$f":"Kold!G25","v":0}]
[{"$f":"Kold!B26","v":"P1"},{"$f":"Kold!C26","v":15},{"$f":"Kold!D26","v":0},{"$f":"Kold!E26","v":10},{"$f":"Kold!F26","v":1},{"$f":"Kold!G26","v":0},{"$f":"Kold!H26","v":1.1000000000000001},{"$f":"Kold!I26","v":1.65},{"$f":"Kold!J26","v":0.6},{"$f":"Kold!K26","v":0.5}]
[{"$f":"Kold!B27","v":"P2"},{"$f":"Kold!C27","v":12},{"$f":"Kold!D27","v":0},{"$f":"Kold!E27","v":15},{"$f":"Kold!F27","v":1.5},{"$f":"Kold!G27","v":0},{"$f":"Kold!H27","v":1.1000000000000001},{"$f":"Kold!I27","v":1.65},{"$f":"Kold!J27","v":0.6},{"$f":"Kold!K27","v":0.5}]
[{"$f":"Kold!B28","v":"P3"},{"$f":"Kold!C28","v":17},{"$f":"Kold!D28","v":5},{"$f":"Kold!E28","v":20},{"$f":"Kold!F28","v":2},{"$f":"Kold!G28","v":0},{"$f":"Kold!H28","v":1.1000000000000001},{"$f":"Kold!I28","v":1.65},{"$f":"Kold!J28","v":0.6},{"$f":"Kold!K28","v":0.5}]

{"sheet":"Firsidig","index":4,"n_rows":136,"n_cols":38,"rows_kept":136,"cut":false,"hidden":false,"merged":[[41,24,41,30],[42,25,42,26],[42,27,42,28],[42,29,42,30],[41,31,41,37],[42,32,42,33],[42,34,42,35],[42,36,42,37],[42,22,42,23],[41,10,41,16],[41,17,41,23],[42,13,42,14],[42,15,42,16],[42,18,42,19],[42,20,42,21],[121,6,121,7],[102,2,102,3],[102,4,102,5],[102,6,102,7],[42,11,42,12]]}
[]
[null,null,null,0,null,null,null,null,null,null,"Q",null,"y","Q-3",null,null,null,null,null,null,null,"Q-4",null,null,null,"Temp i bøjler",null,"y","Q-3",null,null,null,null,null,null,null,"Q-4"]
[null,null,null,null,null,null,null,null,null,null,null,"Punkt",null,null,1,2,3,"Midte",4,5,6,null,null,null,null,null,"Punkt",null,null,1,2,3,"Midte",4,5,6]
[null,null,null,null,null,null,null,null,null,null,"x",null,null,null,{"$f":"$E$16/(4*$E$19)+(O3-1)*$E$16/(2*$E$19)","v":2.4999999999999998E-2},{"$f":"$E$16/(4*$E$19)+(P3-1)*$E$16/(2*$E$19)","v":7.4999999999999997E-2},{"$f":"$E$16/(4*$E$19)+(Q3-1)*$E$16/(2*$E$19)","v":0.12499999999999999},{"$f":"0.5*E16","v":0.15},{"$f":"$E$16/(4*$E$19)+(S3-1)*$E$16/(2*$E$19)","v":0.17499999999999999},{"$f":"$E$16/(4*$E$19)+(T3-1)*$E$16/(2*$E$19)","v":0.22499999999999998},{"$f":"$E$16/(4*$E$19)+(U3-1)*$E$16/(2*$E$19)","v":0.27500000000000002},null,null,null,null,"x",null,null,null,{"$f":"E29-0.5*(MAX(Brand!M11:M13)+MAX(Brand!M15:M16))/1000","v":2.9000000000000001E-2},{"$f":"AD4+0.4*($AG$4-$AD$4)","v":7.7399999999999997E-2},{"$f":"AE4+0.4*($AG$4-$AD$4)","v":0.1258},{"$f":"0.5*E16","v":0.15},{"$f":"AG4+0.2*($AJ$4-$AG$4)","v":0.17419999999999999},{"$f":"AH4+0.4*($AJ$4-$AG$4)","v":0.22259999999999999},{"$f":"E16-AD4","v":0.27099999999999996}]
[null,null,null,null,null,null,null,null,null,null,"Q-1",null,null,null,{"$f":"MAX(312*LOG10(8*$E$17+1)*EXP(-1.9*O4*$E$18/SQRT($E$17))*SIN(PI()/2-O4*$E$18/SQRT($E$17)),0)*$B$6","v":390.00202915145718},{"$f":"MAX(312*LOG10(8*$E$17+1)*EXP(-1.9*P4*$E$18/SQRT($E$17))*SIN(PI()/2-P4*$E$18/SQRT($E$17)),0)*$B$6","v":47.423817868663399},{"$f":"MAX(312*LOG10(8*$E$17+1)*EXP(-1.9*Q4*$E$18/SQRT($E$17))*SIN(PI()/2-Q4*$E$18/SQRT($E$17)),0)*$B$6","v":0},0,0,0,0,{"$f":"MAX(312*LOG10(8*$E$17+1)*EXP(-1.9*($E$16)*$E$18/SQRT($E$17))*SIN(PI()/2-($E$16)*$E$18/SQRT($E$17)),0)","v":0},null,null,null,"Q-1",null,null,null,{"$f":"MAX(312*LOG10(8*$E$17+1)*EXP(-1.9*AD4*$E$18/SQRT($E$17))*SIN(PI()/2-AD4*$E$18/SQRT($E$17)),0)*$B$6","v":340.54113657259006},{"$f":"MAX(312*LOG10(8*$E$17+1)*EXP(-1.9*AE4*$E$18/SQRT($E$17))*SIN(PI()/2-AE4*$E$18/SQRT($E$17)),0)*$B$6","v":41.29492655520621},0,0,0,0,0]
[null,{"$f":"Brand!AT40","v":1},null,null,null,{"$f":"Brand!AT40","v":1},null,null,null,null,null,1,{"$f":"$E$15/(4*$E$19)+(L6-1)*$E$15/(2*$E$19)","v":5.8333333333333327E-2},{"$f":"MAX(312*LOG10(8*$E$17+1)*EXP(-1.9*M6*$E$18/SQRT($E$17))*SIN(PI()/2-M6*$E$18/SQRT($E$17)),0)*$D$2","v":0},{"$f":"MAX(((O$5+O$13)*$E$20/($E$20+$V$5))*(1-($N6+$V6)/$E$20)+$N6+$V6,20)","v":390.00202915145718},{"$f":"MAX(((P$5+P$13)*$E$20/($E$20+$V$5))*(1-($N6+$V6)/$E$20)+$N6+$V6,20)","v":47.423817868663399},20,20,20,47.423817868663384,390.00202915145763,{"$f":"MAX(312*LOG10(8*$E$17+1)*EXP(-1.9*($E$15-M6)*$E$18/SQRT($E$17))*SIN(PI()/2-($E$15-M6)*$E$18/SQRT($E$17)),0)*$D$11","v":0}]
[null,null,null,null,null,null,null,null,null,null,null,2,{"$f":"$E$15/(4*$E$19)+(L7-1)*$E$15/(2*$E$19)","v":0.17499999999999999},{"$f":"MAX(312*LOG10(8*$E$17+1)*EXP(-1.9*M7*$E$18/SQRT($E$17))*SIN(PI()/2-M7*$E$18/SQRT($E$17)),0)*$D$2","v":0},{"$f":"MAX(((O$5+O$13)*$E$20/($E$20+$V$5))*(1-($N7+$V7)/$E$20)+$N7+$V7,20)","v":390.00206425824018},47.423879891471096,20,20,20,47.423879891471081,390.00206425824064,{"$f":"MAX(312*LOG10(8*$E$17+1)*EXP(-1.9*($E$15-M7)*$E$18/SQRT($E$17))*SIN(PI()/2-($E$15-M7)*$E$18/SQRT($E$17)),0)*$D$11","v":6.5748849255513415E-5}]
[null,null,null,null,null,null,null,null,null,null,null,3,{"$f":"$E$15/(4*$E$19)+(L8-1)*$E$15/(2*$E$19)","v":0.29166666666666663},0,{"$f":"MAX(((O$5+O$13)*$E$20/($E$20+$V$5))*(1-($N8+$V8)/$E$20)+$N8+$V8,20)","v":390.00703013472258},47.432653056526632,20,20,20,47.432653056526618,390.00703013472304,9.3659648202346762E-3]
[null,null,null,null,null,null,null,null,null,null,null,"Midte",{"$f":"0.5*E15","v":0.35},0,390.01258968932899,47.442475066874721,20,20,20,47.442475066874707,390.01258968932945,1.9778035826324494E-2,null,null,null,null,"Midte",{"$f":"0.5*E15","v":0.35},{"$f":"MAX(312*LOG10(8*$E$17+1)*EXP(-1.9*AB9*$E$18/SQRT($E$17))*SIN(PI()/2-AB9*$E$18/SQRT($E$17)),0)*$D$2","v":0}]
[null,null,null,null,null,null,null,null,null,null,null,4,{"$f":"$E$15/(4*$E$19)+(L10-1)*$E$15/(2*$E$19)","v":0.40833333333333327},0,390.00202915145718,47.423817868663399,20,20,20,47.423817868663384,390.00202915145763,0,null,null,null,null,4,{"$f":"AB9+0.2*($AB$12-$AB$9)","v":0.41419999999999996},{"$f":"MAX(312*LOG10(8*$E$17+1)*EXP(-1.9*AB10*$E$18/SQRT($E$17))*SIN(PI()/2-AB10*$E$18/SQRT($E$17)),0)*$D$2","v":0},{"$f":"MAX((($AC10+$AK10)*$E$20/($E$20+$V$5))*(1-(AD$5+AD$13)/$E$20)+AD$5+AD$13,20)","v":340.54113657259006},null,null,null,null,null,{"$f":"MAX((($AC10+$AK10)*$E$20/($E$20+$V$5))*(1-(AJ$5+AJ$13)/$E$20)+AJ$5+AJ$13,20)","v":340.54113657258983},{"$f":"MAX(312*LOG10(8*$E$17+1)*EXP(-1.9*($E$15-AB10)*$E$18/SQRT($E$17))*SIN(PI()/2-($E$15-AB10)*$E$18/SQRT($E$17)),0)*$D$11","v":0}]
[null,null,null,{"$f":"Brand!AT39","v":1},null,null,null,null,null,null,null,5,{"$f":"$E$15/(4*$E$19)+(L11-1)*$E$15/(2*$E$19)","v":0.52499999999999991},0,390.00202915145718,47.423817868663399,20,20,20,47.423817868663384,390.00202915145763,0,null,null,null,null,5,{"$f":"AB10+0.4*($AB$12-$AB$9)","v":0.54259999999999997},{"$f":"MAX(312*LOG10(8*$E$17+1)*EXP(-1.9*AB11*$E$18/SQRT($E$17))*SIN(PI()/2-AB11*$E$18/SQRT($E$17)),0)*$D$2","v":0},340.54113657259006,null,null,null,null,null,340.54113657258983,{"$f":"MAX(312*LOG10(8*$E$17+1)*EXP(-1.9*($E$15-AB11)*$E$18/SQRT($E$17))*SIN(PI()/2-($E$15-AB11)*$E$18/SQRT($E$17)),0)*$D$11","v":0}]
[null,null,null,null,null,null,null,null,null,null,null,6,{"$f":"$E$15/(4*$E$19)+(L12-1)*$E$15/(2*$E$19)","v":0.64166666666666672},0,448.02820620687282,149.93809317438831,108.6728557386301,108.6728557386301,108.6728557386301,149.93809317438831,448.02820620687322,108.6728557386301,null,null,null,null,6,{"$f":"E15-E29+0.5*(MAX(Brand!M11:M13)+MAX(Brand!M15:M16))/1000","v":0.67099999999999993},{"$f":"MAX(312*LOG10(8*$E$17+1)*EXP(-1.9*AB12*$E$18/SQRT($E$17))*SIN(PI()/2-AB12*$E$18/SQRT($E$17)),0)*$D$2","v":0},542.50175322335622,365.031419642576,340.54113657258983,340.54113657258983,340.54113657258983,365.031419642576,542.5017532233561,{"$f":"MAX(312*LOG10(8*$E$17+1)*EXP(-1.9*($E$15-AB12)*$E$18/SQRT($E$17))*SIN(PI()/2-($E$15-AB12)*$E$18/SQRT($E$17)),0)*$D$11","v":340.54113657258983}]
[null,"Betontværsnit",null,null,null,null,null,null,null,null,"Q-2",null,{"$f":"E15-E27","v":0.68348707030313294},null,{"$f":"MAX(312*LOG10(8*$E$17+1)*EXP(-1.9*($E$16-O4)*$E$18/SQRT($E$17))*SIN(PI()/2-($E$16-O4)*$E$18/SQRT($E$17)),0)*$F$6","v":0},{"$f":"MAX(312*LOG10(8*$E$17+1)*EXP(-1.9*($E$16-P4)*$E$18/SQRT($E$17))*SIN(PI()/2-($E$16-P4)*$E$18/SQRT($E$17)),0)*$F$6","v":0},0,0,0,47.423817868663377,390.00202915145763,{"$f":"MAX(312*LOG10(8*$E$17+1)*EXP(-1.9*($E$15-M13)*$E$18/SQRT($E$17))*SIN(PI()/2-($E$15-M13)*$E$18/SQRT($E$17)),20)*$D$11","v":513.40870805780003},null,null,null,"Q-2",null,{"$f":"E15-E25","v":0.7},{"$f":"MAX(312*LOG10(8*$E$17+1)*EXP(-1.9*AB13*$E$18/SQRT($E$17))*SIN(PI()/2-AB13*$E$18/SQRT($E$17)),0)*$D$2","v":0},{"$f":"MAX(312*LOG10(8*$E$17+1)*EXP(-1.9*($E$16-AD4)*$E$18/SQRT($E$17))*SIN(PI()/2-($E$16-AD4)*$E$18/SQRT($E$17)),0)*$F$6","v":0},{"$f":"MAX(312*LOG10(8*$E$17+1)*EXP(-1.9*($E$16-AE4)*$E$18/SQRT($E$17))*SIN(PI()/2-($E$16-AE4)*$E$18/SQRT($E$17)),0)*$F$6","v":0},0,0,0,41.29492655520621,340.54113657258983,{"$f":"MAX(312*LOG10(8*$E$17+1)*EXP(-1.9*($E$15-AB13)*$E$18/SQRT($E$17))*SIN(PI()/2-($E$15-AB13)*$E$18/SQRT($E$17)),0)*$D$11","v":836.82948919207115}]
[null,null,null,null,null,null,null,null,null,null,"z-1",null,null,null,null,null,null,null,null,null,null,null,null,null,null,"Middeltemperatur i bøjler:",null,null,{"$f":"(0.4*(AB12-AB9)*((AD10+AJ10)+(AD11+AJ11)+0.5*(AD12+AJ12))+0.4*(AG4-AD4)*(0.5*(AD12+AJ12)+(AE12+AI12)+(AF12+AH12)))/(2*(AB12-AB9)+(AJ4-AD4))","v":383.61500130678695},null,"(integreret over den nederste halvdel af bjælken)"]
[null,null,null,"h",{"$f":"Brand!O7/1000","v":0.7},"m",null,null,null,null,null,"Punkt",null,null,1,2,3,"Midte",4,5,6]
[null,null,null,"b",{"$f":"Brand!O8/1000","v":0.3},"m"]
[null,"Brandtid",null,"t",{"$f":"IF(D2+F6+D11+B6=0,0.0001,Brand!L23+0.0001)","v":60.000100000000003},"min"]
[null,"Svækket tværsnit",null,"k",{"$f":"SQRT(PI()*2300*1000/(750*0.75))","v":113.33853402386262},null,null,null,null,null,null,1,null,null,{"$f":"INDEX(Bet,VLOOKUP(O6,Bet,5),2)+(INDEX(Bet,VLOOKUP(O6,Bet,5)+1,2)-INDEX(Bet,VLOOKUP(O6,Bet,5),2))*(O6-INDEX(Bet,VLOOKUP(O6,Bet,5),1))/(INDEX(Bet,VLOOKUP(O6,Bet,5)+1,1)-INDEX(Bet,VLOOKUP(O6,Bet,5),1))","v":0.87333191723168557},1,1,null,{"$f":"INDEX(Bet,VLOOKUP(S6,Bet,5),2)+(INDEX(Bet,VLOOKUP(S6,Bet,5)+1,2)-INDEX(Bet,VLOOKUP(S6,Bet,5),2))*(S6-INDEX(Bet,VLOOKUP(S6,Bet,5),1))/(INDEX(Bet,VLOOKUP(S6,Bet,5)+1,1)-INDEX(Bet,VLOOKUP(S6,Bet,5),1))","v":1},1,0.87333191723168524]
[null,null,null,"n",3,null,null,null,null,null,null,2,null,null,0.87333189382715182,1,1,null,1,1,0.8733318938271516]
[null,null,null,"Q-maks",{"$f":"MAX(312*LOG10(8*$E$17+1)*EXP(-1.9*0*$E$18/SQRT($E$17))*SIN(PI()/2-0*$E$18/SQRT($E$17)),0)","v":836.82948919207115},null,"ecu",null,null,null,null,3,null,null,0.87332858324117502,1,1,null,1,1,0.87332858324117468]
[null,null,null,"z-M / e1",{"$f":"R21","v":1},{"$f":"INDEX(Bet,VLOOKUP(R9,Bet,5),3)+(INDEX(Bet,VLOOKUP(R9,Bet,5)+1,3)-INDEX(Bet,VLOOKUP(R9,Bet,5),3))*(R9-INDEX(Bet,VLOOKUP(R9,Bet,5),1))/(INDEX(Bet,VLOOKUP(R9,Bet,5)+1,1)-INDEX(Bet,VLOOKUP(R9,Bet,5),1))","v":2.5000000000000001E-3},{"$f":"INDEX(Bet,VLOOKUP(R9,Bet,5),4)+(INDEX(Bet,VLOOKUP(R9,Bet,5)+1,4)-INDEX(Bet,VLOOKUP(R9,Bet,5),4))*(R9-INDEX(Bet,VLOOKUP(R9,Bet,5),1))/(INDEX(Bet,VLOOKUP(R9,Bet,5)+1,1)-INDEX(Bet,VLOOKUP(R9,Bet,5),1))","v":0.02},null,null,null,null,"Midte",null,null,null,null,null,{"$f":"INDEX(Bet,VLOOKUP(R9,Bet,5),2)+(INDEX(Bet,VLOOKUP(R9,Bet,5)+1,2)-INDEX(Bet,VLOOKUP(R9,Bet,5),2))*(R9-INDEX(Bet,VLOOKUP(R9,Bet,5),1))/(INDEX(Bet,VLOOKUP(R9,Bet,5)+1,1)-INDEX(Bet,VLOOKUP(R9,Bet,5),1))","v":1}]
[null,null,null,"z-middel",{"$f":"((1-0.2/E19)/(2*E19)^2)*IF(AND(D2=1,D11=0),2*SUM(O18:U20),IF(AND(D11=1,D2=0),2*SUM(O22:U24),SUM(O18:U20)+SUM(O22:U24)))","v":0.88991380202088621},null,null,null,null,null,null,4,null,null,{"$f":"INDEX(Bet,VLOOKUP(O10,Bet,5),2)+(INDEX(Bet,VLOOKUP(O10,Bet,5)+1,2)-INDEX(Bet,VLOOKUP(O10,Bet,5),2))*(O10-INDEX(Bet,VLOOKUP(O10,Bet,5),1))/(INDEX(Bet,VLOOKUP(O10,Bet,5)+1,1)-INDEX(Bet,VLOOKUP(O10,Bet,5),1))","v":0.87333191723168557},1,1,null,{"$f":"INDEX(Bet,VLOOKUP(S10,Bet,5),2)+(INDEX(Bet,VLOOKUP(S10,Bet,5)+1,2)-INDEX(Bet,VLOOKUP(S10,Bet,5),2))*(S10-INDEX(Bet,VLOOKUP(S10,Bet,5),1))/(INDEX(Bet,VLOOKUP(S10,Bet,5)+1,1)-INDEX(Bet,VLOOKUP(S10,Bet,5),1))","v":1},1,0.87333191723168524]
[null,null,null,"a (bjælke)",{"$f":"IF(OR((D11+B6+D2+F6)*E17=0,E17<0.1),0,0.5*IF(B6=0,E15,MIN(E15,E16))*(1-E22/E21))","v":1.6512929696867067E-2},"m",null,null,null,null,null,5,null,null,0.87333191723168557,1,1,null,1,1,0.87333191723168524]
[null,null,null,"a (instabilitet)",{"$f":"IF(OR((D11+B6+D2+F6)*E17=0,E17<0.1),0,0.5*IF(B6=0,E15,MIN(E15,E16))*(1-(E22/E21)^1.3))","v":2.110277006212985E-2},"m",null,null,null,null,null,6,null,null,0.83464782788088898,1,1,null,1,1,0.83464782788088876]
[null,"Randzoner",null,"atop",{"$f":"E23*D2","v":0},"m"]
[null,null,null,"aside",{"$f":"E23*MAX(B6,F6)","v":1.6512929696867067E-2},"m"]
[null,null,null,"abund",{"$f":"E23*D11","v":1.6512929696867067E-2},"m"]
[null,"Stål-gen","type",{"$f":"IF($E$28=\"Q\",1,IF($E$28=\"AC\",3,5))","v":3},{"$f":"Brand!AR36","v":"AC"},null,null,null,null,null,"Træklag 1",null,{"$f":"M95","v":0.04},0.04,0.04,0.04,0.04,0.04,0.04,0.04,0.04,0.04]
[null,null,"side-\"dæklag\"",null,{"$f":"Brand!M9/1000","v":0.04},"m",null,null,null,null,null,null,{"$f":"MAX(312*LOG10(8*$E$17+1)*EXP(-1.9*M28*$E$18/SQRT($E$17))*SIN(PI()/2-M28*$E$18/SQRT($E$17)),0)*$B$6","v":229.4173602098129},{"$f":"IF(N28=M28,0,MAX(312*LOG10(8*$E$17+1)*EXP(-1.9*N28*$E$18/SQRT($E$17))*SIN(PI()/2-N28*$E$18/SQRT($E$17)),0))*$B$6","v":0},{"$f":"IF(O28=N28,0,MAX(312*LOG10(8*$E$17+1)*EXP(-1.9*O28*$E$18/SQRT($E$17))*SIN(PI()/2-O28*$E$18/SQRT($E$17)),0))*$B$6","v":0},0,0,0,0,0,0,0]
[null,"Træklag 1",null,"nc",{"$f":"Brand!O12","v":0},null,null,null,null,null,{"$f":"-M98","v":0.6},{"$f":"MAX(312*LOG10(8*$E$17+1)*EXP(-1.9*K30*$E$18/SQRT($E$17))*SIN(PI()/2-K30*$E$18/SQRT($E$17)),0)*$D$2","v":0},{"$f":"MAX(((M$29+M$31)*$E$20/($E$20+$V$5))*(1-($L30+$W30)/$E$20)+$L30+$W30,20)","v":233.4640816276553},{"$f":"IF(N28=M28,0,MAX(((N$29+N$31)*$E$20/($E$20+$V$5))*(1-($L30+$W30)/$E$20)+$L30+$W30,20))","v":0},{"$f":"IF(O28=N28,0,MAX(((O$29+O$31)*$E$20/($E$20+$V$5))*(1-($L30+$W30)/$E$20)+$L30+$W30,20))","v":0},0,0,0,0,0,0,0,{"$f":"MAX(312*LOG10(8*$E$17+1)*EXP(-1.9*($E$15-K30)*$E$18/SQRT($E$17))*SIN(PI()/2-($E$15-K30)*$E$18/SQRT($E$17)),0)*$D$11","v":5.5751534344065927}]
[null,null,null,"reduc nc",{"$f":"MIN(FLOOR(E30,1),10)","v":0},null,null,null,null,null,null,null,{"$f":"MAX(312*LOG10(8*$E$17+1)*EXP(-1.9*($E$16-M28)*$E$18/SQRT($E$17))*SIN(PI()/2-($E$16-M28)*$E$18/SQRT($E$17)),0)*$F$6","v":0},{"$f":"IF(N28=M28,0,MAX(312*LOG10(8*$E$17+1)*EXP(-1.9*($E$16-N28)*$E$18/SQRT($E$17))*SIN(PI()/2-($E$16-N28)*$E$18/SQRT($E$17)),0))*$F$6","v":0},{"$f":"IF(O28=N28,0,MAX(312*LOG10(8*$E$17+1)*EXP(-1.9*($E$16-O28)*$E$18/SQRT($E$17))*SIN(PI()/2-($E$16-O28)*$E$18/SQRT($E$17)),0))*$F$6","v":0},0,0,0,0,0,0,0]
[null,null,null,"ac",{"$f":"Brand!N12/1000","v":0.1},"m",null,null,null,null,"Træklag 2",null,{"$f":"W95","v":0.04},7.1428571428571425E-2,0.10285714285714284,0.13428571428571426,0.16571428571428568,0.19714285714285709,0.22857142857142851,0.25999999999999995,0.25999999999999995,0.25999999999999995]
[null,null,null,"dc",{"$f":"IF(E30<2,0,(E16-2*E29)/(E31-1))","v":0},"m",null,null,null,null,null,null,{"$f":"MAX(312*LOG10(8*$E$17+1)*EXP(-1.9*M32*$E$18/SQRT($E$17))*SIN(PI()/2-M32*$E$18/SQRT($E$17)),0)*$B$6","v":229.4173602098129},{"$f":"IF(N32=M32,0,MAX(312*LOG10(8*$E$17+1)*EXP(-1.9*N32*$E$18/SQRT($E$17))*SIN(PI()/2-N32*$E$18/SQRT($E$17)),0))*$B$6","v":57.643088336117835},{"$f":"IF(O32=N32,0,MAX(312*LOG10(8*$E$17+1)*EXP(-1.9*O32*$E$18/SQRT($E$17))*SIN(PI()/2-O32*$E$18/SQRT($E$17)),0))*$B$6","v":3.1526187408052135},0,0,0,0,0,0,0]
[null,null,null,"E/Ek",{"$f":"IF(E30=0,1,(SUM(E53:E62)+0.5*(E30-E31)*(E57+E58))/E30)","v":1},null,null,null,null,null,{"$f":"-W99","v":0.65999999999999992},{"$f":"MAX(312*LOG10(8*$E$17+1)*EXP(-1.9*K34*$E$18/SQRT($E$17))*SIN(PI()/2-K34*$E$18/SQRT($E$17)),0)*$D$2","v":0},{"$f":"MAX(((M$33+M$35)*$E$20/($E$20+$V$5))*(1-($L34+$W34)/$E$20)+$L34+$W34,20)","v":395.93979875947514},{"$f":"IF(N32=M32,0,MAX(((N$33+N$35)*$E$20/($E$20+$V$5))*(1-($L34+$W34)/$E$20)+$L34+$W34,20))","v":271.2575575971652},{"$f":"IF(O32=N32,0,MAX(((O$33+O$35)*$E$20/($E$20+$V$5))*(1-($L34+$W34)/$E$20)+$L34+$W34,20))","v":231.70568642913673},229.41736020981259,229.41736020981259,231.70568642913673,271.25755759716509,395.93979875947485,0,0,{"$f":"MAX(312*LOG10(8*$E$17+1)*EXP(-1.9*($E$15-K34)*$E$18/SQRT($E$17))*SIN(PI()/2-($E$15-K34)*$E$18/SQRT($E$17)),0)*$D$11","v":229.41736020981259},{"$f":"(SUM(D54:D63)+0.5*(E36-E37)*(D58+D59))/E36","v":49.492474844934392}]
[null,null,null,"fy/fyk",{"$f":"IF(E30=0,1,(SUM(F53:F62)+0.5*(E30-E31)*(F57+F58))/E30)","v":1},null,null,null,null,null,null,null,{"$f":"MAX(312*LOG10(8*$E$17+1)*EXP(-1.9*($E$16-M32)*$E$18/SQRT($E$17))*SIN(PI()/2-($E$16-M32)*$E$18/SQRT($E$17)),0)*$F$6","v":0},{"$f":"IF(N32=M32,0,MAX(312*LOG10(8*$E$17+1)*EXP(-1.9*($E$16-N32)*$E$18/SQRT($E$17))*SIN(PI()/2-($E$16-N32)*$E$18/SQRT($E$17)),0))*$F$6","v":0},{"$f":"IF(O32=N32,0,MAX(312*LOG10(8*$E$17+1)*EXP(-1.9*($E$16-O32)*$E$18/SQRT($E$17))*SIN(PI()/2-($E$16-O32)*$E$18/SQRT($E$17)),0))*$F$6","v":0},0,0,3.152618740805178,57.643088336117678,229.41736020981259,0,0]
[null,"Træklag 2",null,"nt",{"$f":"Brand!O13","v":8},null,null,null,null,null,"Tryklag",null,{"$f":"E29","v":0.04},{"$f":"IF(N40<=$E$43,M36+$E$45,M36)","v":7.1428571428571425E-2},{"$f":"IF(O40<=$E$43,N36+$E$45,N36)","v":0.10285714285714284},0.13428571428571426,0.16571428571428568,0.19714285714285709,0.22857142857142851,0.25999999999999995,0.25999999999999995,0.25999999999999995]
[null,null,null,"reduc nt",{"$f":"MIN(FLOOR(E36,1),10)","v":8},null,null,null,null,null,null,null,{"$f":"MAX(312*LOG10(8*$E$17+1)*EXP(-1.9*M36*$E$18/SQRT($E$17))*SIN(PI()/2-M36*$E$18/SQRT($E$17)),0)*$B$6","v":229.4173602098129},{"$f":"IF(N36=M36,0,MAX(312*LOG10(8*$E$17+1)*EXP(-1.9*N36*$E$18/SQRT($E$17))*SIN(PI()/2-N36*$E$18/SQRT($E$17)),0))*$B$6","v":57.643088336117835},{"$f":"IF(O36=N36,0,MAX(312*LOG10(8*$E$17+1)*EXP(-1.9*O36*$E$18/SQRT($E$17))*SIN(PI()/2-O36*$E$18/SQRT($E$17)),0))*$B$6","v":3.1526187408052135},0,0,0,0,0,0,0]
[null,null,null,"at",{"$f":"Brand!N13/1000","v":0.04},"m",null,null,null,null,{"$f":"E44","v":0.04},{"$f":"MAX(312*LOG10(8*$E$17+1)*EXP(-1.9*K38*$E$18/SQRT($E$17))*SIN(PI()/2-K38*$E$18/SQRT($E$17)),0)*$D$2","v":0},{"$f":"MAX(((M$37+M$39)*$E$20/($E$20+$V$5))*(1-($L38+$W38)/$E$20)+$L38+$W38,20)","v":229.4173602098129},{"$f":"IF(N36=M36,0,MAX(((N$37+N$39)*$E$20/($E$20+$V$5))*(1-($L38+$W38)/$E$20)+$L38+$W38,20))","v":57.643088336117835},{"$f":"IF(O36=N36,0,MAX(((O$37+O$39)*$E$20/($E$20+$V$5))*(1-($L38+$W38)/$E$20)+$L38+$W38,20))","v":20},20,20,20,57.643088336117678,229.41736020981256,0,0,{"$f":"MAX(312*LOG10(8*$E$17+1)*EXP(-1.9*($E$15-K38)*$E$18/SQRT($E$17))*SIN(PI()/2-($E$15-K38)*$E$18/SQRT($E$17)),0)*$D$11","v":0},{"$f":"(SUM(D67:D76)+0.5*(E40-E41)*(D71+D72))/E40","v":1474.5574714770469}]
[null,null,null,"dt",{"$f":"IF(E36<2,0,(E16-2*E29)/(E37-1))","v":3.1428571428571424E-2},"m",null,null,null,null,null,null,{"$f":"MAX(312*LOG10(8*$E$17+1)*EXP(-1.9*($E$16-M36)*$E$18/SQRT($E$17))*SIN(PI()/2-($E$16-M36)*$E$18/SQRT($E$17)),0)*$F$6","v":0},{"$f":"IF(N36=M36,0,MAX(312*LOG10(8*$E$17+1)*EXP(-1.9*($E$16-N36)*$E$18/SQRT($E$17))*SIN(PI()/2-($E$16-N36)*$E$18/SQRT($E$17)),0))*$F$6","v":0},{"$f":"IF(O36=N36,0,MAX(312*LOG10(8*$E$17+1)*EXP(-1.9*($E$16-O36)*$E$18/SQRT($E$17))*SIN(PI()/2-($E$16-O36)*$E$18/SQRT($E$17)),0))*$F$6","v":0},0,0,3.152618740805178,57.643088336117678,229.41736020981259,0,0]
[null,null,null,"E/Ek",{"$f":"IF(E36=0,1,(SUM(E63:E72)+0.5*(E36-E37)*(E67+E68))/E36)","v":0.98699499998713647},null,null,null,null,null,null,null,1,2,3,4,5,6,7,8,9,10]
[null,null,null,"fy/fyk",{"$f":"IF(E36=0,1,(SUM(F63:F72)+0.5*(E36-E37)*(F67+F68))/E36)","v":0.88456897981162996}]
[null,"Tryklag",null,"nt",{"$f":"Brand!O11","v":8},null,null,null,null,null,"Træklag 1",null,null,null,null,null,null,"Træklag 2",null,null,null,null,null,null,"Tryklag",null,null,null,null,null,null,"Bøjler"]
[null,null,null,"reduc nt",{"$f":"MIN(FLOOR(E42,1),10)","v":8},null,null,null,null,null,"Tabel","type (+Q)",null,"type (+AC)",null,"type (+C)",null,"Tabel","type (+Q)",null,"type (+AC)",null,"type (+C)",null,"Tabel","type (+Q)",null,"type (+AC)",null,"type (+C)",null,"Tabel","type (+Q)",null,"type (+AC)",null,"type (+C)"]
[null,null,null,"atr",{"$f":"Brand!N11/1000","v":0.04},"m",null,null,null,null,"Q-stål","E/Ek","fy/fyk","E/Ek","fy/fyk","E/Ek","fy/fyk","Q-stål","E/Ek","fy/fyk","E/Ek","fy/fyk","E/Ek","fy/fyk","Q-stål","E/Ek","fy/fyk","E/Ek","fy/fyk","E/Ek","fy/fyk","Q-stål","E/Ek","fy/fyk","E/Ek","fy/fyk","E/Ek","fy/fyk"]
[null,null,null,"dt",{"$f":"IF(E42<2,0,(E16-2*E29)/(E43-1))","v":3.1428571428571424E-2},"m",null,null,null,null,"Temp-1",null,null,null,null,null,null,"Temp-11",null,null,null,null,null,null,"Temp-21",null,null,null,null,null,null,"Temp-31"]
[null,null,null,"E/Ek",{"$f":"IF(E42=0,1,(SUM(E73:E82)+0.5*(E42-E43)*(E77+E78))/E42)","v":0.99926456599475477},null,null,null,null,null,{"$f":"D53","v":233.4640816276553},{"$f":"IF(K46=K48,L48,L48+(L47-L48)*(K46-K48)/(K47-K48))","v":0.86653591837234467},{"$f":"IF(K46=K48,M48,M48+(M47-M48)*(K46-K48)/(K47-K48))","v":0.84318951020957922},{"$f":"IF(K46=K48,N48,N48+(N47-N48)*(K46-K48)/(K47-K48))","v":0.99665359183723445},{"$f":"IF(K46=K48,O48,O48+(O47-O48)*(K46-K48)/(K47-K48))","v":0.92326795918617233},{"$f":"IF(K46=K48,P48,P48+(P47-P48)*(K46-K48)/(K47-K48))","v":0.81980387755851702},{"$f":"IF(K46=K48,Q48,Q48+(Q47-Q48)*(K46-K48)/(K47-K48))","v":0.92992155102340679},{"$f":"D63","v":395.93979875947514},{"$f":"IF(R46=R48,S48,S48+(S47-S48)*(R46-R48)/(R47-R48))","v":0.70406020124052482},{"$f":"IF(R46=R48,T48,T48+(T47-T48)*(R46-R48)/(R47-R48))","v":0.65487224148862988},{"$f":"IF(R46=R48,U48,U48+(U47-U48)*(R46-R48)/(R47-R48))","v":0.9612180603721574},{"$f":"IF(R46=R48,V48,V48+(V47-V48)*(R46-R48)/(R47-R48))","v":0.78446622136457733},{"$f":"IF(R46=R48,W48,W48+(W47-W48)*(R46-R48)/(R47-R48))","v":0.56649632198483979},{"$f":"IF(R46=R48,X48,X48+(X47-X48)*(R46-R48)/(R47-R48))","v":0.78446622136457733},{"$f":"D73","v":229.4173602098129},{"$f":"IF(Y46=Y48,Z48,Z48+(Z47-Z48)*(Y46-Y48)/(Y47-Y48))","v":0.87058263979018713},{"$f":"IF(Y46=Y48,AA48,AA48+(AA47-AA48)*(Y46-Y48)/(Y47-Y48))","v":0.84764090376920587},{"$f":"IF(Y46=Y48,AB48,AB48+(AB47-AB48)*(Y46-Y48)/(Y47-Y48))","v":0.99705826397901876},{"$f":"IF(Y46=Y48,AC48,AC48+(AC47-AC48)*(Y46-Y48)/(Y47-Y48))","v":0.9252913198950935},{"$f":"IF(Y46=Y48,AD48,AD48+(AD47-AD48)*(Y46-Y48)/(Y47-Y48))","v":0.82587395968528066},{"$f":"IF(Y46=Y48,AE48,AE48+(AE47-AE48)*(Y46-Y48)/(Y47-Y48))","v":0.93234958387411226},{"$f":"AC14","v":383.61500130678695},{"$f":"IF(AF46=AF48,AG48,AG48+(AG47-AG48)*(AF46-AF48)/(AF47-AF48))","v":0.71638499869321304},{"$f":"IF(AF46=AF48,AH48,AH48+(AH47-AH48)*(AF46-AF48)/(AF47-AF48))","v":0.6696619984318557},{"$f":"IF(AF46=AF48,AI48,AI48+(AI47-AI48)*(AF46-AF48)/(AF47-AF48))","v":0.96491549960796386},{"$f":"IF(AF46=AF48,AJ48,AJ48+(AJ47-AJ48)*(AF46-AF48)/(AF47-AF48))","v":0.79802349856253441},{"$f":"IF(AF46=AF48,AK48,AK48+(AK47-AK48)*(AF46-AF48)/(AF47-AF48))","v":0.58621599790914092},{"$f":"IF(AF46=AF48,AL48,AL48+(AL47-AL48)*(AF46-AF48)/(AF47-AF48))","v":0.79802349856253441}]
[null,null,null,"fy/fyk",{"$f":"IF(E42=0,1,(SUM(F73:F82)+0.5*(E42-E43)*(F77+F78))/E42)","v":0.97897013695276602},null,null,null,null,null,{"$f":"CEILING(K46,100)","v":300},{"$f":"VLOOKUP(K47,$B$105:$H$117,2,TRUE)","v":0.8},{"$f":"VLOOKUP(K47,$B$105:$H$117,3,TRUE)","v":0.77},{"$f":"VLOOKUP(K47,$B$105:$H$117,4,TRUE)","v":0.99},{"$f":"VLOOKUP(K47,$B$105:$H$117,5,TRUE)","v":0.89},{"$f":"VLOOKUP(K47,$B$105:$H$117,6,TRUE)","v":0.72},{"$f":"VLOOKUP(K47,$B$105:$H$117,7,TRUE)","v":0.89},{"$f":"CEILING(R46,100)","v":400},{"$f":"VLOOKUP(R47,$B$105:$H$117,2,TRUE)","v":0.7},{"$f":"VLOOKUP(R47,$B$105:$H$117,3,TRUE)","v":0.65},{"$f":"VLOOKUP(R47,$B$105:$H$117,4,TRUE)","v":0.96},{"$f":"VLOOKUP(R47,$B$105:$H$117,5,TRUE)","v":0.78},{"$f":"VLOOKUP(R47,$B$105:$H$117,6,TRUE)","v":0.56000000000000005},{"$f":"VLOOKUP(R47,$B$105:$H$117,7,TRUE)","v":0.78},{"$f":"CEILING(Y46,100)","v":300},{"$f":"VLOOKUP(Y47,$B$105:$H$117,2,TRUE)","v":0.8},{"$f":"VLOOKUP(Y47,$B$105:$H$117,3,TRUE)","v":0.77},{"$f":"VLOOKUP(Y47,$B$105:$H$117,4,TRUE)","v":0.99},{"$f":"VLOOKUP(Y47,$B$105:$H$117,5,TRUE)","v":0.89},{"$f":"VLOOKUP(Y47,$B$105:$H$117,6,TRUE)","v":0.72},{"$f":"VLOOKUP(Y47,$B$105:$H$117,7,TRUE)","v":0.89},{"$f":"CEILING(AF46,100)","v":400},{"$f":"VLOOKUP(AF47,$B$105:$H$117,2,TRUE)","v":0.7},{"$f":"VLOOKUP(AF47,$B$105:$H$117,3,TRUE)","v":0.65},{"$f":"VLOOKUP(AF47,$B$105:$H$117,4,TRUE)","v":0.96},{"$f":"VLOOKUP(AF47,$B$105:$H$117,5,TRUE)","v":0.78},{"$f":"VLOOKUP(AF47,$B$105:$H$117,6,TRUE)","v":0.56000000000000005},{"$f":"VLOOKUP(AF47,$B$105:$H$117,7,TRUE)","v":0.78}]
[null,"Bøjler",null,"E/Ek",{"$f":"E83","v":0.96491549960796386},null,null,null,null,null,{"$f":"MAX(FLOOR(K46,100),20)","v":200},{"$f":"VLOOKUP(K48,$B$105:$H$117,2,TRUE)","v":0.9},{"$f":"VLOOKUP(K48,$B$105:$H$117,3,TRUE)","v":0.88},{"$f":"VLOOKUP(K48,$B$105:$H$117,4,TRUE)","v":1},{"$f":"VLOOKUP(K48,$B$105:$H$117,5,TRUE)","v":0.94},{"$f":"VLOOKUP(K48,$B$105:$H$117,6,TRUE)","v":0.87},{"$f":"VLOOKUP(K48,$B$105:$H$117,7,TRUE)","v":0.95},{"$f":"MAX(FLOOR(R46,100),20)","v":300},{"$f":"VLOOKUP(R48,$B$105:$H$117,2,TRUE)","v":0.8},{"$f":"VLOOKUP(R48,$B$105:$H$117,3,TRUE)","v":0.77},{"$f":"VLOOKUP(R48,$B$105:$H$117,4,TRUE)","v":0.99},{"$f":"VLOOKUP(R48,$B$105:$H$117,5,TRUE)","v":0.89},{"$f":"VLOOKUP(R48,$B$105:$H$117,6,TRUE)","v":0.72},{"$f":"VLOOKUP(R48,$B$105:$H$117,7,TRUE)","v":0.89},{"$f":"MAX(FLOOR(Y46,100),20)","v":200},{"$f":"VLOOKUP(Y48,$B$105:$H$117,2,TRUE)","v":0.9},{"$f":"VLOOKUP(Y48,$B$105:$H$117,3,TRUE)","v":0.88},{"$f":"VLOOKUP(Y48,$B$105:$H$117,4,TRUE)","v":1},{"$f":"VLOOKUP(Y48,$B$105:$H$117,5,TRUE)","v":0.94},{"$f":"VLOOKUP(Y48,$B$105:$H$117,6,TRUE)","v":0.87},{"$f":"VLOOKUP(Y48,$B$105:$H$117,7,TRUE)","v":0.95},{"$f":"MAX(FLOOR(AF46,100),20)","v":300},{"$f":"VLOOKUP(AF48,$B$105:$H$117,2,TRUE)","v":0.8},{"$f":"VLOOKUP(AF48,$B$105:$H$117,3,TRUE)","v":0.77},{"$f":"VLOOKUP(AF48,$B$105:$H$117,4,TRUE)","v":0.99},{"$f":"VLOOKUP(AF48,$B$105:$H$117,5,TRUE)","v":0.89},{"$f":"VLOOKUP(AF48,$B$105:$H$117,6,TRUE)","v":0.72},{"$f":"VLOOKUP(AF48,$B$105:$H$117,7,TRUE)","v":0.89}]
[null,null,null,"fy/fyk",{"$f":"F83","v":0.79802349856253441},null,null,null,null,null,"Temp-2",null,null,null,null,null,null,"Temp-12",null,null,null,null,null,null,"Temp-22"]
[null,null,null,null,null,null,null,null,null,null,{"$f":"D54","v":0},{"$f":"IF(K50=K52,L52,L52+(L51-L52)*(K50-K52)/(K51-K52))","v":{"$error":"#N/A"}},{"$f":"IF(K50=K52,M52,M52+(M51-M52)*(K50-K52)/(K51-K52))","v":{"$error":"#N/A"}},{"$f":"IF(K50=K52,N52,N52+(N51-N52)*(K50-K52)/(K51-K52))","v":{"$error":"#N/A"}},{"$f":"IF(K50=K52,O52,O52+(O51-O52)*(K50-K52)/(K51-K52))","v":{"$error":"#N/A"}},{"$f":"IF(K50=K52,P52,P52+(P51-P52)*(K50-K52)/(K51-K52))","v":{"$error":"#N/A"}},{"$f":"IF(K50=K52,Q52,Q52+(Q51-Q52)*(K50-K52)/(K51-K52))","v":{"$error":"#N/A"}},{"$f":"D64","v":271.2575575971652},{"$f":"IF(R50=R52,S52,S52+(S51-S52)*(R50-R52)/(R51-R52))","v":0.82874244240283479},{"$f":"IF(R50=R52,T52,T52+(T51-T52)*(R50-R52)/(R51-R52))","v":0.80161668664311825},{"$f":"IF(R50=R52,U52,U52+(U51-U52)*(R50-R52)/(R51-R52))","v":0.99287424424028348},{"$f":"IF(R50=R52,V52,V52+(V51-V52)*(R50-R52)/(R51-R52))","v":0.90437122120141744},{"$f":"IF(R50=R52,W52,W52+(W51-W52)*(R50-R52)/(R51-R52))","v":0.76311366360425215},{"$f":"IF(R50=R52,X52,X52+(X51-X52)*(R50-R52)/(R51-R52))","v":0.90724546544170093},{"$f":"D74","v":57.643088336117835},{"$f":"IF(Y50=Y52,Z52,Z52+(Z51-Z52)*(Y50-Y52)/(Y51-Y52))","v":1},{"$f":"IF(Y50=Y52,AA52,AA52+(AA51-AA52)*(Y50-Y52)/(Y51-Y52))","v":0.98117845583194108},{"$f":"IF(Y50=Y52,AB52,AB52+(AB51-AB52)*(Y50-Y52)/(Y51-Y52))","v":1},{"$f":"IF(Y50=Y52,AC52,AC52+(AC51-AC52)*(Y50-Y52)/(Y51-Y52))","v":0.99058922791597048},{"$f":"IF(Y50=Y52,AD52,AD52+(AD51-AD52)*(Y50-Y52)/(Y51-Y52))","v":1},{"$f":"IF(Y50=Y52,AE52,AE52+(AE51-AE52)*(Y50-Y52)/(Y51-Y52))","v":0.99529461395798524}]
[null,null,null,null,null,null,null,null,null,null,{"$f":"CEILING(K50,100)","v":0},{"$f":"VLOOKUP(K51,$B$105:$H$117,2,TRUE)","v":{"$error":"#N/A"}},{"$f":"VLOOKUP(K51,$B$105:$H$117,3,TRUE)","v":{"$error":"#N/A"}},{"$f":"VLOOKUP(K51,$B$105:$H$117,4,TRUE)","v":{"$error":"#N/A"}},{"$f":"VLOOKUP(K51,$B$105:$H$117,5,TRUE)","v":{"$error":"#N/A"}},{"$f":"VLOOKUP(K51,$B$105:$H$117,6,TRUE)","v":{"$error":"#N/A"}},{"$f":"VLOOKUP(K51,$B$105:$H$117,7,TRUE)","v":{"$error":"#N/A"}},{"$f":"CEILING(R50,100)","v":300},{"$f":"VLOOKUP(R51,$B$105:$H$117,2,TRUE)","v":0.8},{"$f":"VLOOKUP(R51,$B$105:$H$117,3,TRUE)","v":0.77},{"$f":"VLOOKUP(R51,$B$105:$H$117,4,TRUE)","v":0.99},{"$f":"VLOOKUP(R51,$B$105:$H$117,5,TRUE)","v":0.89},{"$f":"VLOOKUP(R51,$B$105:$H$117,6,TRUE)","v":0.72},{"$f":"VLOOKUP(R51,$B$105:$H$117,7,TRUE)","v":0.89},{"$f":"CEILING(Y50,100)","v":100},{"$f":"VLOOKUP(Y51,$B$105:$H$117,2,TRUE)","v":1},{"$f":"VLOOKUP(Y51,$B$105:$H$117,3,TRUE)","v":0.96},{"$f":"VLOOKUP(Y51,$B$105:$H$117,4,TRUE)","v":1},{"$f":"VLOOKUP(Y51,$B$105:$H$117,5,TRUE)","v":0.98},{"$f":"VLOOKUP(Y51,$B$105:$H$117,6,TRUE)","v":1},{"$f":"VLOOKUP(Y51,$B$105:$H$117,7,TRUE)","v":0.99}]
[null,null,null,"Temp","E/Ek","fy/fyk",null,null,null,null,{"$f":"MAX(FLOOR(K50,100),20)","v":20},{"$f":"VLOOKUP(K52,$B$105:$H$117,2,TRUE)","v":1},{"$f":"VLOOKUP(K52,$B$105:$H$117,3,TRUE)","v":1},{"$f":"VLOOKUP(K52,$B$105:$H$117,4,TRUE)","v":1},{"$f":"VLOOKUP(K52,$B$105:$H$117,5,TRUE)","v":1},{"$f":"VLOOKUP(K52,$B$105:$H$117,6,TRUE)","v":1},{"$f":"VLOOKUP(K52,$B$105:$H$117,7,TRUE)","v":1},{"$f":"MAX(FLOOR(R50,100),20)","v":200},{"$f":"VLOOKUP(R52,$B$105:$H$117,2,TRUE)","v":0.9},{"$f":"VLOOKUP(R52,$B$105:$H$117,3,TRUE)","v":0.88},{"$f":"VLOOKUP(R52,$B$105:$H$117,4,TRUE)","v":1},{"$f":"VLOOKUP(R52,$B$105:$H$117,5,TRUE)","v":0.94},{"$f":"VLOOKUP(R52,$B$105:$H$117,6,TRUE)","v":0.87},{"$f":"VLOOKUP(R52,$B$105:$H$117,7,TRUE)","v":0.95},{"$f":"MAX(FLOOR(Y50,100),20)","v":20},{"$f":"VLOOKUP(Y52,$B$105:$H$117,2,TRUE)","v":1},{"$f":"VLOOKUP(Y52,$B$105:$H$117,3,TRUE)","v":1},{"$f":"VLOOKUP(Y52,$B$105:$H$117,4,TRUE)","v":1},{"$f":"VLOOKUP(Y52,$B$105:$H$117,5,TRUE)","v":1},{"$f":"VLOOKUP(Y52,$B$105:$H$117,6,TRUE)","v":1},{"$f":"VLOOKUP(Y52,$B$105:$H$117,7,TRUE)","v":1}]
[null,"Træklag 1",1,{"$f":"M30","v":233.4640816276553},{"$f":"IF(D53=0,0,INDEX($L$45:$Q$84,2+(C53-1)*4,$D$28))","v":0.99665359183723445},{"$f":"IF(D53=0,0,INDEX($L$45:$Q$84,2+(C53-1)*4,$D$28+1))","v":0.92326795918617233},null,null,null,null,"Temp-3",null,null,null,null,null,null,"Temp-13",null,null,null,null,null,null,"Temp-23"]
[null,null,2,{"$f":"N30","v":0},0,0,null,null,null,null,{"$f":"D55","v":0},{"$f":"IF(K54=K56,L56,L56+(L55-L56)*(K54-K56)/(K55-K56))","v":{"$error":"#N/A"}},{"$f":"IF(K54=K56,M56,M56+(M55-M56)*(K54-K56)/(K55-K56))","v":{"$error":"#N/A"}},{"$f":"IF(K54=K56,N56,N56+(N55-N56)*(K54-K56)/(K55-K56))","v":{"$error":"#N/A"}},{"$f":"IF(K54=K56,O56,O56+(O55-O56)*(K54-K56)/(K55-K56))","v":{"$error":"#N/A"}},{"$f":"IF(K54=K56,P56,P56+(P55-P56)*(K54-K56)/(K55-K56))","v":{"$error":"#N/A"}},{"$f":"IF(K54=K56,Q56,Q56+(Q55-Q56)*(K54-K56)/(K55-K56))","v":{"$error":"#N/A"}},{"$f":"D65","v":231.70568642913673},{"$f":"IF(R54=R56,S56,S56+(S55-S56)*(R54-R56)/(R55-R56))","v":0.86829431357086329},{"$f":"IF(R54=R56,T56,T56+(T55-T56)*(R54-R56)/(R55-R56))","v":0.84512374492794962},{"$f":"IF(R54=R56,U56,U56+(U55-U56)*(R54-R56)/(R55-R56))","v":0.99682943135708635},{"$f":"IF(R54=R56,V56,V56+(V55-V56)*(R54-R56)/(R55-R56))","v":0.92414715678543158},{"$f":"IF(R54=R56,W56,W56+(W55-W56)*(R54-R56)/(R55-R56))","v":0.82244147035629489},{"$f":"IF(R54=R56,X56,X56+(X55-X56)*(R54-R56)/(R55-R56))","v":0.93097658814251794},{"$f":"D75","v":20},{"$f":"IF(Y54=Y56,Z56,Z56+(Z55-Z56)*(Y54-Y56)/(Y55-Y56))","v":1},{"$f":"IF(Y54=Y56,AA56,AA56+(AA55-AA56)*(Y54-Y56)/(Y55-Y56))","v":1},{"$f":"IF(Y54=Y56,AB56,AB56+(AB55-AB56)*(Y54-Y56)/(Y55-Y56))","v":1},{"$f":"IF(Y54=Y56,AC56,AC56+(AC55-AC56)*(Y54-Y56)/(Y55-Y56))","v":1},{"$f":"IF(Y54=Y56,AD56,AD56+(AD55-AD56)*(Y54-Y56)/(Y55-Y56))","v":1},{"$f":"IF(Y54=Y56,AE56,AE56+(AE55-AE56)*(Y54-Y56)/(Y55-Y56))","v":1}]
[null,null,3,{"$f":"O30","v":0},0,0,null,null,null,null,{"$f":"CEILING(K54,100)","v":0},{"$f":"VLOOKUP(K55,$B$105:$H$117,2,TRUE)","v":{"$error":"#N/A"}},{"$f":"VLOOKUP(K55,$B$105:$H$117,3,TRUE)","v":{"$error":"#N/A"}},{"$f":"VLOOKUP(K55,$B$105:$H$117,4,TRUE)","v":{"$error":"#N/A"}},{"$f":"VLOOKUP(K55,$B$105:$H$117,5,TRUE)","v":{"$error":"#N/A"}},{"$f":"VLOOKUP(K55,$B$105:$H$117,6,TRUE)","v":{"$error":"#N/A"}},{"$f":"VLOOKUP(K55,$B$105:$H$117,7,TRUE)","v":{"$error":"#N/A"}},{"$f":"CEILING(R54,100)","v":300},{"$f":"VLOOKUP(R55,$B$105:$H$117,2,TRUE)","v":0.8},{"$f":"VLOOKUP(R55,$B$105:$H$117,3,TRUE)","v":0.77},{"$f":"VLOOKUP(R55,$B$105:$H$117,4,TRUE)","v":0.99},{"$f":"VLOOKUP(R55,$B$105:$H$117,5,TRUE)","v":0.89},{"$f":"VLOOKUP(R55,$B$105:$H$117,6,TRUE)","v":0.72},{"$f":"VLOOKUP(R55,$B$105:$H$117,7,TRUE)","v":0.89},{"$f":"CEILING(Y54,100)","v":100},{"$f":"VLOOKUP(Y55,$B$105:$H$117,2,TRUE)","v":1},{"$f":"VLOOKUP(Y55,$B$105:$H$117,3,TRUE)","v":0.96},{"$f":"VLOOKUP(Y55,$B$105:$H$117,4,TRUE)","v":1},{"$f":"VLOOKUP(Y55,$B$105:$H$117,5,TRUE)","v":0.98},{"$f":"VLOOKUP(Y55,$B$105:$H$117,6,TRUE)","v":1},{"$f":"VLOOKUP(Y55,$B$105:$H$117,7,TRUE)","v":0.99}]
[null,null,4,{"$f":"P30","v":0},0,0,null,null,null,null,{"$f":"MAX(FLOOR(K54,100),20)","v":20},{"$f":"VLOOKUP(K56,$B$105:$H$117,2,TRUE)","v":1},{"$f":"VLOOKUP(K56,$B$105:$H$117,3,TRUE)","v":1},{"$f":"VLOOKUP(K56,$B$105:$H$117,4,TRUE)","v":1},{"$f":"VLOOKUP(K56,$B$105:$H$117,5,TRUE)","v":1},{"$f":"VLOOKUP(K56,$B$105:$H$117,6,TRUE)","v":1},{"$f":"VLOOKUP(K56,$B$105:$H$117,7,TRUE)","v":1},{"$f":"MAX(FLOOR(R54,100),20)","v":200},{"$f":"VLOOKUP(R56,$B$105:$H$117,2,TRUE)","v":0.9},{"$f":"VLOOKUP(R56,$B$105:$H$117,3,TRUE)","v":0.88},{"$f":"VLOOKUP(R56,$B$105:$H$117,4,TRUE)","v":1},{"$f":"VLOOKUP(R56,$B$105:$H$117,5,TRUE)","v":0.94},{"$f":"VLOOKUP(R56,$B$105:$H$117,6,TRUE)","v":0.87},{"$f":"VLOOKUP(R56,$B$105:$H$117,7,TRUE)","v":0.95},{"$f":"MAX(FLOOR(Y54,100),20)","v":20},{"$f":"VLOOKUP(Y56,$B$105:$H$117,2,TRUE)","v":1},{"$f":"VLOOKUP(Y56,$B$105:$H$117,3,TRUE)","v":1},{"$f":"VLOOKUP(Y56,$B$105:$H$117,4,TRUE)","v":1},{"$f":"VLOOKUP(Y56,$B$105:$H$117,5,TRUE)","v":1},{"$f":"VLOOKUP(Y56,$B$105:$H$117,6,TRUE)","v":1},{"$f":"VLOOKUP(Y56,$B$105:$H$117,7,TRUE)","v":1}]
[null,null,5,{"$f":"Q30","v":0},0,0,null,null,null,null,"Temp-4",null,null,null,null,null,null,"Temp-14",null,null,null,null,null,null,"Temp-24"]
[null,null,6,{"$f":"R30","v":0},0,0,null,null,null,null,{"$f":"D56","v":0},{"$f":"IF(K58=K60,L60,L60+(L59-L60)*(K58-K60)/(K59-K60))","v":{"$error":"#N/A"}},{"$f":"IF(K58=K60,M60,M60+(M59-M60)*(K58-K60)/(K59-K60))","v":{"$error":"#N/A"}},{"$f":"IF(K58=K60,N60,N60+(N59-N60)*(K58-K60)/(K59-K60))","v":{"$error":"#N/A"}},{"$f":"IF(K58=K60,O60,O60+(O59-O60)*(K58-K60)/(K59-K60))","v":{"$error":"#N/A"}},{"$f":"IF(K58=K60,P60,P60+(P59-P60)*(K58-K60)/(K59-K60))","v":{"$error":"#N/A"}},{"$f":"IF(K58=K60,Q60,Q60+(Q59-Q60)*(K58-K60)/(K59-K60))","v":{"$error":"#N/A"}},{"$f":"D66","v":229.41736020981259},{"$f":"IF(R58=R60,S60,S60+(S59-S60)*(R58-R60)/(R59-R60))","v":0.87058263979018746},{"$f":"IF(R58=R60,T60,T60+(T59-T60)*(R58-R60)/(R59-R60))","v":0.8476409037692062},{"$f":"IF(R58=R60,U60,U60+(U59-U60)*(R58-R60)/(R59-R60))","v":0.99705826397901876},{"$f":"IF(R58=R60,V60,V60+(V59-V60)*(R58-R60)/(R59-R60))","v":0.92529131989509372},{"$f":"IF(R58=R60,W60,W60+(W59-W60)*(R58-R60)/(R59-R60))","v":0.8258739596852811},{"$f":"IF(R58=R60,X60,X60+(X59-X60)*(R58-R60)/(R59-R60))","v":0.93234958387411238},{"$f":"D76","v":20},{"$f":"IF(Y58=Y60,Z60,Z60+(Z59-Z60)*(Y58-Y60)/(Y59-Y60))","v":1},{"$f":"IF(Y58=Y60,AA60,AA60+(AA59-AA60)*(Y58-Y60)/(Y59-Y60))","v":1},{"$f":"IF(Y58=Y60,AB60,AB60+(AB59-AB60)*(Y58-Y60)/(Y59-Y60))","v":1},{"$f":"IF(Y58=Y60,AC60,AC60+(AC59-AC60)*(Y58-Y60)/(Y59-Y60))","v":1},{"$f":"IF(Y58=Y60,AD60,AD60+(AD59-AD60)*(Y58-Y60)/(Y59-Y60))","v":1},{"$f":"IF(Y58=Y60,AE60,AE60+(AE59-AE60)*(Y58-Y60)/(Y59-Y60))","v":1}]
[null,null,7,{"$f":"S30","v":0},0,0,null,null,null,null,{"$f":"CEILING(K58,100)","v":0},{"$f":"VLOOKUP(K59,$B$105:$H$117,2,TRUE)","v":{"$error":"#N/A"}},{"$f":"VLOOKUP(K59,$B$105:$H$117,3,TRUE)","v":{"$error":"#N/A"}},{"$f":"VLOOKUP(K59,$B$105:$H$117,4,TRUE)","v":{"$error":"#N/A"}},{"$f":"VLOOKUP(K59,$B$105:$H$117,5,TRUE)","v":{"$error":"#N/A"}},{"$f":"VLOOKUP(K59,$B$105:$H$117,6,TRUE)","v":{"$error":"#N/A"}},{"$f":"VLOOKUP(K59,$B$105:$H$117,7,TRUE)","v":{"$error":"#N/A"}},{"$f":"CEILING(R58,100)","v":300},{"$f":"VLOOKUP(R59,$B$105:$H$117,2,TRUE)","v":0.8},{"$f":"VLOOKUP(R59,$B$105:$H$117,3,TRUE)","v":0.77},{"$f":"VLOOKUP(R59,$B$105:$H$117,4,TRUE)","v":0.99},{"$f":"VLOOKUP(R59,$B$105:$H$117,5,TRUE)","v":0.89},{"$f":"VLOOKUP(R59,$B$105:$H$117,6,TRUE)","v":0.72},{"$f":"VLOOKUP(R59,$B$105:$H$117,7,TRUE)","v":0.89},{"$f":"CEILING(Y58,100)","v":100},{"$f":"VLOOKUP(Y59,$B$105:$H$117,2,TRUE)","v":1},{"$f":"VLOOKUP(Y59,$B$105:$H$117,3,TRUE)","v":0.96},{"$f":"VLOOKUP(Y59,$B$105:$H$117,4,TRUE)","v":1},{"$f":"VLOOKUP(Y59,$B$105:$H$117,5,TRUE)","v":0.98},{"$f":"VLOOKUP(Y59,$B$105:$H$117,6,TRUE)","v":1},{"$f":"VLOOKUP(Y59,$B$105:$H$117,7,TRUE)","v":0.99}]
[null,null,8,{"$f":"T30","v":0},0,0,null,null,null,null,{"$f":"MAX(FLOOR(K58,100),20)","v":20},{"$f":"VLOOKUP(K60,$B$105:$H$117,2,TRUE)","v":1},{"$f":"VLOOKUP(K60,$B$105:$H$117,3,TRUE)","v":1},{"$f":"VLOOKUP(K60,$B$105:$H$117,4,TRUE)","v":1},{"$f":"VLOOKUP(K60,$B$105:$H$117,5,TRUE)","v":1},{"$f":"VLOOKUP(K60,$B$105:$H$117,6,TRUE)","v":1},{"$f":"VLOOKUP(K60,$B$105:$H$117,7,TRUE)","v":1},{"$f":"MAX(FLOOR(R58,100),20)","v":200},{"$f":"VLOOKUP(R60,$B$105:$H$117,2,TRUE)","v":0.9},{"$f":"VLOOKUP(R60,$B$105:$H$117,3,TRUE)","v":0.88},{"$f":"VLOOKUP(R60,$B$105:$H$117,4,TRUE)","v":1},{"$f":"VLOOKUP(R60,$B$105:$H$117,5,TRUE)","v":0.94},{"$f":"VLOOKUP(R60,$B$105:$H$117,6,TRUE)","v":0.87},{"$f":"VLOOKUP(R60,$B$105:$H$117,7,TRUE)","v":0.95},{"$f":"MAX(FLOOR(Y58,100),20)","v":20},{"$f":"VLOOKUP(Y60,$B$105:$H$117,2,TRUE)","v":1},{"$f":"VLOOKUP(Y60,$B$105:$H$117,3,TRUE)","v":1},{"$f":"VLOOKUP(Y60,$B$105:$H$117,4,TRUE)","v":1},{"$f":"VLOOKUP(Y60,$B$105:$H$117,5,TRUE)","v":1},{"$f":"VLOOKUP(Y60,$B$105:$H$117,6,TRUE)","v":1},{"$f":"VLOOKUP(Y60,$B$105:$H$117,7,TRUE)","v":1}]
[null,null,9,{"$f":"U30","v":0},0,0,null,null,null,null,"Temp-5",null,null,null,null,null,null,"Temp-15",null,null,null,null,null,null,"Temp-25"]
[null,null,10,{"$f":"V30","v":0},0,0,null,null,null,null,{"$f":"D57","v":0},{"$f":"IF(K62=K64,L64,L64+(L63-L64)*(K62-K64)/(K63-K64))","v":{"$error":"#N/A"}},{"$f":"IF(K62=K64,M64,M64+(M63-M64)*(K62-K64)/(K63-K64))","v":{"$error":"#N/A"}},{"$f":"IF(K62=K64,N64,N64+(N63-N64)*(K62-K64)/(K63-K64))","v":{"$error":"#N/A"}},{"$f":"IF(K62=K64,O64,O64+(O63-O64)*(K62-K64)/(K63-K64))","v":{"$error":"#N/A"}},{"$f":"IF(K62=K64,P64,P64+(P63-P64)*(K62-K64)/(K63-K64))","v":{"$error":"#N/A"}},{"$f":"IF(K62=K64,Q64,Q64+(Q63-Q64)*(K62-K64)/(K63-K64))","v":{"$error":"#N/A"}},{"$f":"D67","v":229.41736020981259},{"$f":"IF(R62=R64,S64,S64+(S63-S64)*(R62-R64)/(R63-R64))","v":0.87058263979018746},{"$f":"IF(R62=R64,T64,T64+(T63-T64)*(R62-R64)/(R63-R64))","v":0.8476409037692062},{"$f":"IF(R62=R64,U64,U64+(U63-U64)*(R62-R64)/(R63-R64))","v":0.99705826397901876},{"$f":"IF(R62=R64,V64,V64+(V63-V64)*(R62-R64)/(R63-R64))","v":0.92529131989509372},{"$f":"IF(R62=R64,W64,W64+(W63-W64)*(R62-R64)/(R63-R64))","v":0.8258739596852811},{"$f":"IF(R62=R64,X64,X64+(X63-X64)*(R62-R64)/(R63-R64))","v":0.93234958387411238},{"$f":"D77","v":20},{"$f":"IF(Y62=Y64,Z64,Z64+(Z63-Z64)*(Y62-Y64)/(Y63-Y64))","v":1},{"$f":"IF(Y62=Y64,AA64,AA64+(AA63-AA64)*(Y62-Y64)/(Y63-Y64))","v":1},{"$f":"IF(Y62=Y64,AB64,AB64+(AB63-AB64)*(Y62-Y64)/(Y63-Y64))","v":1},{"$f":"IF(Y62=Y64,AC64,AC64+(AC63-AC64)*(Y62-Y64)/(Y63-Y64))","v":1},{"$f":"IF(Y62=Y64,AD64,AD64+(AD63-AD64)*(Y62-Y64)/(Y63-Y64))","v":1},{"$f":"IF(Y62=Y64,AE64,AE64+(AE63-AE64)*(Y62-Y64)/(Y63-Y64))","v":1}]
[null,"Træklag 2",11,{"$f":"M34","v":395.93979875947514},{"$f":"IF(D63=0,0,INDEX($S$45:$X$84,2+(C63-11)*4,$D$28))","v":0.9612180603721574},{"$f":"IF(D63=0,0,INDEX($S$45:$X$84,2+(C63-11)*4,$D$28+1))","v":0.78446622136457733},null,null,null,null,{"$f":"CEILING(K62,100)","v":0},{"$f":"VLOOKUP(K63,$B$105:$H$117,2,TRUE)","v":{"$error":"#N/A"}},{"$f":"VLOOKUP(K63,$B$105:$H$117,3,TRUE)","v":{"$error":"#N/A"}},{"$f":"VLOOKUP(K63,$B$105:$H$117,4,TRUE)","v":{"$error":"#N/A"}},{"$f":"VLOOKUP(K63,$B$105:$H$117,5,TRUE)","v":{"$error":"#N/A"}},{"$f":"VLOOKUP(K63,$B$105:$H$117,6,TRUE)","v":{"$error":"#N/A"}},{"$f":"VLOOKUP(K63,$B$105:$H$117,7,TRUE)","v":{"$error":"#N/A"}},{"$f":"CEILING(R62,100)","v":300},{"$f":"VLOOKUP(R63,$B$105:$H$117,2,TRUE)","v":0.8},{"$f":"VLOOKUP(R63,$B$105:$H$117,3,TRUE)","v":0.77},{"$f":"VLOOKUP(R63,$B$105:$H$117,4,TRUE)","v":0.99},{"$f":"VLOOKUP(R63,$B$105:$H$117,5,TRUE)","v":0.89},{"$f":"VLOOKUP(R63,$B$105:$H$117,6,TRUE)","v":0.72},{"$f":"VLOOKUP(R63,$B$105:$H$117,7,TRUE)","v":0.89},{"$f":"CEILING(Y62,100)","v":100},{"$f":"VLOOKUP(Y63,$B$105:$H$117,2,TRUE)","v":1},{"$f":"VLOOKUP(Y63,$B$105:$H$117,3,TRUE)","v":0.96},{"$f":"VLOOKUP(Y63,$B$105:$H$117,4,TRUE)","v":1},{"$f":"VLOOKUP(Y63,$B$105:$H$117,5,TRUE)","v":0.98},{"$f":"VLOOKUP(Y63,$B$105:$H$117,6,TRUE)","v":1},{"$f":"VLOOKUP(Y63,$B$105:$H$117,7,TRUE)","v":0.99}]
[null,null,12,{"$f":"N34","v":271.2575575971652},0.99287424424028348,0.90437122120141744,null,null,null,null,{"$f":"MAX(FLOOR(K62,100),20)","v":20},{"$f":"VLOOKUP(K64,$B$105:$H$117,2,TRUE)","v":1},{"$f":"VLOOKUP(K64,$B$105:$H$117,3,TRUE)","v":1},{"$f":"VLOOKUP(K64,$B$105:$H$117,4,TRUE)","v":1},{"$f":"VLOOKUP(K64,$B$105:$H$117,5,TRUE)","v":1},{"$f":"VLOOKUP(K64,$B$105:$H$117,6,TRUE)","v":1},{"$f":"VLOOKUP(K64,$B$105:$H$117,7,TRUE)","v":1},{"$f":"MAX(FLOOR(R62,100),20)","v":200},{"$f":"VLOOKUP(R64,$B$105:$H$117,2,TRUE)","v":0.9},{"$f":"VLOOKUP(R64,$B$105:$H$117,3,TRUE)","v":0.88},{"$f":"VLOOKUP(R64,$B$105:$H$117,4,TRUE)","v":1},{"$f":"VLOOKUP(R64,$B$105:$H$117,5,TRUE)","v":0.94},{"$f":"VLOOKUP(R64,$B$105:$H$117,6,TRUE)","v":0.87},{"$f":"VLOOKUP(R64,$B$105:$H$117,7,TRUE)","v":0.95},{"$f":"MAX(FLOOR(Y62,100),20)","v":20},{"$f":"VLOOKUP(Y64,$B$105:$H$117,2,TRUE)","v":1},{"$f":"VLOOKUP(Y64,$B$105:$H$117,3,TRUE)","v":1},{"$f":"VLOOKUP(Y64,$B$105:$H$117,4,TRUE)","v":1},{"$f":"VLOOKUP(Y64,$B$105:$H$117,5,TRUE)","v":1},{"$f":"VLOOKUP(Y64,$B$105:$H$117,6,TRUE)","v":1},{"$f":"VLOOKUP(Y64,$B$105:$H$117,7,TRUE)","v":1}]
[null,null,13,{"$f":"O34","v":231.70568642913673},0.99682943135708635,0.92414715678543158,null,null,null,null,"Temp-6",null,null,null,null,null,null,"Temp-16",null,null,null,null,null,null,"Temp-26"]
[null,null,14,{"$f":"P34","v":229.41736020981259},0.99705826397901876,0.92529131989509372,null,null,null,null,{"$f":"D58","v":0},{"$f":"IF(K66=K68,L68,L68+(L67-L68)*(K66-K68)/(K67-K68))","v":{"$error":"#N/A"}},{"$f":"IF(K66=K68,M68,M68+(M67-M68)*(K66-K68)/(K67-K68))","v":{"$error":"#N/A"}},{"$f":"IF(K66=K68,N68,N68+(N67-N68)*(K66-K68)/(K67-K68))","v":{"$error":"#N/A"}},{"$f":"IF(K66=K68,O68,O68+(O67-O68)*(K66-K68)/(K67-K68))","v":{"$error":"#N/A"}},{"$f":"IF(K66=K68,P68,P68+(P67-P68)*(K66-K68)/(K67-K68))","v":{"$error":"#N/A"}},{"$f":"IF(K66=K68,Q68,Q68+(Q67-Q68)*(K66-K68)/(K67-K68))","v":{"$error":"#N/A"}},{"$f":"D68","v":231.70568642913673},{"$f":"IF(R66=R68,S68,S68+(S67-S68)*(R66-R68)/(R67-R68))","v":0.86829431357086329},{"$f":"IF(R66=R68,T68,T68+(T67-T68)*(R66-R68)/(R67-R68))","v":0.84512374492794962},{"$f":"IF(R66=R68,U68,U68+(U67-U68)*(R66-R68)/(R67-R68))","v":0.99682943135708635},{"$f":"IF(R66=R68,V68,V68+(V67-V68)*(R66-R68)/(R67-R68))","v":0.92414715678543158},{"$f":"IF(R66=R68,W68,W68+(W67-W68)*(R66-R68)/(R67-R68))","v":0.82244147035629489},{"$f":"IF(R66=R68,X68,X68+(X67-X68)*(R66-R68)/(R67-R68))","v":0.93097658814251794},{"$f":"D78","v":20},{"$f":"IF(Y66=Y68,Z68,Z68+(Z67-Z68)*(Y66-Y68)/(Y67-Y68))","v":1},{"$f":"IF(Y66=Y68,AA68,AA68+(AA67-AA68)*(Y66-Y68)/(Y67-Y68))","v":1},{"$f":"IF(Y66=Y68,AB68,AB68+(AB67-AB68)*(Y66-Y68)/(Y67-Y68))","v":1},{"$f":"IF(Y66=Y68,AC68,AC68+(AC67-AC68)*(Y66-Y68)/(Y67-Y68))","v":1},{"$f":"IF(Y66=Y68,AD68,AD68+(AD67-AD68)*(Y66-Y68)/(Y67-Y68))","v":1},{"$f":"IF(Y66=Y68,AE68,AE68+(AE67-AE68)*(Y66-Y68)/(Y67-Y68))","v":1}]
[null,null,15,{"$f":"Q34","v":229.41736020981259},0.99705826397901876,0.92529131989509372,null,null,null,null,{"$f":"CEILING(K66,100)","v":0},{"$f":"VLOOKUP(K67,$B$105:$H$117,2,TRUE)","v":{"$error":"#N/A"}},{"$f":"VLOOKUP(K67,$B$105:$H$117,3,TRUE)","v":{"$error":"#N/A"}},{"$f":"VLOOKUP(K67,$B$105:$H$117,4,TRUE)","v":{"$error":"#N/A"}},{"$f":"VLOOKUP(K67,$B$105:$H$117,5,TRUE)","v":{"$error":"#N/A"}},{"$f":"VLOOKUP(K67,$B$105:$H$117,6,TRUE)","v":{"$error":"#N/A"}},{"$f":"VLOOKUP(K67,$B$105:$H$117,7,TRUE)","v":{"$error":"#N/A"}},{"$f":"CEILING(R66,100)","v":300},{"$f":"VLOOKUP(R67,$B$105:$H$117,2,TRUE)","v":0.8},{"$f":"VLOOKUP(R67,$B$105:$H$117,3,TRUE)","v":0.77},{"$f":"VLOOKUP(R67,$B$105:$H$117,4,TRUE)","v":0.99},{"$f":"VLOOKUP(R67,$B$105:$H$117,5,TRUE)","v":0.89},{"$f":"VLOOKUP(R67,$B$105:$H$117,6,TRUE)","v":0.72},{"$f":"VLOOKUP(R67,$B$105:$H$117,7,TRUE)","v":0.89},{"$f":"CEILING(Y66,100)","v":100},{"$f":"VLOOKUP(Y67,$B$105:$H$117,2,TRUE)","v":1},{"$f":"VLOOKUP(Y67,$B$105:$H$117,3,TRUE)","v":0.96},{"$f":"VLOOKUP(Y67,$B$105:$H$117,4,TRUE)","v":1},{"$f":"VLOOKUP(Y67,$B$105:$H$117,5,TRUE)","v":0.98},{"$f":"VLOOKUP(Y67,$B$105:$H$117,6,TRUE)","v":1},{"$f":"VLOOKUP(Y67,$B$105:$H$117,7,TRUE)","v":0.99}]
[null,null,16,{"$f":"R34","v":231.70568642913673},0.99682943135708635,0.92414715678543158,null,null,null,null,{"$f":"MAX(FLOOR(K66,100),20)","v":20},{"$f":"VLOOKUP(K68,$B$105:$H$117,2,TRUE)","v":1},{"$f":"VLOOKUP(K68,$B$105:$H$117,3,TRUE)","v":1},{"$f":"VLOOKUP(K68,$B$105:$H$117,4,TRUE)","v":1},{"$f":"VLOOKUP(K68,$B$105:$H$117,5,TRUE)","v":1},{"$f":"VLOOKUP(K68,$B$105:$H$117,6,TRUE)","v":1},{"$f":"VLOOKUP(K68,$B$105:$H$117,7,TRUE)","v":1},{"$f":"MAX(FLOOR(R66,100),20)","v":200},{"$f":"VLOOKUP(R68,$B$105:$H$117,2,TRUE)","v":0.9},{"$f":"VLOOKUP(R68,$B$105:$H$117,3,TRUE)","v":0.88},{"$f":"VLOOKUP(R68,$B$105:$H$117,4,TRUE)","v":1},{"$f":"VLOOKUP(R68,$B$105:$H$117,5,TRUE)","v":0.94},{"$f":"VLOOKUP(R68,$B$105:$H$117,6,TRUE)","v":0.87},{"$f":"VLOOKUP(R68,$B$105:$H$117,7,TRUE)","v":0.95},{"$f":"MAX(FLOOR(Y66,100),20)","v":20},{"$f":"VLOOKUP(Y68,$B$105:$H$117,2,TRUE)","v":1},{"$f":"VLOOKUP(Y68,$B$105:$H$117,3,TRUE)","v":1},{"$f":"VLOOKUP(Y68,$B$105:$H$117,4,TRUE)","v":1},{"$f":"VLOOKUP(Y68,$B$105:$H$117,5,TRUE)","v":1},{"$f":"VLOOKUP(Y68,$B$105:$H$117,6,TRUE)","v":1},{"$f":"VLOOKUP(Y68,$B$105:$H$117,7,TRUE)","v":1}]
[null,null,17,{"$f":"S34","v":271.25755759716509},0.99287424424028348,0.90437122120141744,null,null,null,null,"Temp-7",null,null,null,null,null,null,"Temp-17",null,null,null,null,null,null,"Temp-27"]
[null,null,18,{"$f":"T34","v":395.93979875947485},0.96121806037215751,0.78446622136457766,null,null,null,null,{"$f":"D59","v":0},{"$f":"IF(K70=K72,L72,L72+(L71-L72)*(K70-K72)/(K71-K72))","v":{"$error":"#N/A"}},{"$f":"IF(K70=K72,M72,M72+(M71-M72)*(K70-K72)/(K71-K72))","v":{"$error":"#N/A"}},{"$f":"IF(K70=K72,N72,N72+(N71-N72)*(K70-K72)/(K71-K72))","v":{"$error":"#N/A"}},{"$f":"IF(K70=K72,O72,O72+(O71-O72)*(K70-K72)/(K71-K72))","v":{"$error":"#N/A"}},{"$f":"IF(K70=K72,P72,P72+(P71-P72)*(K70-K72)/(K71-K72))","v":{"$error":"#N/A"}},{"$f":"IF(K70=K72,Q72,Q72+(Q71-Q72)*(K70-K72)/(K71-K72))","v":{"$error":"#N/A"}},{"$f":"D69","v":271.25755759716509},{"$f":"IF(R70=R72,S72,S72+(S71-S72)*(R70-R72)/(R71-R72))","v":0.8287424424028349},{"$f":"IF(R70=R72,T72,T72+(T71-T72)*(R70-R72)/(R71-R72))","v":0.80161668664311847},{"$f":"IF(R70=R72,U72,U72+(U71-U72)*(R70-R72)/(R71-R72))","v":0.99287424424028348},{"$f":"IF(R70=R72,V72,V72+(V71-V72)*(R70-R72)/(R71-R72))","v":0.90437122120141744},{"$f":"IF(R70=R72,W72,W72+(W71-W72)*(R70-R72)/(R71-R72))","v":0.76311366360425237},{"$f":"IF(R70=R72,X72,X72+(X71-X72)*(R70-R72)/(R71-R72))","v":0.90724546544170093},{"$f":"D79","v":57.643088336117678},{"$f":"IF(Y70=Y72,Z72,Z72+(Z71-Z72)*(Y70-Y72)/(Y71-Y72))","v":1},{"$f":"IF(Y70=Y72,AA72,AA72+(AA71-AA72)*(Y70-Y72)/(Y71-Y72))","v":0.98117845583194119},{"$f":"IF(Y70=Y72,AB72,AB72+(AB71-AB72)*(Y70-Y72)/(Y71-Y72))","v":1},{"$f":"IF(Y70=Y72,AC72,AC72+(AC71-AC72)*(Y70-Y72)/(Y71-Y72))","v":0.99058922791597059},{"$f":"IF(Y70=Y72,AD72,AD72+(AD71-AD72)*(Y70-Y72)/(Y71-Y72))","v":1},{"$f":"IF(Y70=Y72,AE72,AE72+(AE71-AE72)*(Y70-Y72)/(Y71-Y72))","v":0.99529461395798524}]
[null,null,19,{"$f":"U34","v":0},0,0,null,null,null,null,{"$f":"CEILING(K70,100)","v":0},{"$f":"VLOOKUP(K71,$B$105:$H$117,2,TRUE)","v":{"$error":"#N/A"}},{"$f":"VLOOKUP(K71,$B$105:$H$117,3,TRUE)","v":{"$error":"#N/A"}},{"$f":"VLOOKUP(K71,$B$105:$H$117,4,TRUE)","v":{"$error":"#N/A"}},{"$f":"VLOOKUP(K71,$B$105:$H$117,5,TRUE)","v":{"$error":"#N/A"}},{"$f":"VLOOKUP(K71,$B$105:$H$117,6,TRUE)","v":{"$error":"#N/A"}},{"$f":"VLOOKUP(K71,$B$105:$H$117,7,TRUE)","v":{"$error":"#N/A"}},{"$f":"CEILING(R70,100)","v":300},{"$f":"VLOOKUP(R71,$B$105:$H$117,2,TRUE)","v":0.8},{"$f":"VLOOKUP(R71,$B$105:$H$117,3,TRUE)","v":0.77},{"$f":"VLOOKUP(R71,$B$105:$H$117,4,TRUE)","v":0.99},{"$f":"VLOOKUP(R71,$B$105:$H$117,5,TRUE)","v":0.89},{"$f":"VLOOKUP(R71,$B$105:$H$117,6,TRUE)","v":0.72},{"$f":"VLOOKUP(R71,$B$105:$H$117,7,TRUE)","v":0.89},{"$f":"CEILING(Y70,100)","v":100},{"$f":"VLOOKUP(Y71,$B$105:$H$117,2,TRUE)","v":1},{"$f":"VLOOKUP(Y71,$B$105:$H$117,3,TRUE)","v":0.96},{"$f":"VLOOKUP(Y71,$B$105:$H$117,4,TRUE)","v":1},{"$f":"VLOOKUP(Y71,$B$105:$H$117,5,TRUE)","v":0.98},{"$f":"VLOOKUP(Y71,$B$105:$H$117,6,TRUE)","v":1},{"$f":"VLOOKUP(Y71,$B$105:$H$117,7,TRUE)","v":0.99}]
[null,null,20,{"$f":"V34","v":0},0,0,null,null,null,null,{"$f":"MAX(FLOOR(K70,100),20)","v":20},{"$f":"VLOOKUP(K72,$B$105:$H$117,2,TRUE)","v":1},{"$f":"VLOOKUP(K72,$B$105:$H$117,3,TRUE)","v":1},{"$f":"VLOOKUP(K72,$B$105:$H$117,4,TRUE)","v":1},{"$f":"VLOOKUP(K72,$B$105:$H$117,5,TRUE)","v":1},{"$f":"VLOOKUP(K72,$B$105:$H$117,6,TRUE)","v":1},{"$f":"VLOOKUP(K72,$B$105:$H$117,7,TRUE)","v":1},{"$f":"MAX(FLOOR(R70,100),20)","v":200},{"$f":"VLOOKUP(R72,$B$105:$H$117,2,TRUE)","v":0.9},{"$f":"VLOOKUP(R72,$B$105:$H$117,3,TRUE)","v":0.88},{"$f":"VLOOKUP(R72,$B$105:$H$117,4,TRUE)","v":1},{"$f":"VLOOKUP(R72,$B$105:$H$117,5,TRUE)","v":0.94},{"$f":"VLOOKUP(R72,$B$105:$H$117,6,TRUE)","v":0.87},{"$f":"VLOOKUP(R72,$B$105:$H$117,7,TRUE)","v":0.95},{"$f":"MAX(FLOOR(Y70,100),20)","v":20},{"$f":"VLOOKUP(Y72,$B$105:$H$117,2,TRUE)","v":1},{"$f":"VLOOKUP(Y72,$B$105:$H$117,3,TRUE)","v":1},{"$f":"VLOOKUP(Y72,$B$105:$H$117,4,TRUE)","v":1},{"$f":"VLOOKUP(Y72,$B$105:$H$117,5,TRUE)","v":1},{"$f":"VLOOKUP(Y72,$B$105:$H$117,6,TRUE)","v":1},{"$f":"VLOOKUP(Y72,$B$105:$H$117,7,TRUE)","v":1}]
[null,"Tryklag",21,{"$f":"M38","v":229.4173602098129},{"$f":"IF(D73=0,0,INDEX($Z$45:$AE$84,2+(C73-21)*4,$D$28))","v":0.99705826397901876},{"$f":"IF(D73=0,0,INDEX($Z$45:$AE$84,2+(C73-21)*4,$D$28+1))","v":0.9252913198950935},null,null,null,null,"Temp-8",null,null,null,null,null,null,"Temp-18",null,null,null,null,null,null,"Temp-28"]
[null,null,22,{"$f":"N38","v":57.643088336117835},1,0.99058922791597048,null,null,null,null,{"$f":"D60","v":0},{"$f":"IF(K74=K76,L76,L76+(L75-L76)*(K74-K76)/(K75-K76))","v":{"$error":"#N/A"}},{"$f":"IF(K74=K76,M76,M76+(M75-M76)*(K74-K76)/(K75-K76))","v":{"$error":"#N/A"}},{"$f":"IF(K74=K76,N76,N76+(N75-N76)*(K74-K76)/(K75-K76))","v":{"$error":"#N/A"}},{"$f":"IF(K74=K76,O76,O76+(O75-O76)*(K74-K76)/(K75-K76))","v":{"$error":"#N/A"}},{"$f":"IF(K74=K76,P76,P76+(P75-P76)*(K74-K76)/(K75-K76))","v":{"$error":"#N/A"}},{"$f":"IF(K74=K76,Q76,Q76+(Q75-Q76)*(K74-K76)/(K75-K76))","v":{"$error":"#N/A"}},{"$f":"D70","v":395.93979875947485},{"$f":"IF(R74=R76,S76,S76+(S75-S76)*(R74-R76)/(R75-R76))","v":0.70406020124052515},{"$f":"IF(R74=R76,T76,T76+(T75-T76)*(R74-R76)/(R75-R76))","v":0.65487224148863021},{"$f":"IF(R74=R76,U76,U76+(U75-U76)*(R74-R76)/(R75-R76))","v":0.96121806037215751},{"$f":"IF(R74=R76,V76,V76+(V75-V76)*(R74-R76)/(R75-R76))","v":0.78446622136457766},{"$f":"IF(R74=R76,W76,W76+(W75-W76)*(R74-R76)/(R75-R76))","v":0.56649632198484023},{"$f":"IF(R74=R76,X76,X76+(X75-X76)*(R74-R76)/(R75-R76))","v":0.78446622136457766},{"$f":"D80","v":229.41736020981256},{"$f":"IF(Y74=Y76,Z76,Z76+(Z75-Z76)*(Y74-Y76)/(Y75-Y76))","v":0.87058263979018746},{"$f":"IF(Y74=Y76,AA76,AA76+(AA75-AA76)*(Y74-Y76)/(Y75-Y76))","v":0.8476409037692062},{"$f":"IF(Y74=Y76,AB76,AB76+(AB75-AB76)*(Y74-Y76)/(Y75-Y76))","v":0.99705826397901876},{"$f":"IF(Y74=Y76,AC76,AC76+(AC75-AC76)*(Y74-Y76)/(Y75-Y76))","v":0.92529131989509372},{"$f":"IF(Y74=Y76,AD76,AD76+(AD75-AD76)*(Y74-Y76)/(Y75-Y76))","v":0.8258739596852811},{"$f":"IF(Y74=Y76,AE76,AE76+(AE75-AE76)*(Y74-Y76)/(Y75-Y76))","v":0.93234958387411249}]
[null,null,23,{"$f":"O38","v":20},1,1,null,null,null,null,{"$f":"CEILING(K74,100)","v":0},{"$f":"VLOOKUP(K75,$B$105:$H$117,2,TRUE)","v":{"$error":"#N/A"}},{"$f":"VLOOKUP(K75,$B$105:$H$117,3,TRUE)","v":{"$error":"#N/A"}},{"$f":"VLOOKUP(K75,$B$105:$H$117,4,TRUE)","v":{"$error":"#N/A"}},{"$f":"VLOOKUP(K75,$B$105:$H$117,5,TRUE)","v":{"$error":"#N/A"}},{"$f":"VLOOKUP(K75,$B$105:$H$117,6,TRUE)","v":{"$error":"#N/A"}},{"$f":"VLOOKUP(K75,$B$105:$H$117,7,TRUE)","v":{"$error":"#N/A"}},{"$f":"CEILING(R74,100)","v":400},{"$f":"VLOOKUP(R75,$B$105:$H$117,2,TRUE)","v":0.7},{"$f":"VLOOKUP(R75,$B$105:$H$117,3,TRUE)","v":0.65},{"$f":"VLOOKUP(R75,$B$105:$H$117,4,TRUE)","v":0.96},{"$f":"VLOOKUP(R75,$B$105:$H$117,5,TRUE)","v":0.78},{"$f":"VLOOKUP(R75,$B$105:$H$117,6,TRUE)","v":0.56000000000000005},{"$f":"VLOOKUP(R75,$B$105:$H$117,7,TRUE)","v":0.78},{"$f":"CEILING(Y74,100)","v":300},{"$f":"VLOOKUP(Y75,$B$105:$H$117,2,TRUE)","v":0.8},{"$f":"VLOOKUP(Y75,$B$105:$H$117,3,TRUE)","v":0.77},{"$f":"VLOOKUP(Y75,$B$105:$H$117,4,TRUE)","v":0.99},{"$f":"VLOOKUP(Y75,$B$105:$H$117,5,TRUE)","v":0.89},{"$f":"VLOOKUP(Y75,$B$105:$H$117,6,TRUE)","v":0.72},{"$f":"VLOOKUP(Y75,$B$105:$H$117,7,TRUE)","v":0.89}]
[null,null,24,{"$f":"P38","v":20},1,1,null,null,null,null,{"$f":"MAX(FLOOR(K74,100),20)","v":20},{"$f":"VLOOKUP(K76,$B$105:$H$117,2,TRUE)","v":1},{"$f":"VLOOKUP(K76,$B$105:$H$117,3,TRUE)","v":1},{"$f":"VLOOKUP(K76,$B$105:$H$117,4,TRUE)","v":1},{"$f":"VLOOKUP(K76,$B$105:$H$117,5,TRUE)","v":1},{"$f":"VLOOKUP(K76,$B$105:$H$117,6,TRUE)","v":1},{"$f":"VLOOKUP(K76,$B$105:$H$117,7,TRUE)","v":1},{"$f":"MAX(FLOOR(R74,100),20)","v":300},{"$f":"VLOOKUP(R76,$B$105:$H$117,2,TRUE)","v":0.8},{"$f":"VLOOKUP(R76,$B$105:$H$117,3,TRUE)","v":0.77},{"$f":"VLOOKUP(R76,$B$105:$H$117,4,TRUE)","v":0.99},{"$f":"VLOOKUP(R76,$B$105:$H$117,5,TRUE)","v":0.89},{"$f":"VLOOKUP(R76,$B$105:$H$117,6,TRUE)","v":0.72},{"$f":"VLOOKUP(R76,$B$105:$H$117,7,TRUE)","v":0.89},{"$f":"MAX(FLOOR(Y74,100),20)","v":200},{"$f":"VLOOKUP(Y76,$B$105:$H$117,2,TRUE)","v":0.9},{"$f":"VLOOKUP(Y76,$B$105:$H$117,3,TRUE)","v":0.88},{"$f":"VLOOKUP(Y76,$B$105:$H$117,4,TRUE)","v":1},{"$f":"VLOOKUP(Y76,$B$105:$H$117,5,TRUE)","v":0.94},{"$f":"VLOOKUP(Y76,$B$105:$H$117,6,TRUE)","v":0.87},{"$f":"VLOOKUP(Y76,$B$105:$H$117,7,TRUE)","v":0.95}]
[null,null,25,{"$f":"Q38","v":20},1,1,null,null,null,null,"Temp-9",null,null,null,null,null,null,"Temp-19",null,null,null,null,null,null,"Temp-29"]
[null,null,26,{"$f":"R38","v":20},1,1,null,null,null,null,{"$f":"D61","v":0},{"$f":"IF(K78=K80,L80,L80+(L79-L80)*(K78-K80)/(K79-K80))","v":{"$error":"#N/A"}},{"$f":"IF(K78=K80,M80,M80+(M79-M80)*(K78-K80)/(K79-K80))","v":{"$error":"#N/A"}},{"$f":"IF(K78=K80,N80,N80+(N79-N80)*(K78-K80)/(K79-K80))","v":{"$error":"#N/A"}},{"$f":"IF(K78=K80,O80,O80+(O79-O80)*(K78-K80)/(K79-K80))","v":{"$error":"#N/A"}},{"$f":"IF(K78=K80,P80,P80+(P79-P80)*(K78-K80)/(K79-K80))","v":{"$error":"#N/A"}},{"$f":"IF(K78=K80,Q80,Q80+(Q79-Q80)*(K78-K80)/(K79-K80))","v":{"$error":"#N/A"}},{"$f":"D71","v":0},{"$f":"IF(R78=R80,S80,S80+(S79-S80)*(R78-R80)/(R79-R80))","v":{"$error":"#N/A"}},{"$f":"IF(R78=R80,T80,T80+(T79-T80)*(R78-R80)/(R79-R80))","v":{"$error":"#N/A"}},{"$f":"IF(R78=R80,U80,U80+(U79-U80)*(R78-R80)/(R79-R80))","v":{"$error":"#N/A"}},{"$f":"IF(R78=R80,V80,V80+(V79-V80)*(R78-R80)/(R79-R80))","v":{"$error":"#N/A"}},{"$f":"IF(R78=R80,W80,W80+(W79-W80)*(R78-R80)/(R79-R80))","v":{"$error":"#N/A"}},{"$f":"IF(R78=R80,X80,X80+(X79-X80)*(R78-R80)/(R79-R80))","v":{"$error":"#N/A"}},{"$f":"D81","v":0},{"$f":"IF(Y78=Y80,Z80,Z80+(Z79-Z80)*(Y78-Y80)/(Y79-Y80))","v":{"$error":"#N/A"}},{"$f":"IF(Y78=Y80,AA80,AA80+(AA79-AA80)*(Y78-Y80)/(Y79-Y80))","v":{"$error":"#N/A"}},{"$f":"IF(Y78=Y80,AB80,AB80+(AB79-AB80)*(Y78-Y80)/(Y79-Y80))","v":{"$error":"#N/A"}},{"$f":"IF(Y78=Y80,AC80,AC80+(AC79-AC80)*(Y78-Y80)/(Y79-Y80))","v":{"$error":"#N/A"}},{"$f":"IF(Y78=Y80,AD80,AD80+(AD79-AD80)*(Y78-Y80)/(Y79-Y80))","v":{"$error":"#N/A"}},{"$f":"IF(Y78=Y80,AE80,AE80+(AE79-AE80)*(Y78-Y80)/(Y79-Y80))","v":{"$error":"#N/A"}}]
[null,null,27,{"$f":"S38","v":57.643088336117678},1,0.99058922791597059,null,null,null,null,{"$f":"CEILING(K78,100)","v":0},{"$f":"VLOOKUP(K79,$B$105:$H$117,2,TRUE)","v":{"$error":"#N/A"}},{"$f":"VLOOKUP(K79,$B$105:$H$117,3,TRUE)","v":{"$error":"#N/A"}},{"$f":"VLOOKUP(K79,$B$105:$H$117,4,TRUE)","v":{"$error":"#N/A"}},{"$f":"VLOOKUP(K79,$B$105:$H$117,5,TRUE)","v":{"$error":"#N/A"}},{"$f":"VLOOKUP(K79,$B$105:$H$117,6,TRUE)","v":{"$error":"#N/A"}},{"$f":"VLOOKUP(K79,$B$105:$H$117,7,TRUE)","v":{"$error":"#N/A"}},{"$f":"CEILING(R78,100)","v":0},{"$f":"VLOOKUP(R79,$B$105:$H$117,2,TRUE)","v":{"$error":"#N/A"}},{"$f":"VLOOKUP(R79,$B$105:$H$117,3,TRUE)","v":{"$error":"#N/A"}},{"$f":"VLOOKUP(R79,$B$105:$H$117,4,TRUE)","v":{"$error":"#N/A"}},{"$f":"VLOOKUP(R79,$B$105:$H$117,5,TRUE)","v":{"$error":"#N/A"}},{"$f":"VLOOKUP(R79,$B$105:$H$117,6,TRUE)","v":{"$error":"#N/A"}},{"$f":"VLOOKUP(R79,$B$105:$H$117,7,TRUE)","v":{"$error":"#N/A"}},{"$f":"CEILING(Y78,100)","v":0},{"$f":"VLOOKUP(Y79,$B$105:$H$117,2,TRUE)","v":{"$error":"#N/A"}},{"$f":"VLOOKUP(Y79,$B$105:$H$117,3,TRUE)","v":{"$error":"#N/A"}},{"$f":"VLOOKUP(Y79,$B$105:$H$117,4,TRUE)","v":{"$error":"#N/A"}},{"$f":"VLOOKUP(Y79,$B$105:$H$117,5,TRUE)","v":{"$error":"#N/A"}},{"$f":"VLOOKUP(Y79,$B$105:$H$117,6,TRUE)","v":{"$error":"#N/A"}},{"$f":"VLOOKUP(Y79,$B$105:$H$117,7,TRUE)","v":{"$error":"#N/A"}}]
[null,null,28,{"$f":"T38","v":229.41736020981256},0.99705826397901876,0.92529131989509372,null,null,null,null,{"$f":"MAX(FLOOR(K78,100),20)","v":20},{"$f":"VLOOKUP(K80,$B$105:$H$117,2,TRUE)","v":1},{"$f":"VLOOKUP(K80,$B$105:$H$117,3,TRUE)","v":1},{"$f":"VLOOKUP(K80,$B$105:$H$117,4,TRUE)","v":1},{"$f":"VLOOKUP(K80,$B$105:$H$117,5,TRUE)","v":1},{"$f":"VLOOKUP(K80,$B$105:$H$117,6,TRUE)","v":1},{"$f":"VLOOKUP(K80,$B$105:$H$117,7,TRUE)","v":1},{"$f":"MAX(FLOOR(R78,100),20)","v":20},{"$f":"VLOOKUP(R80,$B$105:$H$117,2,TRUE)","v":1},{"$f":"VLOOKUP(R80,$B$105:$H$117,3,TRUE)","v":1},{"$f":"VLOOKUP(R80,$B$105:$H$117,4,TRUE)","v":1},{"$f":"VLOOKUP(R80,$B$105:$H$117,5,TRUE)","v":1},{"$f":"VLOOKUP(R80,$B$105:$H$117,6,TRUE)","v":1},{"$f":"VLOOKUP(R80,$B$105:$H$117,7,TRUE)","v":1},{"$f":"MAX(FLOOR(Y78,100),20)","v":20},{"$f":"VLOOKUP(Y80,$B$105:$H$117,2,TRUE)","v":1},{"$f":"VLOOKUP(Y80,$B$105:$H$117,3,TRUE)","v":1},{"$f":"VLOOKUP(Y80,$B$105:$H$117,4,TRUE)","v":1},{"$f":"VLOOKUP(Y80,$B$105:$H$117,5,TRUE)","v":1},{"$f":"VLOOKUP(Y80,$B$105:$H$117,6,TRUE)","v":1},{"$f":"VLOOKUP(Y80,$B$105:$H$117,7,TRUE)","v":1}]
[null,null,29,{"$f":"U38","v":0},0,0,null,null,null,null,"Temp-10",null,null,null,null,null,null,"Temp-20",null,null,null,null,null,null,"Temp-300"]
[null,null,30,{"$f":"V38","v":0},0,0,null,null,null,null,{"$f":"D62","v":0},{"$f":"IF(K82=K84,L84,L84+(L83-L84)*(K82-K84)/(K83-K84))","v":{"$error":"#N/A"}},{"$f":"IF(K82=K84,M84,M84+(M83-M84)*(K82-K84)/(K83-K84))","v":{"$error":"#N/A"}},{"$f":"IF(K82=K84,N84,N84+(N83-N84)*(K82-K84)/(K83-K84))","v":{"$error":"#N/A"}},{"$f":"IF(K82=K84,O84,O84+(O83-O84)*(K82-K84)/(K83-K84))","v":{"$error":"#N/A"}},{"$f":"IF(K82=K84,P84,P84+(P83-P84)*(K82-K84)/(K83-K84))","v":{"$error":"#N/A"}},{"$f":"IF(K82=K84,Q84,Q84+(Q83-Q84)*(K82-K84)/(K83-K84))","v":{"$error":"#N/A"}},{"$f":"D72","v":0},{"$f":"IF(R82=R84,S84,S84+(S83-S84)*(R82-R84)/(R83-R84))","v":{"$error":"#N/A"}},{"$f":"IF(R82=R84,T84,T84+(T83-T84)*(R82-R84)/(R83-R84))","v":{"$error":"#N/A"}},{"$f":"IF(R82=R84,U84,U84+(U83-U84)*(R82-R84)/(R83-R84))","v":{"$error":"#N/A"}},{"$f":"IF(R82=R84,V84,V84+(V83-V84)*(R82-R84)/(R83-R84))","v":{"$error":"#N/A"}},{"$f":"IF(R82=R84,W84,W84+(W83-W84)*(R82-R84)/(R83-R84))","v":{"$error":"#N/A"}},{"$f":"IF(R82=R84,X84,X84+(X83-X84)*(R82-R84)/(R83-R84))","v":{"$error":"#N/A"}},{"$f":"D82","v":0},{"$f":"IF(Y82=Y84,Z84,Z84+(Z83-Z84)*(Y82-Y84)/(Y83-Y84))","v":{"$error":"#N/A"}},{"$f":"IF(Y82=Y84,AA84,AA84+(AA83-AA84)*(Y82-Y84)/(Y83-Y84))","v":{"$error":"#N/A"}},{"$f":"IF(Y82=Y84,AB84,AB84+(AB83-AB84)*(Y82-Y84)/(Y83-Y84))","v":{"$error":"#N/A"}},{"$f":"IF(Y82=Y84,AC84,AC84+(AC83-AC84)*(Y82-Y84)/(Y83-Y84))","v":{"$error":"#N/A"}},{"$f":"IF(Y82=Y84,AD84,AD84+(AD83-AD84)*(Y82-Y84)/(Y83-Y84))","v":{"$error":"#N/A"}},{"$f":"IF(Y82=Y84,AE84,AE84+(AE83-AE84)*(Y82-Y84)/(Y83-Y84))","v":{"$error":"#N/A"}}]
[null,"Bøjler",31,{"$f":"AC14","v":383.61500130678695},{"$f":"IF(D83=0,0,INDEX($AG$45:$AL$48,2+(C83-31)*4,$D$28))","v":0.96491549960796386},{"$f":"IF(D83=0,0,INDEX($AG$45:$AL$84,2+(C83-31)*4,$D$28+1))","v":0.79802349856253441},null,null,null,null,{"$f":"CEILING(K82,100)","v":0},{"$f":"VLOOKUP(K83,$B$105:$H$117,2,TRUE)","v":{"$error":"#N/A"}},{"$f":"VLOOKUP(K83,$B$105:$H$117,3,TRUE)","v":{"$error":"#N/A"}},{"$f":"VLOOKUP(K83,$B$105:$H$117,4,TRUE)","v":{"$error":"#N/A"}},{"$f":"VLOOKUP(K83,$B$105:$H$117,5,TRUE)","v":{"$error":"#N/A"}},{"$f":"VLOOKUP(K83,$B$105:$H$117,6,TRUE)","v":{"$error":"#N/A"}},{"$f":"VLOOKUP(K83,$B$105:$H$117,7,TRUE)","v":{"$error":"#N/A"}},{"$f":"CEILING(R82,100)","v":0},{"$f":"VLOOKUP(R83,$B$105:$H$117,2,TRUE)","v":{"$error":"#N/A"}},{"$f":"VLOOKUP(R83,$B$105:$H$117,3,TRUE)","v":{"$error":"#N/A"}},{"$f":"VLOOKUP(R83,$B$105:$H$117,4,TRUE)","v":{"$error":"#N/A"}},{"$f":"VLOOKUP(R83,$B$105:$H$117,5,TRUE)","v":{"$error":"#N/A"}},{"$f":"VLOOKUP(R83,$B$105:$H$117,6,TRUE)","v":{"$error":"#N/A"}},{"$f":"VLOOKUP(R83,$B$105:$H$117,7,TRUE)","v":{"$error":"#N/A"}},{"$f":"CEILING(Y82,100)","v":0},{"$f":"VLOOKUP(Y83,$B$105:$H$117,2,TRUE)","v":{"$error":"#N/A"}},{"$f":"VLOOKUP(Y83,$B$105:$H$117,3,TRUE)","v":{"$error":"#N/A"}},{"$f":"VLOOKUP(Y83,$B$105:$H$117,4,TRUE)","v":{"$error":"#N/A"}},{"$f":"VLOOKUP(Y83,$B$105:$H$117,5,TRUE)","v":{"$error":"#N/A"}},{"$f":"VLOOKUP(Y83,$B$105:$H$117,6,TRUE)","v":{"$error":"#N/A"}},{"$f":"VLOOKUP(Y83,$B$105:$H$117,7,TRUE)","v":{"$error":"#N/A"}}]
[null,null,null,null,null,null,null,null,null,null,{"$f":"MAX(FLOOR(K82,100),20)","v":20},{"$f":"VLOOKUP(K84,$B$105:$H$117,2,TRUE)","v":1},{"$f":"VLOOKUP(K84,$B$105:$H$117,3,TRUE)","v":1},{"$f":"VLOOKUP(K84,$B$105:$H$117,4,TRUE)","v":1},{"$f":"VLOOKUP(K84,$B$105:$H$117,5,TRUE)","v":1},{"$f":"VLOOKUP(K84,$B$105:$H$117,6,TRUE)","v":1},{"$f":"VLOOKUP(K84,$B$105:$H$117,7,TRUE)","v":1},{"$f":"MAX(FLOOR(R82,100),20)","v":20},{"$f":"VLOOKUP(R84,$B$105:$H$117,2,TRUE)","v":1},{"$f":"VLOOKUP(R84,$B$105:$H$117,3,TRUE)","v":1},{"$f":"VLOOKUP(R84,$B$105:$H$117,4,TRUE)","v":1},{"$f":"VLOOKUP(R84,$B$105:$H$117,5,TRUE)","v":1},{"$f":"VLOOKUP(R84,$B$105:$H$117,6,TRUE)","v":1},{"$f":"VLOOKUP(R84,$B$105:$H$117,7,TRUE)","v":1},{"$f":"MAX(FLOOR(Y82,100),20)","v":20},{"$f":"VLOOKUP(Y84,$B$105:$H$117,2,TRUE)","v":1},{"$f":"VLOOKUP(Y84,$B$105:$H$117,3,TRUE)","v":1},{"$f":"VLOOKUP(Y84,$B$105:$H$117,4,TRUE)","v":1},{"$f":"VLOOKUP(Y84,$B$105:$H$117,5,TRUE)","v":1},{"$f":"VLOOKUP(Y84,$B$105:$H$117,6,TRUE)","v":1},{"$f":"VLOOKUP(Y84,$B$105:$H$117,7,TRUE)","v":1}]
[]
[]
[]
[]
[]
[]
[]
[]
[]
[null,"GRAF",null,null,null,null,null,null,null,null,null,null,1,2,3,4,5,6,7,8,9,10,1,2,3,4,5,6,7,8,9,10]
[null,"x",0,{"$f":"E16","v":0.3},{"$f":"E16","v":0.3},0,0,{"$f":"E26","v":1.6512929696867067E-2},{"$f":"D95-E26","v":0.28348707030313292},{"$f":"E95-E26","v":0.28348707030313292},{"$f":"E26","v":1.6512929696867067E-2},{"$f":"E26","v":1.6512929696867067E-2},{"$f":"E29","v":0.04},{"$f":"IF(N94>$E$31,M95,M95+$E$33)","v":0.04},0.04,0.04,0.04,0.04,0.04,0.04,0.04,0.04,{"$f":"E29","v":0.04},{"$f":"IF(X94>$E$37,W95,W95+$E$39)","v":7.1428571428571425E-2},0.10285714285714284,0.13428571428571426,0.16571428571428568,0.19714285714285709,0.22857142857142851,0.25999999999999995,0.25999999999999995,0.25999999999999995,{"$f":"IF(E15>E16,E15,E16)","v":0.7}]
[null,"Opr rand",0,0,{"$f":"-E15","v":-0.7},{"$f":"-E15","v":-0.7},0]
[null,"Reduc rand",null,null,null,null,null,{"$f":"-E25","v":0},{"$f":"-E25","v":0},{"$f":"E96+E27","v":-0.68348707030313294},{"$f":"F96+E27","v":-0.68348707030313294},{"$f":"-E25","v":0}]
[null,"Træklag 1",null,null,null,null,null,null,null,null,null,null,{"$f":"-$E$15+$E$32","v":-0.6},{"$f":"-$E$15+$E$32","v":-0.6},-0.6,-0.6,-0.6,-0.6,-0.6,-0.6,-0.6,-0.6]
[null,"Træklag 2",null,null,null,null,null,null,null,null,null,null,null,null,null,null,null,null,null,null,null,null,{"$f":"-$E$15+$E$38","v":-0.65999999999999992},-0.65999999999999992,-0.65999999999999992,-0.65999999999999992,-0.65999999999999992,-0.65999999999999992,-0.65999999999999992,-0.65999999999999992,-0.65999999999999992,-0.65999999999999992]
[null,"Skala",null,null,null,null,null,null,null,null,null,null,null,null,null,null,null,null,null,null,null,null,null,null,null,null,null,null,null,null,null,null,{"$f":"IF(E15>E16,-E15,-E16)","v":-0.7}]
[]
[]
[null,"Tabel","type (+Q)",null,"type (+AC)",null,"type (+C)"]
[null,"Q-stål","E/Ek","fy/fyk","E/Ek","fy/fyk","E/Ek","fy/fyk"]
[null,20,1,1,1,1,1,1]
[null,100,1,0.96,1,0.98,1,0.99]
[null,200,0.9,0.88,1,0.94,0.87,0.95]
[null,300,0.8,0.77,0.99,0.89,0.72,0.89]
[null,400,0.7,0.65,0.96,0.78,0.56000000000000005,0.78]
[null,500,0.6,0.47,0.79,0.55000000000000004,0.4,0.56999999999999995]
[null,600,0.31,0.27,0.48,0.27,0.24,0.3]
[null,700,0.13,0.13,0.21,0.1,0.08,0.12]
[null,800,0.09,0.05,0.08,0,0.06,0.05]
[null,900,7.0000000000000007E-2,0.02,0.03,0,0.05,0.02]
[null,1000,0.04,0.01,0,0,0.03,0.01]
[null,1100,0.02,0.01,0,0,0.02,0]
[null,1200,0,0,0,0,0,0]
[]
[]
[]
[null,"Betontype",{"$f":"Makro!A3","v":2}]
[null,"Reduktionsparametre, beton",null,null,null,null,"Betontype,  fc,t/fck"]
[null,"q","fc,t/fck","ec1","ecu1,t","Indeks",1,2]
[null,20,{"$f":"IF($C$121=1,G124,H124)","v":1},2.5000000000000001E-3,0.02,1,1,1]
[null,100,{"$f":"IF($C$121=1,G125,H125)","v":1},4.0000000000000001E-3,2.2499999999999999E-2,2,1,1]
[null,200,1,5.4999999999999997E-3,2.5000000000000001E-2,3,0.95,1]
[null,300,0.93333330000000003,7.0000000000000001E-3,2.75E-2,4,0.85,{"$f":"H126-0.0666667","v":0.93333330000000003}]
[null,400,0.86666660000000006,0.01,0.03,5,0.75,{"$f":"H127-0.0666667","v":0.86666660000000006}]
[null,500,0.8,1.4999999999999999E-2,3.2500000000000001E-2,6,0.6,0.8]
[null,600,0.60000000000000009,2.5000000000000001E-2,3.5000000000000003E-2,7,0.45,{"$f":"H129-0.2","v":0.60000000000000009}]
[null,700,0.40000000000000008,2.5000000000000001E-2,3.7499999999999999E-2,8,0.3,{"$f":"H130-0.2","v":0.40000000000000008}]
[null,800,0.20000000000000007,2.5000000000000001E-2,0.04,9,0.15,{"$f":"H131-0.2","v":0.20000000000000007}]
[null,900,0,2.5000000000000001E-2,4.2500000000000003E-2,10,0.08,0]
[null,1000,0,2.5000000000000001E-2,4.4999999999999998E-2,11,0.04,0]
[null,1100,2.0426489726352815E-3,2.5000000000000001E-2,4.7500000000000001E-2,12,0.01,{"$f":"0+(1-0)/(1+(B135/100000)+(B135/1080)^2+(B135/690)^8+(B135/1000)^64)","v":2.0426489726352815E-3}]
[null,1200,8.5522613031592085E-6,null,null,13,0,{"$f":"0+(1-0)/(1+(B136/100000)+(B136/1080)^2+(B136/690)^8+(B136/1000)^64)","v":8.5522613031592085E-6}]

{"sheet":"Makro","index":5,"n_rows":20,"n_cols":5,"rows_kept":20,"cut":false,"hidden":false,"merged":[]}
[2,"Brand ja/nej"]
[2,"Brand ja/nej"]
[2,"Tilslag"]
[2,"Bratkølet eller"]
[]
[]
[]
[]
[]
[]
[]
[]
[]
[]
[]
[]
[]
[]
[]
[{"$f":"IF(E20=1,0,1000000)","v":0},null,null,null,1]