{"text_format":"1","workbook":"xlsx","n_sheets":6,"sheets":["Kold","Kold2","Brand","Brand2","Firsidig","Makro"],"not_rendered":{"charts":5,"images":4,"macros":1,"external_links":0,"defined_names":5,"comments":4,"pivot_tables":0},"unopened":[],"bounds":{"document_bytes":16777216,"sheet_cells":100000,"rows_first":2000,"rows_last":500,"rows_between":2000,"halvings":0,"cell_chars":16384,"cell_head_chars":4096},"cells_cut":0,"cells_raw":0,"read":"whole","date_system":"1900"}

{"sheet":"Kold","index":0,"n_rows":141,"n_cols":90,"rows_kept":141,"cut":false,"hidden":false,"merged":[[34,2,34,15],[35,2,35,15],[36,2,36,15],[30,17,31,20],[33,17,33,20],[28,5,28,7],[28,2,28,4],[1,3,1,10],[2,11,5,15],[1,11,1,12],[1,13,1,15],[2,9,2,10],[3,9,3,10],[4,9,4,10],[2,3,2,7],[4,3,4,7],[3,3,3,7]]}
[]
[null,"Bruger:",null,{"$f":"Makro!D20","v":0},null,null,null,null,null,null,null,"Bjælkeberegning",null," Betonelement-Foreningen maj 2021"]
[null,"Sagsnavn:",null,null,null,null,null,null,"Sag nr.:",null,null,{"$f":"BF16","v":""}]
[null,"Bygningsdel:",null,null,null,null,null,null,"Dato:"]
[null,"Emne:",null,"Normale lastkombinationer",null,null,null,null,"Init:"]
[]
[null,null,null,null,null,null,null,null,null,null,null,"Spændvidde",null,"Tværsnit","h",400]
[null,null,null,null,null,null,null,null,null,null,null,"L",1.7,null,"b",150,null,null,null,null,null,null,null,null,null,null,null,null,null,null,null,null,null,null,null,null,null,null,null,null,null,null,null,null,null,null,null,null,null,"Anvendelsestilstand, tøjninger, spændinger og revnevidder",null,null,null,null,null,null,null,null,null,null,null,"BRUDLAST, MOMENTKAPACITET"]
[null,null,null,null,null,null,null,null,null,null,null,"Længdearmering                c' =",null,37,"beff",{"$f":"MIN(P8,2.0001*(P8-2*N9))","v":150},null,null,null,null,null,null,null,null,null,null,null,null,null,null,null,null,null,null,null,null,null,null,null,null,null,null,null,null,null,"A_1",{"$f":"P11*0.25*PI()*N11^2","v":157.07963267948966},"mm2",null,null,null,null,null,"e_0","s_o","s_2","s_3","s_m","w",null,null,"L","h","b","fck","fcd","Ecd","Ac","ac","Esc","fyd_c","At","at","Est","fyd_t","At","at","Est","fyd_t","Modenhed","1+f","uterm","   emax","e1","k","Tilstand:","Nf"]
[null,null,null,null,null,null,null,null,null,null,null,null,null,"d (mm)","c (mm)","antal",null,null,null,null,null,null,null,null,null,null,null,null,null,null,null,null,null,null,null,null,null,null,null,null,null,null,null,null,null,"A_2",{"$f":"P12*0.25*PI()*N12^2","v":0},"mm2",null,"Langtid",null,null,null,{"$f":"BK79","v":2.5065749295781503E-4},{"$f":"BR79","v":110.35306272069153},{"$f":"BV79","v":440.97648303545162},{"$f":"BT79","v":384.93474349430528},{"$f":"(BE10*AU11+BD10*AU10)/(AU10+AU11)","v":384.93474349430528},{"$f":"BT141","v":0.30454175465202726},null,null,"(m)","(m)","(m)","(Mpa)","(Mpa)","(Mpa)","(m2)","(m)","(Mpa)","(Mpa)","(m2)","(m)","(Mpa)","(Mpa)","(m2)","(m)","(Mpa)","(Mpa)","(døgn)",null,"(m)"]
[null,null,null,null,null,null,null,null,null,null,null,"Tryklag   t",null,10,36,2,null,null,null,null,null,null,null,null,null,null,null,null,null,null,null,null,null,null,null,null,null,null,null,null,null,null,null,null,null,"A_3",{"$f":"P13*0.25*PI()*N13^2","v":226.1946710584651},"mm2",null,"Korttid",null,null,null,{"$f":"BK102","v":3.4762683357029617E-5},{"$f":"BR102","v":3.3370231549138385},{"$f":"BV102","v":33.219835734061689},{"$f":"BT102","v":29.503891286555934},{"$f":"(BE11*AU11+BD11*AU10)/(AU10+AU11)","v":29.503891286555934},null,null,null,{"$f":"M8","v":1.7},{"$f":"P7/1000","v":0.4},{"$f":"P9/1000","v":0.15},{"$f":"M21","v":35},{"$f":"BM11/M18","v":25},{"$f":"22000*((BM11+8)/10)^0.3/M18","v":24340.818713706667},{"$f":"AU9/1000000","v":1.5707963267948965E-4},{"$f":"O11/1000","v":3.5999999999999997E-2},200000,{"$f":"P18/M19","v":416.66666666666669},{"$f":"AU11/1000000","v":2.261946710584651E-4},{"$f":"O13/1000","v":3.6999999999999998E-2},200000,{"$f":"P18/M19","v":416.66666666666669},{"$f":"AU10/1000000","v":0},{"$f":"O12/1000","v":0},200000,{"$f":"P19","v":416.66666666666669},null,1,0,{"$f":"0.0035","v":3.5000000000000001E-3},{"$f":"0.7*($M$21+8)^(0.31)/1000","v":2.246328469196467E-3},{"$f":"1.05*BO11*CF11/BN11","v":2.2964539096862753},1,{"$f":"0+0.000001","v":9.9999999999999995E-7}]
[null,null,null,null,null,null,null,null,null,null,null,"Træklag 1",null,0,0,0,null,null,null,null,null,null,null,null,null,null,null,null,null,null,null,null,null,null,null,null,null,null,null,null,null,null,null,null,null,"E_sk",200000,"Mpa",null,"Kar. last",null,null,null,{"$f":"BB11+BB10","v":2.8542017631484466E-4},{"$f":"BC11+BC10","v":113.69008587560536},{"$f":"BD11+BD10","v":474.19631876951331},{"$f":"BE11+BE10","v":414.43863478086121},{"$f":"BF11+BF10","v":414.43863478086121},{"$f":"BS141","v":0.30454175465202726},null,null,"hc","e0","a'","b'","N'","tN'","t'","Nc","sac","Nac","sat","Nat","sat","Nat","Mtot","N","N","A","B1","B2","B2'","B3","C1","C2","C2'"]
[null,null,null,null,null,null,null,null,null,null,null,"Træklag 2",null,12,37,2,null,null,null,null,null,null,null,null,null,null,null,null,null,null,null,null,null,null,null,null,null,null,null,null,null,null,null,null,null,"E_sd",{"$f":"AU12/M19","v":166666.66666666669},"MPa"]
[null,null,null,null,null,null,null,null,null,null,null,"Bøjler",null,"d (mm)","a (mm)","cotq",null,null,null,null,null,null,null,null,null,null,null,null,null,null,null,null,null,null,null,null,null,null,null,null,null,null,null,null,null,"d",{"$f":"P7-(AU10*O12+AU11*O13)/(AU10+AU11)","v":363},"mm",null,null,null,null,null,null,null,null,null,null,null,null,null,{"$f":"0.5*(-(CB14+CC14+CD14+CE14)+SQRT(MAX((CB14+CC14+CD14+CE14)^2+4*CA14*(CF14+CG14+CH14),0)))/CA14","v":7.8356667465973112E-2},{"$f":"0.025*$CE$11","v":8.7500000000000013E-5},{"$f":"IF($CH$11=1,BK14/($CG$11*$CF$11),2^(1/3)*$CF$11/BK14)","v":1.6961999978345084E-2},{"$f":"IF($CH$11=1,-($CG$11-2)*BK14/$CF$11,3*($CF$11/BK14)^2)","v":-1.1547606440133831E-2},{"$f":"IF(CH$11=1,0.5*(CG$11*BK14*BN$11/CF$11)*(1-CI13^2+(BL14-BM14)*(BM14^2*(1-CI13^2)+2*BM14*(1-CI13)+2*LN((1-BM14)/(1-BM14*CI13)))/(BM14^3)),BN$11*BM14*(LN((1-BL14+BL14^2)/(1+BL14)^2)/(6*BL14)+ATAN((2-BL14)/(BL14*3^0.5))/(BL14*3^0.5)-LN((CI13^2-BL14*CI13+BL14^2)/(CI13+BL14)^2)/(6*BL14)-ATAN((2*CI13-BL14)/(BL14*3^0.5))/(BL14*3^0.5)))","v":1.0970866021360473},{"$f":"IF(CH$11=1,(CG$11*BK14*BN$11/CF$11)*(1-CI13^3-(BL14-BM14)*(-2*BM14^3*(1-CI13^3)-3*BM14^2*(1-CI13^2)-6*BM14*(1-CI13)-6*LN((1-BM14)/(1-BM14*CI13)))/(2*BM14^4))/3,BN$11*BM14*(LN((1+BL14^3)/(BL14^3+CI13^3)))/3)","v":0.72964431803516983},{"$f":"BO14/BN14","v":0.66507449513515093},{"$f":"BN14*BJ14*BL$11","v":1.2894607509742291E-2},{"$f":"MAX(MIN(BS$11,CC$11*BR$11*BK14*(BJ14-BQ$11)/BJ14),-BS$11)","v":9.4598418312828159},{"$f":"BR14*BP$11","v":1.4859484800639755E-3},{"$f":"MIN(BW$11,CC$11*BV$11*BK14*(BK$11-BJ14-BU$11)/BJ14)","v":63.571594867898327},{"$f":"BT14*BT$11","v":1.437955598980627E-2},{"$f":"MIN($CA$11,CC$11*$BZ$11*BK14*(BK$11-BJ14-$BY$11)/BJ14)","v":71.83509076352432},{"$f":"BV14*$BX$11","v":0},{"$f":"(0.5*BK$11-BJ14+BP14*BJ14)*BQ14+(0.5*BK$11-BQ$11)*BS14+(0.5*BK$11-BU$11)*BU14+(0.5*BK$11-BY$11)*BW14","v":4.8280831589286389E-3},{"$f":"BQ14+BS14-BU14-BW14","v":9.9999999999579592E-7},{"$f":"$CI$11","v":9.9999999999999995E-7},{"$f":"BN14*BL$11","v":0.16456299032040708},{"$f":"IF(BR13<BS$11,CC$11*BK14*BP$11*BR$11,BP$11*BS$11)","v":2.7488935718910693E-3},{"$f":"IF(BT13<BW$11,CC$11*BK14*BT$11*BV$11,-BT$11*BW$11)","v":3.95840674352314E-3},{"$f":"IF(BV13<CA$11,CC$11*BK14*$BX$11*$BZ$11,-$BX$11*CA$11)","v":0},{"$f":"-BZ14","v":-9.9999999999999995E-7},{"$f":"IF(BR13<BS$11,BQ$11*CC$11*BK14*BP$11*BR$11,0)","v":9.8960168588078489E-5},{"$f":"IF(BT13<BW$11,(BK$11-BU$11)*CC$11*BK14*BT$11*BV$11,0)","v":1.4369016478988999E-3},{"$f":"IF(BV13<CA$11,(BK$11-$BY$11)*CC$11*BK14*$BX$11*$BZ$11,0)","v":0},{"$f":"IF(BX14>BX13,BK14,CI13)","v":8.7500000000000013E-5},{"$f":"IF(BX14>BX13,BR14,CJ13)","v":9.4598418312828159},{"$f":"IF(BX14>BX13,BT14,CK13)","v":63.571594867898327},{"$f":"IF(BX14>BX13,BV14,CL13)","v":71.83509076352432}]
[null,null,null,null,null,null,null,null,null,null,null,"Type 1",null,6,150,1.5,null,null,null,null,null,null,null,null,null,null,null,null,null,null,null,null,null,null,null,null,null,null,null,null,null,null,null,null,null,"c_w",{"$f":"(AU11*O13+AU10*O12)/(AU10+AU11)","v":37},null,null,null,null,null,null,null,null,null,null,null,null,null,null,{"$f":"0.5*(-(CB15+CC15+CD15+CE15)+SQRT(MAX((CB15+CC15+CD15+CE15)^2+4*CA15*(CF15+CG15+CH15),0)))/CA15","v":7.8949583837571419E-2},{"$f":"0.025*$CE$11+BK14","v":1.7500000000000003E-4},3.3923999956690168E-2,-2.3095212880267661E-2,2.1527499503302794,1.4282744933027924,{"$f":"BO15/BN15","v":0.66346511497243954},2.5493806902739214E-2,19.040447856035733,2.9908665552790693E-3,125.92548411830646,2.8483673458018301E-2,142.32835715515861,{"$f":"BV15*$BX$11","v":0},9.5547499429086153E-3,{"$f":"BQ15+BS15-BU15-BW15","v":9.9999999998365285E-7},{"$f":"$CI$11","v":9.9999999999999995E-7},0.32291249254954191,{"$f":"IF(2*BR14-BR13<BS$11,CC$11*BK15*BP$11*BR$11,BP$11*BS$11)","v":5.4977871437821386E-3},{"$f":"IF(2*BT14-BT13<BW$11,CC$11*BK15*BT$11*BV$11,-BT$11*BW$11)","v":7.91681348704628E-3},{"$f":"IF(2*BV14-BV13<CA$11,CC$11*BK15*$BX$11*$BZ$11,-$BX$11*CA$11)","v":0},{"$f":"-BZ15","v":-9.9999999999999995E-7},{"$f":"IF(2*BR14-BR13<BS$11,BQ$11*CC$11*BK15*BP$11*BR$11,0)","v":1.9792033717615698E-4},{"$f":"IF(2*BT14-BT13<BW$11,(BK$11-BU$11)*CC$11*BK15*BT$11*BV$11,0)","v":2.8738032957977997E-3},{"$f":"IF(2*BV14-BV13<CA$11,(BK$11-$BY$11)*CC$11*BK15*$BX$11*$BZ$11,0)","v":0},1.7500000000000003E-4,19.040447856035733,125.92548411830646,{"$f":"IF(BX15>BX14,BV15,CL14)","v":142.32835715515861}]
[null,null,null,null,null,null,null,null,null,null,null,"Type 2",null,6,150,{"$f":"P15","v":1.5},null,null,null,null,null,null,null,null,null,null,null,null,null,null,null,null,null,null,null,null,null,null,null,null,null,null,null,null,null,null,null,null,null,"Fejltabel",null,null,null,null,null,null,"Fejl",{"$f":"IF(BG46=1,BF46,BF17&BF18&BF19&BF20&BF21&BF22&BF23&BF24&BF25&BF26&BF27&BF28&BF29&BF30&BF31&BF32&BF33&BF34&BF35&BF36&BF37&BF38&BF39&BF40&BF41&BF42&BF43&BF44&BF45)","v":""},"NB'er",null,null,7.9547620812800396E-2,2.6250000000000004E-4,5.0885999935035259E-2,-3.4642819320401488E-2,3.1680355011116279,2.0967250263059412,{"$f":"BO16/BN16","v":0.6618376042724976},{"$f":"BN16*BJ16*BL$11","v":3.7801453014587684E-2},28.740647040245978,4.5145702800526996E-3,187.07347567751978,4.2315023294640361E-2,211.49281066393365,0,1.4181169309483242E-2,1.0000000000218168E-6,9.9999999999999995E-7,0.47520532516674419,{"$f":"IF(2*BR15-BR14<BS$11,CC$11*BK16*BP$11*BR$11,BP$11*BS$11)","v":8.2466807156732092E-3},{"$f":"IF(2*BT15-BT14<BW$11,CC$11*BK16*BT$11*BV$11,-BT$11*BW$11)","v":1.187522023056942E-2},{"$f":"IF(2*BV15-BV14<CA$11,CC$11*BK16*$BX$11*$BZ$11,-$BX$11*CA$11)","v":0},-9.9999999999999995E-7,{"$f":"IF(2*BR15-BR14<BS$11,BQ$11*CC$11*BK16*BP$11*BR$11,0)","v":2.9688050576423547E-4},{"$f":"IF(2*BT15-BT14<BW$11,(BK$11-BU$11)*CC$11*BK16*BT$11*BV$11,0)","v":4.3107049436966992E-3},{"$f":"IF(2*BV15-BV14<CA$11,(BK$11-$BY$11)*CC$11*BK16*$BX$11*$BZ$11,0)","v":0},2.6250000000000004E-4,28.740647040245978,187.07347567751978,211.49281066393365]
[null,null,null,null,null,null,null,null,null,null,null,"Partialkoefficienter",null,"Længdearmering",null,null,null,null,null,null,null,null,null,null,null,null,null,null,null,null,null,null,null,null,null,null,null,null,null,null,null,null,null,null,null,"h_int",{"$f":"P7-BJ56*(1-BP56)*1000-(AU10*O12+AU11*O13)/(AU10+AU11)","v":348.94740758247838},"mm",null,"Negative inddata accepteres ikke; ",null,null,null,null,null,null,{"$f":"IF(MIN(M8,P7:P9,N9,N11:P13,N15:P15,N16:O16,M18:M19,P18,P21,M21,P24,P25,C22:K28)<0,1,0)","v":0},{"$f":"IF(BE17=1,AX17,\"\")","v":""}," ",null,null,8.0150325743902864E-2,3.5000000000000005E-4,6.7847999913380336E-2,-4.6190425760535322E-2,4.1439515901301416,2.7357995658667913,0.66019100521897578,4.9820860472384258E-2,38.559079746576089,6.0568460830513213E-3,247.02927922202463,5.5876706555435585E-2,279.34355837137696,0,1.8708486948149777E-2,9.9999999999406119E-7,9.9999999999999995E-7,0.62159273851952124,1.0995574287564277E-2,1.583362697409256E-2,0,-9.9999999999999995E-7,3.9584067435231396E-4,5.7476065915955995E-3,0,3.5000000000000005E-4,38.559079746576089,247.02927922202463,279.34355837137696]
[null,null,null,null,null,null,null,null,null,null,null,"gc",1.4,null,"fyk",500,null,null,null,null,null,null,null,null,null,null,null,null,null,null,null,null,null,null,null,null,null,null,null,null,null,null,null,null,null,"Min arm",{"$f":"CEILING(MAX(0.26*0.3*M21^(2/3)*P9*AU14/P18,0.0013*P9*AU14),1)","v":91},"mm2",null,{"$f":"\"Bøjleafstand, a_1 skal være <  \"&CEILING(MIN(2*(N15^2*PI()/4)*P21/(0.063*P9*SQRT(M21)),0.75*AU14*MIN(1,P15)),1)&\" mm; \"","v":"Bøjleafstand, a_1 skal være <  273 mm; "},null,null,null,null,null,null,0,{"$f":"IF(BG18=1,AX18,\"\")","v":""},{"$f":"IF(O15>MIN(5*2*(N15^2*PI()/4)*P21/(P9*SQRT(10*M21)/10),0.75*AU14*MIN(1,P15)),1,0)","v":0},null,null,8.0757723544539917E-2,4.3750000000000006E-4,8.4809999891725427E-2,-5.773803220066915E-2,5.0814711295875377,3.346272361962503,0.65852432821636819,6.1555206102418693E-2,48.494442862635985,7.6174892718593595E-3,305.80603446842076,6.9171695374278072E-2,345.89507930404483,0,2.3137800328752855E-2,9.999999999871223E-7,9.9999999999999995E-7,0.7622206694381306,1.3744467859455347E-2,1.97920337176157E-2,0,-9.9999999999999995E-7,4.9480084294039239E-4,7.1845082394944989E-3,0,4.3750000000000006E-4,48.494442862635985,305.80603446842076,345.89507930404483]
[null,null,{"$f":"\"=\"&IF(AU23>M30,\" \"&TEXT(ROUNDUP(AU23,2),\"0,0\")&\" kNm > \",\" \"&TEXT(ROUNDUP(AU23,2),\"0,0\")&\" kNm < \")","v":"= 28,5 kNm < "},{"$f":"IF(AU23>M30,\"!\",\" \")","v":" "},null,null,null,null,null,null,null,"gs",1.2,null,"fyd",{"$f":"P18/M19","v":416.66666666666669},null,null,null,null,null,null,null,null,null,null,null,null,null,null,null,null,null,null,null,null,null,null,null,null,null,null,null,null,null,"Max arm",{"$f":"0.04*P7*P9","v":2400},"mm2",null,{"$f":"\"Bøjleafstand, a_2 skal være <  \"&CEILING(MIN(2*(N16^2*PI()/4)*P21/(0.063*P9*SQRT(M21)),0.75*AU14*MIN(1,P15)),1)&\" mm; \"","v":"Bøjleafstand, a_2 skal være <  273 mm; "},null,null,null,null,null,null,0,{"$f":"IF(BG19=1,AX19,\"\")","v":""},{"$f":"IF(O16>MIN(5*2*(N16^2*PI()/4)*P21/(P9*SQRT(10*M21)/10),0.75*AU14*MIN(1,P15)),1,0)","v":0},null,null,8.1369921632547623E-2,5.2500000000000008E-4,0.10177199987007052,-6.9285638640802977E-2,5.9815332110002553,3.9288896321122668,0.65683654901169775,7.3007533293235755E-2,58.54548801128481,9.1963037518540836E-3,363.41632921954505,8.2202837045089849E-2,411.16124431905786,0,2.7470160191447084E-2,9.999999999871223E-7,9.9999999999999995E-7,0.89722998165003831,1.6493361431346418E-2,2.375044046113884E-2,0,-9.9999999999999995E-7,5.9376101152847094E-4,8.6214098873933984E-3,0,5.2500000000000008E-4,58.54548801128481,363.41632921954505,411.16124431905786]
[null,null,null,null,null,null,null,null,null,null,null,"Beton",null,"Bøjlearmering",null,null,null,null,null,null,null,null,null,null,null,null,null,null,null,null,null,null,null,null,null,null,null,null,null,null,null,null,null,null,null,"Akt. arm",{"$f":"CEILING((N12^2*P12+N13^2*P13)*PI()/4,1)","v":227},"mm2",null,"20 MPa < f_ck < 50 MPa; ",null,null,null,null,null,null,{"$f":"IF(OR(M21<20,M21>50),1,0)","v":0},{"$f":"IF(BE20=1,AX20,\"\")","v":""}," ",null,null,8.1345745574552222E-2,6.1250000000000009E-4,0.11873399984841559,-8.0833245080936811E-2,6.8450446193417349,4.484370852885462,0.65512660651096077,8.3522288707714554E-2,68.28696195047722,1.0726490899979247E-2,416.66666666666669,9.4247779607693802E-2,416.66666666666669,0,3.148285743075608E-2,1.0000000000010001E-6,9.9999999999999995E-7,1.0267566929012601,1.9242255003237486E-2,-9.4247779607693802E-2,0,-9.9999999999999995E-7,6.9272118011654937E-4,0,0,6.1250000000000009E-4,68.28696195047722,416.66666666666669,416.66666666666669]
[null,"Lastparametre:","gk [kN/m]","qk [kN/m]","e [mm]","x1 [m]","x2 [m]","ϒg","ϒq","ψ1","ψ2","fck",35,null,"fyk ",500,null,null,null,null,null,null,null,null,null,null,null,null,null,null,null,null,null,null,null,null,null,null,null,null,null,null,null,null,null,"M_L",{"$f":"MAX(Kold2!P31:BG31)","v":28.452197647058824},"kNm","Langtid","x_2 skal være større end x_1; ",null,null,null,null,null,null,{"$f":"IF(OR(Kold2!D91>Kold2!D92,Kold2!E91>Kold2!E92,Kold2!F91>Kold2!F92),1,0)","v":0},""," ",null,null,7.2296301586509903E-2,7.000000000000001E-4,0.13569599982676067,-9.2380851521070645E-2,7.6728812644467776,5.0134099784116755,0.65339340016141212,8.3208140689788851E-2,70.286890347093006,1.1040638917904936E-2,416.66666666666669,9.4247779607693802E-2,416.66666666666669,0,3.1729620181307955E-2,9.999999999871223E-7,9.9999999999999995E-7,1.1509321896670166,2.1991148575128554E-2,-9.4247779607693802E-2,0,-9.9999999999999995E-7,7.9168134870462792E-4,0,0,7.000000000000001E-4,70.286890347093006,416.66666666666669,416.66666666666669]
[null,"p1",1.4,0,0,{"$f":"0","v":0},{"$f":"M8","v":1.7},1,0,0,0,"fcd",{"$f":"M21/M18","v":25},null,"fyd ",{"$f":"P21/M19","v":416.66666666666669},null,null,null,null,null,null,null,null,null,null,null,null,null,null,null,null,null,null,null,null,null,null,null,null,null,null,null,null,null,"M_k",{"$f":"MAX(Kold2!P32:BG32)","v":28.452197647058824},"kNm","Kar.","x_2 skal være mindre end L; ",null,null,null,null,null,null,{"$f":"IF(OR(Kold2!D92>M8,Kold2!E92>M8,Kold2!F92>M8),1,0)","v":0},""," ",null,null,6.545191849143546E-2,7.8750000000000011E-4,0.15265799980510578,-0.10392845796120447,8.4658895349523995,5.5166765918941536,0.65163578725164306,8.3116306769880119E-2,70.871523238972259,1.1132472837813677E-2,416.66666666666669,9.4247779607693802E-2,416.66666666666669,0,3.1916231249610745E-2,9.999999999871223E-7,9.9999999999999995E-7,1.2698834302428599,2.4740042147019626E-2,-9.4247779607693802E-2,0,-9.9999999999999995E-7,8.9064151729270635E-4,0,0,7.8750000000000011E-4,70.871523238972259,416.66666666666669,416.66666666666669]
[null,"p2",0,0,0,0,0,1,1.5,0.6,0.5,"Nedbøjninger",null,"Krybetal",null,null,null,null,null,null,null,null,null,null,null,null,null,null,null,null,null,null,null,null,null,null,null,null,null,null,null,null,null,null,null,"M_d",{"$f":"MAX(Kold2!P33:BG33)","v":28.452197647058824},"kNm",null,"x_1 skal være mindre end L; ",null,null,null,null,null,null,{"$f":"IF(OR(Kold2!H91>M8,Kold2!I91>M8,Kold2!J91>M8),1,0)","v":0},""," ",null,null,6.0138249944248122E-2,8.7500000000000013E-4,0.16961999978345085,-0.1154760644013383,9.2248875797446335,5.9948169940143581,0.64985258001163726,8.3215289246740931E-2,70.241381220097225,1.1033490360952875E-2,416.66666666666669,9.4247779607693802E-2,416.66666666666669,0,3.2062652940419413E-2,1.0000000000010001E-6,9.9999999999999995E-7,1.383733136961695,2.7488935718910694E-2,-9.4247779607693802E-2,0,-9.9999999999999995E-7,9.8960168588078479E-4,0,0,8.7500000000000013E-4,70.241381220097225,416.66666666666669,416.66666666666669]
[null,"p3",0,0,0,0,0,1,1.5,0.6,0.5,"uL ",{"$f":"IF(OR(BG28=1,BG29=1,BG30=1),\"\",BO141)","v":1.8221149659529097},null,"RH",0.5,null,null,null,null,null,null,null,null,null,null,null,null,null,null,null,null,null,null,null,null,null,null,null,null,null,null,null,null,null,"maks V_d",{"$f":"MAX(Kold2!P56:BD56)","v":109.6135294117647},"kN",null,{"$f":"\"Trækarmering, \"&AU20&\" mm^2 opfylder ikke minimumskrav: \"&AU18&\" mm^2; \"","v":"Trækarmering, 227 mm^2 opfylder ikke minimumskrav: 91 mm^2; "},null,null,null,null,null,null,0,{"$f":"IF(BG24=1,AX24,\"\")","v":""},{"$f":"IF(AU18>AU20,1,0)","v":0},null,null,5.5926070190191676E-2,9.6250000000000014E-4,0.18658199976179593,-0.12702367084147212,9.9506665214579773,6.4484552325593176,0.64804254254261617,8.3475251147737392E-2,68.586412357731092,1.0773528459956411E-2,416.66666666666669,9.4247779607693802E-2,416.66666666666669,0,3.218120373075832E-2,1.0000000000010001E-6,9.9999999999999995E-7,1.4925999782186965,3.0237829290801762E-2,-9.4247779607693802E-2,0,-9.9999999999999995E-7,1.0885618544688633E-3,0,0,9.6250000000000014E-4,68.586412357731092,416.66666666666669,416.66666666666669]
[null,null,"Gk [kN]","Qk [kN]","e [mm]","x1 [m]",null,null,null,null,null,"ukar",{"$f":"IF(OR(BG28=1,BG29=1,BG30=1),\"\",BM141)","v":1.8221149659529097},null,"to",28,null,null,null,null,null,null,null,null,null,null,null,null,null,null,null,null,null,null,null,null,null,null,null,null,null,null,null,null,null,null,null,null,null,"Grænse forskydningstrykbrud (V_ud_0) overskredet; ",null,null,null,null,null,null,0,{"$f":"IF(BG25=1,AX25,\"\")","v":""},{"$f":"IF(AU24>P30,1,0)","v":0},null,null,5.2529641808294614E-2,1.0500000000000002E-3,0.20354399974014104,-0.13857127728160595,10.643991606304676,6.8781940767287573,0.64620438752081022,8.3868759973451862E-2,66.081257367221411,1.0380019634241958E-2,416.66666666666669,9.4247779607693802E-2,416.66666666666669,0,3.2279782783797797E-2,1.0000000000148779E-6,9.9999999999999995E-7,1.5965987409457012,3.2986722862692837E-2,-9.4247779607693802E-2,0,-9.9999999999999995E-7,1.1875220230569419E-3,0,0,1.0500000000000002E-3,66.081257367221411,416.66666666666669,416.66666666666669]
[null,"P1",128,0,0,0.26,null,1,1.5,0.6,0.5,"Revnevidder",null,null,"fo",{"$f":"AU36","v":2.2889533583655259},null,null,null,null,null,null,null,null,null,null,null,null,null,null,null,null,null,null,null,null,null,null,null,null,null,null,null,null,null,"Beregning af slutkrybetal",null,null,null,"Grænser 1 < cot0 < 2 overholdes ikke; ",null,null,null,null,null,null,0,{"$f":"IF(BG26=1,AX26,\"\")","v":""},{"$f":"IF(OR(P15<1,P15>2),1,0)","v":0},null,null,4.9751822132903939E-2,1.1375000000000001E-3,0.22050599971848608,-0.15011888372173979,11.30560329414889,7.2846159398097532,0.64433677268508427,8.4371154629350256E-2,62.882913652453972,9.8776249783435344E-3,416.66666666666669,9.4247779607693802E-2,416.66666666666669,0,3.2363610892222609E-2,9.999999999871223E-7,9.9999999999999995E-7,1.6958404941223335,3.5735616434583894E-2,-9.4247779607693802E-2,0,-9.9999999999999995E-7,1.2864821916450202E-3,0,0,1.1375000000000001E-3,62.882913652453972,416.66666666666669,416.66666666666669]
[null,"P2",0,0,0,0,null,1,1.5,0.6,0.5,"wk,L",{"$f":"IF(OR(BG28=1,BG29=1,BG30=1),\"\",IF(BO136=0,\"urevnet\",BT141))","v":0.30454175465202726},"Svindtøjning",null,null,null,null,null,null,null,null,null,null,null,null,null,null,null,null,null,null,null,null,null,null,null,null,null,null,null,null,null,null,null,"to",{"$f":"P25","v":28},null,null,"Partialkoefficienter skal være større end 1; ",null,null,null,null,null,null,{"$f":"IF(MIN(M18:M19)<1,1,0)","v":0},""," ",null,null,4.7452568092381832E-2,1.225E-3,0.23746799969683116,-0.16166649016187359,11.936218292489684,7.6682837533684767,0.64243829707717315,8.4960631693485056E-2,59.130186108599958,9.2881479142087435E-3,416.66666666666669,9.4247779607693802E-2,416.66666666666669,0,3.2436224853750799E-2,1.0000000000010001E-6,9.9999999999999995E-7,1.7904327438734526,3.8484510006474966E-2,-9.4247779607693802E-2,0,-9.9999999999999995E-7,1.3854423602330985E-3,0,0,1.225E-3,59.130186108599958,416.66666666666669,416.66666666666669]
[null,"P3",0,0,0,0,null,1,1.5,0.6,0.5,"wk,kar",{"$f":"IF(OR(BG28=1,BG29=1,BG30=1),\"\",IF(BM136=0,\"urevnet\",BS141))","v":0.30454175465202726},null,"ecs",{"$f":"1000*BX140","v":0.51046461773118279},null,null,null,null,null,null,null,null,null,null,null,null,null,null,null,null,null,null,null,null,null,null,null,null,null,null,null,null,null,"RH",{"$f":"P24*100","v":50},null,null,"M_d > M_ud  !",null,null,null,null,null,null,null,{"$f":"IF(BG28=1,AX28,\"\")","v":""},{"$f":"IF(AU23>M30,1,0)","v":0},null,null,4.552995217327848E-2,1.3124999999999999E-3,0.25442999967517621,-0.1732140966020074,12.536530537769828,8.0297417958722299,0.64050749700488285,8.5618145370525811E-2,54.944324034537374,8.6306342371679865E-3,416.66666666666669,9.4247779607693802E-2,416.66666666666669,0,3.2500071061838144E-2,1.0000000000010001E-6,9.9999999999999995E-7,1.8804795806654742,4.123340357836603E-2,-9.4247779607693802E-2,0,-9.9999999999999995E-7,1.4844025288211771E-3,0,0,1.3124999999999999E-3,54.944324034537374,416.66666666666669,416.66666666666669]
[null,null,"Jævnt fordelte laste [kN/m]",null,null,"Punktlaste [kN]",null,null,"Kontrol:","Langtid","Brudstadie","Momentkapacitet",null,"Forskydningskapacitet",null,null,null,null,null,null,null,null,null,null,null,null,null,null,null,null,null,null,null,null,null,null,null,null,null,null,null,null,null,null,null,"h",{"$f":"P7","v":400},null,null,{"$f":"\"Armeringsspænding = \"&TEXT(MAX(BD10+BD11,BE10+BE11),0)&\" MPa > f_yk for kar. last ! \"","v":"Armeringsspænding = 474 MPa > f_yk for kar. last ! "},null,null,null,null,null,null,null,"",{"$f":"IF(BG28=1,0,IF(OR(BD10+BD11>P18,BE10+BE11>P18),1,0))","v":0},null,null,4.3908243202386836E-2,1.3999999999999998E-3,0.27139199965352129,-0.18476170304214123,13.107212127149969,8.3695164786741412,0.63854284171824172,8.632719866762624E-2,50.43035054857183,7.921580940067563E-3,416.66666666666669,9.4247779607693802E-2,416.66666666666669,0,3.2556872532520015E-2,1.0000000000010001E-6,9.9999999999999995E-7,1.9660818190724954,4.3982297150257095E-2,-9.4247779607693802E-2,0,-9.9999999999999995E-7,1.5833626974092552E-3,0,0,1.3999999999999998E-3,50.43035054857183,416.66666666666669,416.66666666666669]
[null,null,"p1","p2","p3","P1","P2","P3","M (kNm)",{"$f":"INDEX(AU21:AU22,MATCH(J29,AW21:AW22,0))","v":28.452197647058824},{"$f":"M30","v":32.982955321521075},"MRd",{"$f":"BX56*1000","v":32.982955321521075},"v/ trykbrud i krop:","VRd,0",{"$f":"BL110","v":317.07240400523267},null,null,null,null,null,null,null,null,null,null,null,null,null,null,null,null,null,null,null,null,null,null,null,null,null,null,null,null,null,"b",{"$f":"P9","v":150},null,null,{"$f":"\"Betonkanttøjning = \"&TEXT(1000*(BB10+BB11),\"0,00\")&\" 0/00 > 0,6*e_1 for kar. last ! \"","v":"Betonkanttøjning = 0,29 0/00 > 0,6*e_1 for kar. last ! "},null,null,null,null,null,null,null,"",{"$f":"IF(BG28=1,0,IF(BB10+BB11>0.6*CF63,IF(BG28=0,1,0),0))","v":0},null,null,4.2530163287263979E-2,1.4874999999999997E-3,0.28835399963186636,-0.19630930948227504,13.648914203721615,8.6881170917761708,0.6365427287547315,8.707358246672052E-2,45.678723705789288,7.1751971409732777E-3,416.66666666666669,9.4247779607693802E-2,416.66666666666669,0,3.2607862423140919E-2,1.0000000000010001E-6,9.9999999999999995E-7,2.0473371305582422,4.673119072214816E-2,-9.4247779607693802E-2,0,-9.9999999999999995E-7,1.6823228659973339E-3,0,0,1.4874999999999997E-3,45.678723705789288,416.66666666666669,416.66666666666669]
[null,"Langtidsværdi",{"$f":"Kold2!D87","v":1.4},{"$f":"Kold2!E87","v":0},{"$f":"Kold2!F87","v":0},{"$f":"Kold2!H87","v":128},{"$f":"Kold2!I87","v":0},{"$f":"Kold2!J87","v":0},"x (mm)",{"$f":"IF(OR(BG28=1,BG29=1,BG30=1),\"-\",IF(IF(J29=\"langtid\",BO136,BM136)=0,\"urevnet\",IF(J29=\"langtid\",BJ79,BJ102)*1000))","v":108.85754072047959},{"$f":"BJ56*1000","v":34.44617743885771},"EIL,revnet",{"$f":"IF(OR(BG28=1,BG29=1,BG30=1),\"\",CK63)","v":3756.9544470269357},"v/ type 1 bøjler:","VRd,1",{"$f":"BL111","v":82.218795911273816},null," NB:  Resultaterne skal altid kontrolleres af ansvarlig statiker",null,null,null,null,null,null,null,null,null,null,null,null,null,null,null,null,null,null,null,null,null,null,null,null,null,null,null,"ho",{"$f":"2*AU29*AU30/(2*(AU29+AU30))","v":109.09090909090909},null,null,null,null,null,null,null,null,null,null,null,null,null,null,4.1351710736871314E-2,1.5749999999999996E-3,0.30531599961021139,-0.20785691592240887,14.162267797880213,8.9860365119165273,0.63450547893618725,8.7845100203407508E-2,40.767089246717141,6.4036794042863013E-3,416.66666666666669,9.4247779607693802E-2,416.66666666666669,0,3.2653936180694197E-2,1.0000000000148779E-6,9.9999999999999995E-7,2.1243401696820321,4.9480084294039231E-2,-9.4247779607693802E-2,0,-9.9999999999999995E-7,1.781283034585412E-3,0,0,1.5749999999999996E-3,40.767089246717141,416.66666666666669,416.66666666666669]
[null,"Kar. værdi",{"$f":"Kold2!D88","v":1.4},{"$f":"Kold2!E88","v":0},{"$f":"Kold2!F88","v":0},{"$f":"Kold2!H88","v":128},{"$f":"Kold2!I88","v":0},{"$f":"Kold2!J88","v":0},"e0 (o/oo)",{"$f":"IF(OR(BG28=1,BG29=1,BG30=1),\"-\",IF(IF(J29=\"langtid\",BO136,BM136)=0,\"urevnet\",1000*IF(J29=\"langtid\",BB10,BB12)))","v":0.25065749295781503},{"$f":"1000*BK56","v":3.0624999999999978},"EIkort,revnet",{"$f":"IF(OR(BG28=1,BG29=1,BG30=1),\"\",CK86)","v":4504.4822103198303},"v/ type 2 bøjler:","VRd,2",{"$f":"BL112","v":82.218795911273816},null,null,null,null,null,null,null,null,null,null,null,null,null,null,null,null,null,null,null,null,null,null,null,null,null,null,null,null,null,"fck",{"$f":"M21","v":35},null,null,"Kar. last mindre end langtidslast ! ",null,null,null,null,null,null,null,"",{"$f":"IF(OR(Kold2!D88<Kold2!D87,Kold2!E88<Kold2!E87,Kold2!F88<Kold2!F87,Kold2!H88<Kold2!H87,Kold2!I88<Kold2!I87,Kold2!J88<Kold2!J87),1,0)","v":0},null,null,4.0338612388118547E-2,1.6624999999999995E-3,0.32227799958855646,-0.21940452236254268,14.647884627433765,9.2637518751259247,0.63242933097493181,8.8631301043789634E-2,35.761979246324337,5.617478563904159E-3,416.66666666666669,9.4247779607693802E-2,416.66666666666669,0,3.2695752699781803E-2,9.999999999871223E-7,9.9999999999999995E-7,2.1971826941150647,5.2228977865930296E-2,-9.4247779607693802E-2,0,-9.9999999999999995E-7,1.8802432031734904E-3,0,0,1.6624999999999995E-3,35.761979246324337,416.66666666666669,416.66666666666669]
[null,"Regnm. værdi",{"$f":"Kold2!D89","v":1.4},{"$f":"Kold2!E89","v":0},{"$f":"Kold2!F89","v":0},{"$f":"Kold2!H89","v":128},{"$f":"Kold2!I89","v":0},{"$f":"Kold2!J89","v":0},"sst (MPa)",{"$f":"IF(OR(BG28=1,BG29=1,BG30=1),\"-\",IF(IF(J29=\"langtid\",BO136,BM136)=0,\"urevnet\",IF(J29=\"langtid\",BT79,BT102)))","v":384.93474349430528},{"$f":"BT56","v":416.66666666666669},"Forskydningskraftens største excentricitet, exc.:",null,null,null,{"$f":"MAX(Kold2!P61:BD61)","v":0},null,"Vejledning:",null,null,"Betonelementbyggeriers statik",null,null,null,null,null,null,null,null,null,null,null,null,null,null,null,null,null,null,null,null,null,null,null,null,"fcm",{"$f":"AU32+8","v":43},null,null,"Regnm. last mindre end kar. last ! ",null,null,null,null,null,null,null,"",{"$f":"IF(OR(Kold2!D89<Kold2!D88,Kold2!E89<Kold2!E88,Kold2!F89<Kold2!F88,Kold2!H89<Kold2!H88,Kold2!I89<Kold2!I88,Kold2!J89<Kold2!J88),1,0)","v":0},null,null,3.9463840230171666E-2,1.7499999999999994E-3,0.33923999956690154,-0.23095212880267652,15.10635785882639,9.521725215887157,0.63031243565594297,8.9423233950078423E-2,30.720377781004668,4.8255456576153689E-3,416.66666666666669,9.4247779607693802E-2,416.66666666666669,0,3.2733802773953165E-2,9.999999999871223E-7,9.9999999999999995E-7,2.2659536788239585,5.4977871437821367E-2,-9.4247779607693802E-2,0,-9.9999999999999995E-7,1.9792033717615687E-3,0,0,1.7499999999999994E-3,30.720377781004668,416.66666666666669,416.66666666666669]
[null,null,null,null,null,null,null,null,"z (mm)","-",{"$f":"AU17","v":348.94740758247838},"Forankringskrav til hovedarmering over lejer, Na :",null,null,null,{"$f":"CF112","v":82.210147058823523},null,"Polyteknisk Forlag 2010 eller www.bef.dk",null,null,null,null,null,null,null,null,null,null,null,null,null,null,null,null,null,null,null,null,null,null,null,null,null,null,null,"a1",{"$f":"IF(AU33<35,1,(35/AU33)^0.7)","v":0.86580424765236474},null,null,"Forskydningsarmering bør vurderes nærmere !",null,null,null,null,null,null,null,"",{"$f":"IF(Kold2!I81=1,1,0)","v":0},null,null,3.8705840373800482E-2,1.8374999999999993E-3,0.35620199954524662,-0.24249973524281029,15.538262831703683,9.7604040748429046,0.62815284955330697,9.0213228127511966E-2,25.691118646910265,4.0355514801818518E-3,416.66666666666669,9.4247779607693802E-2,416.66666666666669,0,3.2768456144744038E-2,1.0000000000148779E-6,9.9999999999999995E-7,2.3307394247555524,5.7726765009712425E-2,-9.4247779607693802E-2,0,-9.9999999999999995E-7,2.0781635403496475E-3,0,0,1.8374999999999993E-3,25.691118646910265,416.66666666666669,416.66666666666669]
[null,"Note:",null,null,null,null,null,null,null,null,null,null,null,null,null,null,null,null,null,null,null,null,null,null,null,null,null,null,null,null,null,null,null,null,null,null,null,null,null,null,null,null,null,null,null,"a2",{"$f":"IF(AU33<35,1,(35/AU33)^0.2)","v":0.95966557859456925},null,null,"b - 2*c' skal mindst være 3*maks(d) !",null,null,null,null,null,null,{"$f":"IF(P8-2*N9<3*MAX(N11:N13),1,0)","v":0},{"$f":"IF(BE35=1,AX35,\"\")","v":""},null,null,null,3.8047249051816973E-2,1.9249999999999992E-3,0.37316399952359169,-0.25404734168294413,15.944157748906061,9.9802220768523107,0.62594852823361335,9.0994701119112967E-2,20.716107066665693,3.2540784885808269E-3,416.66666666666669,9.4247779607693802E-2,416.66666666666669,0,3.2799994298804522E-2,9.999999999871223E-7,9.9999999999999995E-7,2.3916236623359093,6.0475658581603489E-2,-9.4247779607693802E-2,0,-9.9999999999999995E-7,2.1771237089377254E-3,0,0,1.9249999999999992E-3,20.716107066665693,416.66666666666669,416.66666666666669]
[null,null,null,null,null,null,null,null,null,null,null,null,null,null,null,null,null,null,null,null,null,null,null,null,null,null,null,null,null,null,null,null,null,null,null,null,null,null,null,null,null,null,null,null,null,"f",{"$f":"(1/(0.1+AU27^0.2))*(16.8/AU33^0.5)*(1+10*AU34*(1-AU28/100)/AU31^(1/3))*AU35","v":2.2889533583655259},null,null,{"$f":"\"Trækarmering, \"&AU20&\" mm^2 overstiger maksimumværdi: \"&AU19&\" mm^2; \"","v":"Trækarmering, 227 mm^2 overstiger maksimumværdi: 2400 mm^2; "},null,null,null,null,null,null,0,{"$f":"IF(BG36=1,AX36,\"\")","v":""},{"$f":"IF(AU20>AU19,1,0)","v":0},null,null,3.747394790048978E-2,2.0124999999999991E-3,0.39012599950193672,-0.26559494812307793,16.324584333836714,10.181599481087721,0.62369731889490465,9.1761993423502303E-2,15.831372545068398,2.486786184191501E-3,416.66666666666669,9.4247779607693802E-2,416.66666666666669,0,3.2828633625780271E-2,1.0000000000010001E-6,9.9999999999999995E-7,2.4486876500755073,6.3224552153494554E-2,-9.4247779607693802E-2,0,-9.9999999999999995E-7,2.2760838775258037E-3,0,0,2.0124999999999991E-3,15.831372545068398,416.66666666666669,416.66666666666669]
[null,null,null,null,null,null,null,null,null,null,null,null,null,null,null,null,null,null,null,null,null,null,null,null,null,null,null,null,null,null,null,null,null,null,null,null,null,null,null,null,null,null,null,null,null,null,null,null,null,"Træklag 1 skal ligge højere end træklag 2",null,null,null,null,null,null,{"$f":"IF(AND(O12<O13,AU10>0),1,0)","v":0},{"$f":"IF(BE37=1,AX37,\"\")","v":""}," ",null,null,3.6974359565589351E-2,2.099999999999999E-3,0.40708799948028179,-0.2771425545632118,16.68006845701418,10.364943704797273,0.62139695238712789,9.2510227306243115E-2,11.067967703986534,1.7385523014506593E-3,416.66666666666669,9.4247779607693802E-2,416.66666666666669,0,3.2854541964324482E-2,9.9999999997324451E-7,9.9999999999999995E-7,2.502010268552127,6.5973445725385632E-2,-9.4247779607693802E-2,0,-9.9999999999999995E-7,2.375044046113882E-3,0,0,2.099999999999999E-3,11.067967703986534,416.66666666666669,416.66666666666669]
[null,null,null,null,null,null,null,null,null,null,null,null,null,null,null,null,null,null,null,null,null,null,null,null,null,null,null,null,null,null,null,null,null,null,null,null,null,null,null,null,null,null,null,null,null,null,null,null,null,null,null,null,null,null,null,null,null,""," ",null,null,3.6538916103951574E-2,2.1874999999999989E-3,0.42404999945862687,-0.28869016100334555,17.011120733525281,10.53064982216185,0.61904503454661819,9.3235186997470715E-2,6.4527309679368496,1.013592610223088E-3,416.66666666666669,9.4247779607693802E-2,416.66666666666669,0,3.2877850553967997E-2,1.0000000000010001E-6,9.9999999999999995E-7,2.5516681100287921,6.8722339297276697E-2,-9.4247779607693802E-2,0,-9.9999999999999995E-7,2.4740042147019603E-3,0,0,2.1874999999999989E-3,6.4527309679368496,416.66666666666669,416.66666666666669]
[null,null,null,null,null,null,null,null,null,null,null,null,null,null,null,null,null,null,null,null,null,null,null,null,null,null,null,null,null,null,null,null,null,null,null,null,null,null,null,null,null,null,null,null,null,null,null,null,null,"Relativ fugtighed < 100%",null,null,null,null,null,null,0,{"$f":"IF(BG39=1,AX39,\"\")","v":""},{"$f":"IF(P24>1,1,0)","v":0},null,null,3.6159653320507017E-2,2.2749999999999988E-3,0.44101199943697195,-0.30023776744347941,17.318237092964466,10.679101039675665,0.61663903677667342,9.3933217410591047E-2,2.0089313408736857,3.155621971027532E-4,416.66666666666669,9.4247779607693802E-2,416.66666666666669,0,3.2898662756559963E-2,1.0000000000010001E-6,9.9999999999999995E-7,2.5977355639446698,7.1471232869167747E-2,-9.4247779607693802E-2,0,-9.9999999999999995E-7,2.5729643832900391E-3,0,0,2.2749999999999988E-3,2.0089313408736857,416.66666666666669,416.66666666666669]
[null,null,null,null,null,null,null,null,null,null,null,null,null,null,null,null,null,null,null,null,null,null,null,null,null,null,null,null,null,null,null,null,null,null,null,null,null,null,null,null,null,null,null,null,null,null,null,null,null,null,null,null,null,null,null,null,null,""," ",null,null,3.5829898029788608E-2,2.3624999999999987E-3,0.45797399941531697,-0.31178537388361321,17.601899323356175,10.81066914932409,0.6141762857931633,9.4601138682968516E-2,-2.2431875429302077,-3.5235907527468395E-4,416.66666666666669,9.4247779607693802E-2,416.66666666666669,0,3.2917060480793681E-2,1.0000000000287557E-6,9.9999999999999995E-7,2.6402848985034262,7.4220126441058826E-2,-9.4247779607693802E-2,0,-9.9999999999999995E-7,2.6719245518781174E-3,0,0,2.3624999999999987E-3,-2.2431875429302077,416.66666666666669,416.66666666666669]
[null,null,null,null,null,null,null,null,null,null,null,null,null,null,null,null,null,null,null,null,null,null,null,null,null,null,null,null,null,null,null,null,null,null,null,null,null,null,null,null,null,null,null,null,null,null,null,null,null,null,null,null,null,null,null,null,null,""," ",null,null,3.5544024666805882E-2,2.4499999999999986E-3,0.47493599939366204,-0.32333298032374702,17.862575590461141,10.925714960791021,0.61165395244712084,9.5236174110005317E-2,-6.2859486329856447,-9.8739450231152522E-4,416.66666666666669,9.4247779607693802E-2,416.66666666666669,0,3.2933108956456549E-2,9.999999999871223E-7,9.9999999999999995E-7,2.679386338569171,7.696902001294989E-2,-9.4247779607693802E-2,0,-9.9999999999999995E-7,2.7708847204661958E-3,0,0,2.4499999999999986E-3,-6.2859486329856447,416.66666666666669,416.66666666666669]
[null,null,null,null,null,null,null,null,null,null,null,null,null,null,null,null,null,null,null,null,null,null,null,null,null,null,null,null,null,null,null,null,null,null,null,null,null,null,null,null,null,null,null,null,null,null,null,null,null,null,null,null,null,null,null,null,null,""," ",null,null,3.5297264199066924E-2,2.5374999999999985E-3,0.49189799937200712,-0.33488058676388083,18.100720933783158,11.024588713815616,0.60906903952313529,9.5835889348998823E-2,-10.103854422319845,-1.5871097413050384E-3,416.66666666666669,9.4247779607693802E-2,416.66666666666669,0,3.2946860311274501E-2,9.999999999871223E-7,9.9999999999999995E-7,2.7151081400674735,7.9717913584840955E-2,-9.4247779607693802E-2,0,-9.9999999999999995E-7,2.8698448890542741E-3,0,0,2.5374999999999985E-3,-10.103854422319845,416.66666666666669,416.66666666666669]
[null,null,null,null,null,null,null,null,null,null,null,null,null,null,null,null,null,null,null,null,null,null,null,null,null,null,null,null,null,null,null,null,null,null,null,null,null,null,null,null,null,null,null,null,null,null,null,null,null,null,null,null,null,null,null,null,null,""," ",null,null,3.508555286880418E-2,2.6249999999999984E-3,0.5088599993503522,-0.34642819320401463,18.316777740505842,11.107630471786869,0.60641836840239549,9.639814107009799E-2,-13.683260049314031,-2.1493614624041833E-3,416.66666666666669,9.4247779607693802E-2,416.66666666666669,0,3.295835627081279E-2,1.0000000000010001E-6,9.9999999999999995E-7,2.7475166610758763,8.2466807156732019E-2,-9.4247779607693802E-2,0,-9.9999999999999995E-7,2.9688050576423528E-3,0,0,2.6249999999999984E-3,-13.683260049314031,416.66666666666669,416.66666666666669]
[null,null,null,null,null,null,null,null,null,null,null,null,null,null,null,null,null,null,null,null,null,null,null,null,null,null,null,null,null,null,null,null,null,null,null,null,null,null,null,null,null,null,null,null,null,null,null,null,null,null,null,null,null,null,null,null,null,""," ",null,null,3.4905411545191577E-2,2.7124999999999983E-3,0.52582199932869722,-0.3579757996441485,18.51117619851696,11.175170497576728,0.60369856446356107,9.6921033509218407E-2,-17.012096704969782,-2.6722539015246096E-3,416.66666666666669,9.4247779607693802E-2,416.66666666666669,0,3.2967630210399203E-2,1.0000000000010001E-6,9.9999999999999995E-7,2.7766764297775439,8.5215700728623084E-2,-9.4247779607693802E-2,0,-9.9999999999999995E-7,3.0677652262304307E-3,0,0,2.7124999999999983E-3,-17.012096704969782,416.66666666666669,416.66666666666669]
[null,null,null,null,null,null,null,null,null,null,null,null,null,null,null,null,null,null,null,null,null,null,null,null,null,null,null,null,null,null,null,null,null,null,null,null,null,null,null,null,null,null,null,null,null,null,null,null,null,null,null,null,null,null,null,null,null,""," ",null,null,3.4753848801964957E-2,2.7999999999999982E-3,0.54278399930704235,-0.36952340608428225,18.684334729616186,11.227529612531255,0.60090604107700496,9.7402881623757556E-2,-20.079637074906266,-3.1541020160637382E-3,416.66666666666669,9.4247779607693802E-2,416.66666666666669,0,3.297470872415971E-2,1.0000000000148779E-6,9.9999999999999995E-7,2.8026502094424277,8.7964594300514148E-2,-9.4247779607693802E-2,0,-9.9999999999999995E-7,3.1667253948185091E-3,0,0,2.7999999999999982E-3,-20.079637074906266,416.66666666666669,416.66666666666669]
[null,null,null,null,null,null,null,null,null,null,null,null,null,null,null,null,null,null,null,null,null,null,null,null,null,null,null,null,null,null,null,null,null,null,null,null,null,null,null,null,null,null,null,null,null,null,null,null,null,"For ny bruger: Klik på knappen 'angiv nyt brugernavn' for ibrugtagning.",null,null,null,null,null,null,null,{"$f":"IF(BG46=1,AX46,\"\")","v":""},{"$f":"Makro!E20","v":0},null,null,3.4628282532190045E-2,2.8874999999999981E-3,0.55974599928538737,-0.38107101252441611,18.83666040392098,11.2650195395314,0.59803698203246836,9.7842179764483908E-2,-22.876295898413609,-3.5934001567901257E-3,416.66666666666669,9.4247779607693802E-2,416.66666666666669,0,3.2979612831238375E-2,9.999999999871223E-7,9.9999999999999995E-7,2.8254990605881471,9.0713487872405213E-2,-9.4247779607693802E-2,0,-9.9999999999999995E-7,3.2656855634065878E-3,0,0,2.8874999999999981E-3,-22.876295898413609,416.66666666666669,416.66666666666669]
[null,null,null,null,null,null,null,null,null,null,null,null,null,null,null,null,null,null,null,null,null,null,null,null,null,null,null,null,null,null,null,null,null,null,null,null,null,null,null,null,null,null,null,null,null,null,null,null,null,null,null,null,null,null,null,null,null,null,null,null,null,3.4526476156330518E-2,2.974999999999998E-3,0.5767079992637324,-0.39261861896454991,18.96854933643592,11.287943230942195,0.59508732221602423,9.8237574957695084E-2,-25.393459877387045,-3.9887953500013151E-3,416.66666666666669,9.4247779607693802E-2,416.66666666666669,0,3.298235890722831E-2,9.9999999997324451E-7,9.9999999999999995E-7,2.8452824004653881,9.3462381444296291E-2,-9.4247779607693802E-2,0,-9.9999999999999995E-7,3.3646457319946657E-3,0,0,2.974999999999998E-3,-25.393459877387045,416.66666666666669,416.66666666666669]
[null,null,null,null,null,null,null,null,null,null,null,null,null,null,null,null,null,null,null,null,null,null,null,null,null,null,null,null,null,null,null,null,null,null,null,null,null,null,null,null,null,null,null,null,null,null,null,null,null,null,null,null,null,null,null,null,null,null,null,null,null,3.4446486401289653E-2,3.0624999999999979E-3,0.59366999924207753,-0.40416622540468372,19.080387066694112,11.296595182225785,0.59205272632779171,9.8587844043633244E-2,-27.623342134960414,-4.3390644359394513E-3,416.66666666666669,9.4247779607693802E-2,416.66666666666669,0,3.2982959405844434E-2,9.999999999871223E-7,9.9999999999999995E-7,2.8620580600041166,9.6211275016187342E-2,-9.4247779607693802E-2,0,-9.9999999999999995E-7,3.4636059005827445E-3,0,0,3.0624999999999979E-3,-27.623342134960414,416.66666666666669,416.66666666666669]
[null,null,null,null,null,null,null,null,null,null,null,null,null,null,null,null,null,null,null,null,null,null,null,null,null,null,null,null,null,null,null,null,null,null,null,null,null,null,null,null,null,null,null,null,null,null,null,null,null,null,null,null,null,null,null,null,null,null,null,null,null,3.4386620316555705E-2,3.1499999999999979E-3,0.61063199922042255,-0.41571383184481753,19.172548922319052,11.291261731966271,0.58892856540436023,9.8891874043856173E-2,-29.558857230308721,-4.6430944361623705E-3,416.66666666666669,9.4247779607693802E-2,416.66666666666669,0,3.2981423419225206E-2,1.0000000000010001E-6,9.9999999999999995E-7,2.8758823383478576,9.8960168588078407E-2,-9.4247779607693802E-2,0,-9.9999999999999995E-7,3.5625660691708224E-3,0,0,3.0624999999999979E-3,-27.623342134960414,416.66666666666669,416.66666666666669]
[null,null,null,null,null,null,null,null,null,null,null,null,null,null,null,null,null,null,null,null,null,null,null,null,null,null,null,null,null,null,null,null,null,null,null,null,null,null,null,null,null,null,null,null,null,null,null,null,null,null,null,null,null,null,null,null,null,null,null,null,null,3.4345380435728858E-2,3.2374999999999978E-3,0.62759399919876768,-0.42726143828495139,19.245422783160663,11.272221418619763,0.58570921229554473,9.9148705070114501E-2,-31.193894325044074,-4.89992546242074E-3,416.66666666666669,9.4247779607693802E-2,416.66666666666669,0,3.2977756896799382E-2,9.9999999995936673E-7,9.9999999999999995E-7,2.8868134174740994,0.10170906215996948,-9.4247779607693802E-2,0,-9.9999999999999995E-7,3.6615262377589007E-3,0,0,3.0624999999999979E-3,-27.623342134960414,416.66666666666669,416.66666666666669]
[null,null,null,null,null,null,null,null,null,null,null,null,null,null,null,null,null,null,null,null,null,null,null,null,null,null,null,null,null,null,null,null,null,null,null,null,null,null,null,null,null,null,null,null,null,null,null,null,null,null,null,null,null,null,null,null,null,null,null,null,null,3.4321492113463144E-2,3.3249999999999977E-3,0.6445559991771127,-0.43880904472508514,19.299344021309043,11.239745054309692,0.582390004649874,9.9357342543355556E-2,-32.522121732264573,-5.1085629356617665E-3,416.66666666666669,9.4247779607693802E-2,416.66666666666669,0,3.2971963655230224E-2,9.999999999871223E-7,9.9999999999999995E-7,2.8949016031963564,0.10445795573186055,-9.4247779607693802E-2,0,-9.9999999999999995E-7,3.7604864063469795E-3,0,0,3.0624999999999979E-3,-27.623342134960414,416.66666666666669,416.66666666666669]
[null,null,null,null,null,null,null,null,null,null,null,null,null,null,null,null,null,null,null,null,null,null,null,null,null,null,null,null,null,null,null,null,null,null,null,null,null,null,null,null,null,null,null,null,null,null,null,null,null,null,null,null,null,null,null,null,null,null,null,null,null,3.4313822796958236E-2,3.4124999999999976E-3,0.66151799915545773,-0.450356651165219,19.334659411243358,11.194096181734045,0.57896526355279532,9.951691153154181E-2,-33.537969461625117,-5.2681319238480151E-3,416.66666666666669,9.4247779607693802E-2,416.66666666666669,0,3.2964044942577563E-2,9.999999999871223E-7,9.9999999999999995E-7,2.9001989116865037,0.10720684930375161,-9.4247779607693802E-2,0,-9.9999999999999995E-7,3.8594465749350573E-3,0,0,3.0624999999999979E-3,-27.623342134960414,416.66666666666669,416.66666666666669]
[null,null,null,null,null,null,null,null,null,null,null,null,null,null,null,null,null,null,null,null,null,null,null,null,null,null,null,null,null,null,null,null,null,null,null,null,null,null,null,null,null,null,null,null,null,null,null,null,null,null,null,null,null,null,null,null,null,null,null,null,null,3.4321379758367632E-2,3.4999999999999975E-3,0.67847999913380286,-0.46190425760535281,19.351706824338518,11.135531264102871,0.57542889447342105,9.9626591833607517E-2,-34.236215950967967,-5.3778122259137331E-3,416.66666666666669,9.4247779607693802E-2,416.66666666666669,0,3.2953999876823917E-2,9.999999999871223E-7,9.9999999999999995E-7,2.9027560236507775,0.10995574287564269,-9.4247779607693802E-2,0,-9.9999999999999995E-7,3.9584067435231357E-3,0,0,3.0624999999999979E-3,-27.623342134960414,416.66666666666669,416.66666666666669]
[null,null,null,null,null,null,null,null,null,null,null,null,null,null,null,null,null,null,null,null,null,null,null,null,null,null,null,null,null,null,null,null,null,null,null,null,null,null,null,null,null,null,null,null,null,null,null,null,null,null,null,null,null,null,null,null,null,null,null,null,null,null,null,null,null,null,null,null,null,{"$f":"CJ53","v":-27.623342134960414},-4.3390644359394513E-3,{"$f":"CK53","v":416.66666666666669},9.4247779607693802E-2,{"$f":"CL53","v":416.66666666666669},0]
[null,null,null,null,null,null,null,null,null,null,null,null,null,null,null,null,null,null,null,null,null,null,null,null,null,null,null,null,null,null,null,null,null,null,null,null,null,null,null,null,null,null,null,null,null,null,null,null,null,null,null,null,null,null,null,null,null,null,null,null,null,3.4446177438857709E-2,{"$f":"CI53","v":3.0624999999999979E-3},{"$f":"IF($CH$11=1,BK55/($CG$11*$CF$11),2^(1/3)*$CF$11/BK55)","v":0.59366999924207753},{"$f":"IF($CH$11=1,-($CG$11-2)*BK55/$CF$11,3*($CF$11/BK55)^2)","v":-0.40416622540468372},{"$f":"IF(CH$11=1,0.5*(CG$11*BK55*BN$11/CF$11)*(1-CI54^2+(BL55-BM55)*(BM55^2*(1-CI54^2)+2*BM55*(1-CI54)+2*LN((1-BM55)/(1-BM55*CI54)))/(BM55^3)),BN$11*BM55*(LN((1-BL55+BL55^2)/(1+BL55)^2)/(6*BL55)+ATAN((2-BL55)/(BL55*3^0.5))/(BL55*3^0.5)-LN((CI54^2-BL55*CI54+BL55^2)/(CI54+BL55)^2)/(6*BL55)-ATAN((2*CI54-BL55)/(BL55*3^0.5))/(BL55*3^0.5)))","v":19.080732755216182},{"$f":"IF(CH$11=1,(CG$11*BK55*BN$11/CF$11)*(1-CI54^3-(BL55-BM55)*(-2*BM55^3*(1-CI54^3)-3*BM55^2*(1-CI54^2)-6*BM55*(1-CI54)-6*LN((1-BM55)/(1-BM55*CI54)))/(2*BM55^4))/3,BN$11*BM55*(LN((1+BL55^3)/(BL55^3+CI54^3)))/3)","v":11.296595867671931},{"$f":"BO55/BN55","v":0.59204203594244731},{"$f":"BN55*BJ55*BL$11","v":9.858874592244013E-2},{"$f":"MAX(MIN(BS$11,CC$11*BR$11*BK55*(BJ55-BQ$11)/BJ55),-BS$11)","v":-27.629083673767767},-4.3399663147463251E-3,{"$f":"MIN(BW$11,CC$11*BV$11*BK55*(BK$11-BJ55-BU$11)/BJ55)","v":416.66666666666669},9.4247779607693802E-2,{"$f":"MIN($CA$11,CC$11*$BZ$11*BK55*(BK$11-BJ55-$BY$11)/BJ55)","v":416.66666666666669},0,{"$f":"(0.5*BK$11-BJ55+BP55*BJ55)*BQ55+(0.5*BK$11-BQ$11)*BS55+(0.5*BK$11-BU$11)*BU55+(0.5*BK$11-BY$11)*BW55","v":3.2982955321521075E-2},{"$f":"BQ55+BS55-BU55-BW55","v":1.0000000000010001E-6},{"$f":"$CI$11","v":9.9999999999999995E-7},{"$f":"BN55*BL$11","v":2.8621099132824273},{"$f":"IF(BR54<BS$11,CC$11*BK55*BP$11*BR$11,BP$11*BS$11)","v":9.6211275016187342E-2},{"$f":"IF(BT54<BW$11,CC$11*BK55*BT$11*BV$11,-BT$11*BW$11)","v":-9.4247779607693802E-2},{"$f":"IF(BV54<CA$11,CC$11*BK55*$BX$11*$BZ$11,-$BX$11*CA$11)","v":0},{"$f":"-BZ55","v":-9.9999999999999995E-7},{"$f":"IF(BR54<BS$11,BQ$11*CC$11*BK55*BP$11*BR$11,0)","v":3.4636059005827445E-3},{"$f":"IF(BT54<BW$11,(BK$11-BU$11)*CC$11*BK55*BT$11*BV$11,0)","v":0},{"$f":"IF(BV54<CA$11,(BK$11-$BY$11)*CC$11*BK55*$BX$11*$BZ$11,0)","v":0}]
[null,null,null,null,null,null,null,null,null,null,null,null,null,null,null,null,null,null,null,null,null,null,null,null,null,null,null,null,null,null,null,null,null,null,null,null,null,null,null,null,null,null,null,null,null,null,null,null,null,null,null,null,null,null,null,null,null,null,null,null,null,3.4446177438857709E-2,{"$f":"BK55","v":3.0624999999999979E-3},{"$f":"IF($CH$11=1,BK56/($CG$11*$CF$11),2^(1/3)*$CF$11/BK56)","v":0.59366999924207753},{"$f":"IF($CH$11=1,-($CG$11-2)*BK56/$CF$11,3*($CF$11/BK56)^2)","v":-0.40416622540468372},{"$f":"IF(CH$11=1,0.5*(CG$11*BK56*BN$11/CF$11)*(1-CI55^2+(BL56-BM56)*(BM56^2*(1-CI55^2)+2*BM56*(1-CI55)+2*LN((1-BM56)/(1-BM56*CI55)))/(BM56^3)),BN$11*BM56*(LN((1-BL56+BL56^2)/(1+BL56)^2)/(6*BL56)+ATAN((2-BL56)/(BL56*3^0.5))/(BL56*3^0.5)-LN((CI55^2-BL56*CI55+BL56^2)/(CI55+BL56)^2)/(6*BL56)-ATAN((2*CI55-BL56)/(BL56*3^0.5))/(BL56*3^0.5)))","v":19.080732755216182},{"$f":"IF(CH$11=1,(CG$11*BK56*BN$11/CF$11)*(1-CI55^3-(BL56-BM56)*(-2*BM56^3*(1-CI55^3)-3*BM56^2*(1-CI55^2)-6*BM56*(1-CI55)-6*LN((1-BM56)/(1-BM56*CI55)))/(2*BM56^4))/3,BN$11*BM56*(LN((1+BL56^3)/(BL56^3+CI55^3)))/3)","v":11.296595867671931},{"$f":"BO56/BN56","v":0.59204203594244731},{"$f":"BN56*BJ56*BL$11","v":9.858874592244013E-2},{"$f":"MAX(MIN(BS$11,CC$11*BR$11*BK56*(BJ56-BQ$11)/BJ56),-BS$11)","v":-27.629083673767767},-4.3399663147463251E-3,{"$f":"MIN(BW$11,CC$11*BV$11*BK56*(BK$11-BJ56-BU$11)/BJ56)","v":416.66666666666669},9.4247779607693802E-2,{"$f":"MIN($CA$11,CC$11*$BZ$11*BK56*(BK$11-BJ56-$BY$11)/BJ56)","v":416.66666666666669},0,{"$f":"(0.5*BK$11-BJ56+BP56*BJ56)*BQ56+(0.5*BK$11-BQ$11)*BS56+(0.5*BK$11-BU$11)*BU56+(0.5*BK$11-BY$11)*BW56","v":3.2982955321521075E-2},{"$f":"BQ56+BS56-BU56-BW56","v":1.0000000000010001E-6},{"$f":"$CI$11","v":9.9999999999999995E-7},{"$f":"BN56*BL$11","v":2.8621099132824273},{"$f":"IF(BR55<BS$11,CC$11*BK56*BP$11*BR$11,BP$11*BS$11)","v":9.6211275016187342E-2},{"$f":"IF(BT55<BW$11,CC$11*BK56*BT$11*BV$11,-BT$11*BW$11)","v":-9.4247779607693802E-2},{"$f":"IF(BV55<CA$11,CC$11*BK56*$BX$11*$BZ$11,-$BX$11*CA$11)","v":0},{"$f":"-BZ56","v":-9.9999999999999995E-7},{"$f":"IF(BR55<BS$11,BQ$11*CC$11*BK56*BP$11*BR$11,0)","v":3.4636059005827445E-3},{"$f":"IF(BT55<BW$11,(BK$11-BU$11)*CC$11*BK56*BT$11*BV$11,0)","v":0},{"$f":"IF(BV55<CA$11,(BK$11-$BY$11)*CC$11*BK56*$BX$11*$BZ$11,0)","v":0}]
[null,null,null,null,null,null,null,null,null,null,null,null,null,null,null,null,null,null,null,null,null,null,null,null,null,null,null,null,null,null,null,null,null,null,null,null,null,null,null,null,null,null,null,null,null,null,null,null,null,null,null,null,null,null,null,null,null,null,null,null,null,"hc","e0","a'","b'","N'","tN'","t'","Nc","sac","Nac","sat","Nat","sat","Nat","Mtot","N","N","A","B1","B2'","B2","B3","C1","C2","C2'"]
[]
[]
[null,null,null,null,null,null,null,null,null,null,null,null,null,null,null,null,null,null,null,null,null,null,null,null,null,null,null,null,null,null,null,null,null,null,null,null,null,null,null,null,null,null,null,null,null,null,null,null,null,null,null,null,null,null,null,null,null,null,null,null,null,"LANGTIDSLAST"]
[null,null,null,null,null,null,null,null,null,null,null,null,null,null,null,null,null,null,null,null,null,null,null,null,null,null,null,null,null,null,null,null,null,null,null,null,null,null,null,null,null,null,null,null,null,null,null,null,null,null,null,null,null,null,null,null,null,null,null,null,null,"L","h","b","fck","fcd","Ecd","Ac","ac","Esc","fyd_c","At","at","Est","fyd_t","At","at","Est","fyd_t","Modenhed","1+f","uterm","   emax","e1","k","Tilstand:","Nf",null,"EIL"]
[null,null,null,null,null,null,null,null,null,null,null,null,null,null,null,null,null,null,null,null,null,null,null,null,null,null,null,null,null,null,null,null,null,null,null,null,null,null,null,null,null,null,null,null,null,null,null,null,null,null,null,null,null,null,null,null,null,null,null,null,null,"(m)","(m)","(m)","(Mpa)","(Mpa)","(Mpa)","(m2)","(m)","(Mpa)","(Mpa)","(m2)","(m)","(Mpa)","(Mpa)","(m2)","(m)","(Mpa)","(Mpa)","(døgn)",null,"(m)",null,null,null,null,null,null,"(kNm2)"]
[null,null,null,null,null,null,null,null,null,null,null,null,null,null,null,null,null,null,null,null,null,null,null,null,null,null,null,null,null,null,null,null,null,null,null,null,null,null,null,null,null,null,null,null,null,null,null,null,null,null,null,null,null,null,null,null,null,null,null,null,null,{"$f":"BJ11","v":1.7},{"$f":"BK11","v":0.4},{"$f":"BL11","v":0.15},{"$f":"BM11","v":35},{"$f":"BM63","v":35},{"$f":"22000*((BM11+8)/10)^0.3","v":34077.14619918933},{"$f":"BP11","v":1.5707963267948965E-4},{"$f":"BQ11","v":3.5999999999999997E-2},{"$f":"BR11","v":200000},{"$f":"P18","v":500},{"$f":"BT11","v":2.261946710584651E-4},{"$f":"BU11","v":3.6999999999999998E-2},{"$f":"BV11","v":200000},{"$f":"P18","v":500},{"$f":"BX11","v":0},{"$f":"BY11","v":0},{"$f":"BZ11","v":200000},{"$f":"P18","v":500},{"$f":"CB11","v":0},{"$f":"1+P26","v":3.2889533583655259},{"$f":"CD11","v":0},{"$f":"CE11","v":3.5000000000000001E-3},{"$f":"0.7*($M$21+8)^(0.31)/1000","v":2.246328469196467E-3},{"$f":"1.05*BO63*CF63/BN63","v":2.2964539096862753},{"$f":"CH11","v":1},0,null,{"$f":"1000*CJ80/(CC63*BK79/BJ79)","v":3756.9544470269357}]
[null,null,null,null,null,null,null,null,null,null,null,null,null,null,null,null,null,null,null,null,null,null,null,null,null,null,null,null,null,null,null,null,null,null,null,null,null,null,null,null,null,null,null,null,null,null,null,null,null,null,null,null,null,null,null,null,null,null,null,null,null,"hc","e0",null,null,"N'","tN'","t'","Nc","sac","Nac","sat","Nat","sat","Nat","Mtot","N","N","A","B1","B2","B2'","B3","C1","C2",null,"e0"]
[]
[null,null,null,null,null,null,null,null,null,null,null,null,null,null,null,null,null,null,null,null,null,null,null,null,null,null,null,null,null,null,null,null,null,null,null,null,null,null,null,null,null,null,null,null,null,null,null,null,null,null,null,null,null,null,null,null,null,null,null,null,null,{"$f":"0.5*(-(CB66+CC66+CD66+CE66)+SQRT(MAX((CB66+CC66+CD66+CE66)^2+4*CA66*(CF66+CG66+CH66),0)))/CA66","v":0.10885765938898317},{"$f":"MIN(BZ66/(BK63*BL63*BO63)+0.1*CF63,CK80)","v":2.0873371761200824E-4},null,null,{"$f":"0.5*BK66*$BO$63","v":3.5565247058823526},{"$f":"0.5*2*BK66*$BO$63/3","v":2.3710164705882351},{"$f":"BO66/BN66","v":0.66666666666666663},{"$f":"BN66*BJ66*BL$63","v":5.8073243256216704E-2},{"$f":"MAX(MIN(BS$63,CC$63*BR$63*BK66*(BJ66-BQ$63)/BJ66),-BS$63)","v":91.895985901595139},{"$f":"BR66*BP$63","v":1.4434987710142124E-2},{"$f":"MIN(BW$63,CC$63*BV$63*BK66*(BK$63-BJ66-BU$63)/BJ66)","v":320.55189729742904},{"$f":"BT66*BT$63","v":7.2507130966358843E-2},{"$f":"MIN($CA$63,CC$63*$BZ$63*BK66*(BK$63-BJ66-$BY$63)/BJ66)","v":367.22031221597302},{"$f":"BV66*$BX$63","v":0},{"$f":"(0.5*BK$63-BJ66+BP66*BJ66)*BQ66+(0.5*BK$63-BQ$63)*BS66+(0.5*BK$63-BU$63)*BU66+(0.5*BK$63-BY$63)*BW66","v":2.3693409871890204E-2},{"$f":"BQ66+BS66-BU66-BW66","v":1.0999999999899979E-6},{"$f":"$CI$63+0.000001","v":9.9999999999999995E-7},{"$f":"BN66*BL$63","v":0.53347870588235291},{"$f":"IF(BR65<BS$63,CC$63*BK66*BP$63*BR$63,BP$63*BS$63)","v":2.156751930562863E-2},{"$f":"IF(BT65<BW$63,CC$63*BK66*BT$63*BV$63,-BT$63*BW$63)","v":3.1057227800105228E-2},{"$f":"IF(BV65<CA$63,CC$63*BK66*$BX$63*$BZ$63,-$BX$63*CA$63)","v":0},{"$f":"-(BZ66+0.0000001)","v":-1.1000000000000001E-6},{"$f":"IF(BR65<BS$63,BQ$63*CC$63*BK66*BP$63*BR$63,0)","v":7.7643069500263058E-4},{"$f":"IF(BT65<BW$63,(BK$63-BU$63)*CC$63*BK66*BT$63*BV$63,0)","v":1.1273773691438201E-2},{"$f":"IF(BV65<CA$63,(BK$63-$BY$63)*CC$63*BK66*$BX$63*$BZ$63,0)","v":0}]
[null,null,null,null,null,null,null,null,null,null,null,null,null,null,null,null,null,null,null,null,null,null,null,null,null,null,null,null,null,null,null,null,null,null,null,null,null,null,null,null,null,null,null,null,null,null,null,null,null,null,null,null,null,null,null,null,null,null,null,null,null,0.10885754113806456,{"$f":"MIN(BZ66/(BK63*BL63*BO63)+0.12*CF63,1.2*CK80)","v":2.5048046113440987E-4},null,null,{"$f":"0.5*BK67*$BO$63","v":4.2678296470588233},{"$f":"0.5*2*BK67*$BO$63/3","v":2.8452197647058823},{"$f":"BO67/BN67","v":0.66666666666666674},6.9687816206243619E-2,110.27512389154128,1.7321975954568518E-2,384.66287359317494,8.700869216081214E-2,440.66503232997763,0,2.843210268017933E-2,{"$f":"BQ67+BS67-BU67-BW67","v":1.1000000000038757E-6},{"$f":"$CI$63+0.000001","v":9.9999999999999995E-7},0.64017444705882343,2.5881023166754356E-2,3.7268673360126271E-2,0,{"$f":"-(BZ67+0.0000001)","v":-1.1000000000000001E-6},9.3171683400315687E-4,1.3528528429725838E-2,0,{"$f":"BK67","v":2.5048046113440987E-4}]
[null,null,null,null,null,null,null,null,null,null,null,null,null,null,null,null,null,null,null,null,null,null,null,null,null,null,null,null,null,null,null,null,null,null,null,null,null,null,null,null,null,null,null,null,null,null,null,null,null,null,null,null,null,null,null,null,null,null,null,null,null,0.10885754072047958,{"$f":"IF(BX67<>BX66,BK67+(BK67-BK66)*($CJ$80-BX67)/(BX67-BX66),BK67)","v":2.5065749295781524E-4},null,null,4.2708460167228699,2.8472306778152467,0.66666666666666674,6.9737069126446172E-2,110.35306272069164,1.7334218557222926E-2,384.93474349430562,8.7070187683669101E-2,440.97648303545208,0,2.8452197647058856E-2,1.0999999999899979E-6,9.9999999999999995E-7,0.64062690250843046,2.5899315071448464E-2,3.7295013702885793E-2,0,-1.1000000000000001E-6,9.3237534257214474E-4,1.3538089974147544E-2,0,2.5065749295781524E-4]
[null,null,null,null,null,null,null,null,null,null,null,null,null,null,null,null,null,null,null,null,null,null,null,null,null,null,null,null,null,null,null,null,null,null,null,null,null,null,null,null,null,null,null,null,null,null,null,null,null,null,null,null,null,null,null,null,null,null,null,null,null,0.10885754072047957,{"$f":"IF(BX68<>BX67,BK68+(BK68-BK67)*($CJ$80-BX68)/(BX68-BX67),BK68)","v":2.5065749295781497E-4},null,null,4.2708460167228655,2.8472306778152436,0.66666666666666663,6.9737069126446088E-2,110.35306272069148,1.7334218557222902E-2,384.93474349430528,8.7070187683669018E-2,440.97648303545168,0,2.8452197647058822E-2,1.0999999999761201E-6,9.9999999999999995E-7,0.6406269025084298,2.5899315071448437E-2,3.7295013702885751E-2,0,-1.1000000000000001E-6,9.3237534257214376E-4,1.353808997414753E-2,0,2.5065749295781497E-4]
[null,null,null,null,null,null,null,null,null,null,null,null,null,null,null,null,null,null,null,null,null,null,null,null,null,null,null,null,null,null,null,null,null,null,null,null,null,null,null,null,null,null,null,null,null,null,null,null,null,null,null,null,null,null,null,null,null,null,null,null,null,0.1088575407204796,2.5065749295781503E-4,null,null,4.2708460167228663,2.8472306778152441,0.66666666666666663,6.973706912644613E-2,110.35306272069153,1.7334218557222909E-2,384.93474349430528,8.7070187683669018E-2,440.97648303545162,0,2.8452197647058829E-2,1.1000000000177534E-6,9.9999999999999995E-7,0.64062690250842991,2.5899315071448447E-2,3.7295013702885758E-2,0,-1.1000000000000001E-6,9.3237534257214398E-4,1.3538089974147531E-2,0,2.5065749295781503E-4]
[null,null,null,null,null,null,null,null,null,null,null,null,null,null,null,null,null,null,null,null,null,null,null,null,null,null,null,null,null,null,null,null,null,null,null,null,null,null,null,null,null,null,null,null,null,null,null,null,null,null,null,null,null,null,null,null,null,null,null,null,null,0.1088575407204796,2.5065749295781503E-4,null,null,4.2708460167228663,2.8472306778152441,0.66666666666666663,6.973706912644613E-2,110.35306272069153,1.7334218557222909E-2,384.93474349430528,8.7070187683669018E-2,440.97648303545162,0,2.8452197647058829E-2,1.1000000000177534E-6,9.9999999999999995E-7,0.64062690250842991,2.5899315071448447E-2,3.7295013702885758E-2,0,-1.1000000000000001E-6,9.3237534257214398E-4,1.3538089974147531E-2,0,2.5065749295781503E-4]
[null,null,null,null,null,null,null,null,null,null,null,null,null,null,null,null,null,null,null,null,null,null,null,null,null,null,null,null,null,null,null,null,null,null,null,null,null,null,null,null,null,null,null,null,null,null,null,null,null,null,null,null,null,null,null,null,null,null,null,null,null,0.1088575407204796,2.5065749295781503E-4,null,null,4.2708460167228663,2.8472306778152441,0.66666666666666663,6.973706912644613E-2,110.35306272069153,1.7334218557222909E-2,384.93474349430528,8.7070187683669018E-2,440.97648303545162,0,2.8452197647058829E-2,1.1000000000177534E-6,9.9999999999999995E-7,0.64062690250842991,2.5899315071448447E-2,3.7295013702885758E-2,0,-1.1000000000000001E-6,9.3237534257214398E-4,1.3538089974147531E-2,0,2.5065749295781503E-4]
[null,null,null,null,null,null,null,null,null,null,null,null,null,null,null,null,null,null,null,null,null,null,null,null,null,null,null,null,null,null,null,null,null,null,null,null,null,null,null,null,null,null,null,null,null,null,null,null,null,null,null,null,null,null,null,null,null,null,null,null,null,0.1088575407204796,2.5065749295781503E-4,null,null,4.2708460167228663,2.8472306778152441,0.66666666666666663,6.973706912644613E-2,110.35306272069153,1.7334218557222909E-2,384.93474349430528,8.7070187683669018E-2,440.97648303545162,0,2.8452197647058829E-2,1.1000000000177534E-6,9.9999999999999995E-7,0.64062690250842991,2.5899315071448447E-2,3.7295013702885758E-2,0,-1.1000000000000001E-6,9.3237534257214398E-4,1.3538089974147531E-2,0,2.5065749295781503E-4]
[null,null,null,null,null,null,null,null,null,null,null,null,null,null,null,null,null,null,null,null,null,null,null,null,null,null,null,null,null,null,null,null,null,null,null,null,null,null,null,null,null,null,null,null,null,null,null,null,null,null,null,null,null,null,null,null,null,null,null,null,null,0.1088575407204796,2.5065749295781503E-4,null,null,4.2708460167228663,2.8472306778152441,0.66666666666666663,6.973706912644613E-2,110.35306272069153,1.7334218557222909E-2,384.93474349430528,8.7070187683669018E-2,440.97648303545162,0,2.8452197647058829E-2,1.1000000000177534E-6,9.9999999999999995E-7,0.64062690250842991,2.5899315071448447E-2,3.7295013702885758E-2,0,-1.1000000000000001E-6,9.3237534257214398E-4,1.3538089974147531E-2,0,2.5065749295781503E-4]
[null,null,null,null,null,null,null,null,null,null,null,null,null,null,null,null,null,null,null,null,null,null,null,null,null,null,null,null,null,null,null,null,null,null,null,null,null,null,null,null,null,null,null,null,null,null,null,null,null,null,null,null,null,null,null,null,null,null,null,null,null,0.1088575407204796,2.5065749295781503E-4,null,null,4.2708460167228663,2.8472306778152441,0.66666666666666663,6.973706912644613E-2,110.35306272069153,1.7334218557222909E-2,384.93474349430528,8.7070187683669018E-2,440.97648303545162,0,2.8452197647058829E-2,1.1000000000177534E-6,9.9999999999999995E-7,0.64062690250842991,2.5899315071448447E-2,3.7295013702885758E-2,0,-1.1000000000000001E-6,9.3237534257214398E-4,1.3538089974147531E-2,0,2.5065749295781503E-4]
[null,null,null,null,null,null,null,null,null,null,null,null,null,null,null,null,null,null,null,null,null,null,null,null,null,null,null,null,null,null,null,null,null,null,null,null,null,null,null,null,null,null,null,null,null,null,null,null,null,null,null,null,null,null,null,null,null,null,null,null,null,0.1088575407204796,2.5065749295781503E-4,null,null,4.2708460167228663,2.8472306778152441,0.66666666666666663,6.973706912644613E-2,110.35306272069153,1.7334218557222909E-2,384.93474349430528,8.7070187683669018E-2,440.97648303545162,0,2.8452197647058829E-2,1.1000000000177534E-6,9.9999999999999995E-7,0.64062690250842991,2.5899315071448447E-2,3.7295013702885758E-2,0,-1.1000000000000001E-6,9.3237534257214398E-4,1.3538089974147531E-2,0,2.5065749295781503E-4]
[null,null,null,null,null,null,null,null,null,null,null,null,null,null,null,null,null,null,null,null,null,null,null,null,null,null,null,null,null,null,null,null,null,null,null,null,null,null,null,null,null,null,null,null,null,null,null,null,null,null,null,null,null,null,null,null,null,null,null,null,null,{"$f":"BJ76","v":0.1088575407204796},{"$f":"BK76","v":2.5065749295781503E-4},null,null,null,null,null,null,{"$f":"BR76","v":110.35306272069153},1.7334218557222909E-2,384.93474349430528,8.7070187683669018E-2,440.97648303545162,0,2.8452197647058829E-2,null,null,null,null,null,null,null,null,null,null,{"$f":"CI76","v":2.5065749295781503E-4}]
[null,null,null,null,null,null,null,null,null,null,null,null,null,null,null,null,null,null,null,null,null,null,null,null,null,null,null,null,null,null,null,null,null,null,null,null,null,null,null,null,null,null,null,null,null,null,null,null,null,null,null,null,null,null,null,null,null,null,null,null,null,0.1088575407204796,{"$f":"IF(BX77<>BX76,BK77+(BK77-BK76)*($CJ$80-BX77)/(BX77-BX76),BK77)","v":2.5065749295781503E-4},null,null,{"$f":"0.5*BK78*$BO$63","v":4.2708460167228663},{"$f":"0.5*2*BK78*$BO$63/3","v":2.8472306778152441},{"$f":"BO78/BN78","v":0.66666666666666663},{"$f":"BN78*BJ78*BL$63","v":6.973706912644613E-2},{"$f":"MAX(MIN(BS$63,CC$63*BR$63*BK78*(BJ78-BQ$63)/BJ78),-BS$63)","v":110.35306272069153},{"$f":"BR78*BP$63","v":1.7334218557222909E-2},{"$f":"MIN(BW$63,CC$63*BV$63*BK78*(BK$63-BJ78-BU$63)/BJ78)","v":384.93474349430528},{"$f":"BT78*BT$63","v":8.7070187683669018E-2},{"$f":"MIN($CA$63,CC$63*$BZ$63*BK78*(BK$63-BJ78-$BY$63)/BJ78)","v":440.97648303545162},{"$f":"BV78*$BX$63","v":0},{"$f":"(0.5*BK$63-BJ78+BP78*BJ78)*BQ78+(0.5*BK$63-BQ$63)*BS78+(0.5*BK$63-BU$63)*BU78+(0.5*BK$63-BY$63)*BW78","v":2.8452197647058829E-2},{"$f":"BQ78+BS78-BU78-BW78","v":1.1000000000177534E-6},{"$f":"$CI$63+0.000001","v":9.9999999999999995E-7},{"$f":"BN78*BL$63","v":0.64062690250842991},{"$f":"IF(BR77<BS$63,CC$63*BK78*BP$63*BR$63,BP$63*BS$63)","v":2.5899315071448447E-2},{"$f":"IF(BT77<BW$63,CC$63*BK78*BT$63*BV$63,-BT$63*BW$63)","v":3.7295013702885758E-2},{"$f":"IF(BV77<CA$63,CC$63*BK78*$BX$63*$BZ$63,-$BX$63*CA$63)","v":0},{"$f":"-(BZ78+0.0000001)","v":-1.1000000000000001E-6},{"$f":"IF(BR77<BS$63,BQ$63*CC$63*BK78*BP$63*BR$63,0)","v":9.3237534257214398E-4},{"$f":"IF(BT77<BW$63,(BK$63-BU$63)*CC$63*BK78*BT$63*BV$63,0)","v":1.3538089974147531E-2},{"$f":"IF(BV77<CA$63,(BK$63-$BY$63)*CC$63*BK78*$BX$63*$BZ$63,0)","v":0},{"$f":"CI77","v":2.5065749295781503E-4}]
[null,null,null,null,null,null,null,null,null,null,null,null,null,null,null,null,null,null,null,null,null,null,null,null,null,null,null,null,null,null,null,null,null,null,null,null,null,null,null,null,null,null,null,null,null,null,null,null,null,null,null,null,null,null,null,null,null,null,null,null,null,0.1088575407204796,{"$f":"IF(BX78<>BX77,BK78+(BK78-BK77)*($CJ$80-BX78)/(BX78-BX77),BK78)","v":2.5065749295781503E-4},null,null,{"$f":"0.5*BK79*$BO$63","v":4.2708460167228663},{"$f":"0.5*2*BK79*$BO$63/3","v":2.8472306778152441},{"$f":"BO79/BN79","v":0.66666666666666663},{"$f":"BN79*BJ79*BL$63","v":6.973706912644613E-2},{"$f":"MAX(MIN(BS$63,CC$63*BR$63*BK79*(BJ79-BQ$63)/BJ79),-BS$63)","v":110.35306272069153},{"$f":"BR79*BP$63","v":1.7334218557222909E-2},{"$f":"MIN(BW$63,CC$63*BV$63*BK79*(BK$63-BJ79-BU$63)/BJ79)","v":384.93474349430528},{"$f":"BT79*BT$63","v":8.7070187683669018E-2},{"$f":"MIN($CA$63,CC$63*$BZ$63*BK79*(BK$63-BJ79-$BY$63)/BJ79)","v":440.97648303545162},{"$f":"BV79*$BX$63","v":0},{"$f":"(0.5*BK$63-BJ79+BP79*BJ79)*BQ79+(0.5*BK$63-BQ$63)*BS79+(0.5*BK$63-BU$63)*BU79+(0.5*BK$63-BY$63)*BW79","v":2.8452197647058829E-2},{"$f":"BQ79+BS79-BU79-BW79","v":1.1000000000177534E-6},{"$f":"$CI$63+0.000001","v":9.9999999999999995E-7},{"$f":"BN79*BL$63","v":0.64062690250842991},{"$f":"IF(BR78<BS$63,CC$63*BK79*BP$63*BR$63,BP$63*BS$63)","v":2.5899315071448447E-2},{"$f":"IF(BT78<BW$63,CC$63*BK79*BT$63*BV$63,-BT$63*BW$63)","v":3.7295013702885758E-2},{"$f":"IF(BV78<CA$63,CC$63*BK79*$BX$63*$BZ$63,-$BX$63*CA$63)","v":0},{"$f":"-(BZ79+0.0000001)","v":-1.1000000000000001E-6},{"$f":"IF(BR78<BS$63,BQ$63*CC$63*BK79*BP$63*BR$63,0)","v":9.3237534257214398E-4},{"$f":"IF(BT78<BW$63,(BK$63-BU$63)*CC$63*BK79*BT$63*BV$63,0)","v":1.3538089974147531E-2},{"$f":"IF(BV78<CA$63,(BK$63-$BY$63)*CC$63*BK79*$BX$63*$BZ$63,0)","v":0},{"$f":"CI78","v":2.5065749295781503E-4}]
[null,null,null,null,null,null,null,null,null,null,null,null,null,null,null,null,null,null,null,null,null,null,null,null,null,null,null,null,null,null,null,null,null,null,null,null,null,null,null,null,null,null,null,null,null,null,null,null,null,null,null,null,null,null,null,null,null,null,null,null,null,null,null,null,null,null,null,null,null,null,null,null,null,null,null,null,null,null,null,null,null,null,null,null,null,null,"korr-M_L =",{"$f":"MAX(AU21/1000,0.05*(BT63*BS63+BX63*BW63)*BK63)","v":2.8452197647058825E-2},{"$f":"CJ80/((BL63*BK63^2/6)*BO63)","v":2.0873371761200824E-4}]
[]
[]
[null,null,null,null,null,null,null,null,null,null,null,null,null,null,null,null,null,null,null,null,null,null,null,null,null,null,null,null,null,null,null,null,null,null,null,null,null,null,null,null,null,null,null,null,null,null,null,null,null,null,null,null,null,null,null,null,null,null,null,null,null,"KORTTIDSLAST"]
[null,null,null,null,null,null,null,null,null,null,null,null,null,null,null,null,null,null,null,null,null,null,null,null,null,null,null,null,null,null,null,null,null,null,null,null,null,null,null,null,null,null,null,null,null,null,null,null,null,null,null,null,null,null,null,null,null,null,null,null,null,"L","h","b","fck","fcd","Ecd","Ac","ac","Esc","fyd_c","At","at","Est","fyd_t","At","at","Est","fyd_t","Modenhed","1+f","uterm","   emax","e1","k","Tilstand:","Nf",null,"EI_k"]
[null,null,null,null,null,null,null,null,null,null,null,null,null,null,null,null,null,null,null,null,null,null,null,null,null,null,null,null,null,null,null,null,null,null,null,null,null,null,null,null,null,null,null,null,null,null,null,null,null,null,null,null,null,null,null,null,null,null,null,null,null,"(m)","(m)","(m)","(Mpa)","(Mpa)","(Mpa)","(m2)","(m)","(Mpa)","(Mpa)","(m2)","(m)","(Mpa)","(Mpa)","(m2)","(m)","(Mpa)","(Mpa)","(døgn)",null,"(m)",null,null,null,null,null,null,"(kNm2)"]
[null,null,null,null,null,null,null,null,null,null,null,null,null,null,null,null,null,null,null,null,null,null,null,null,null,null,null,null,null,null,null,null,null,null,null,null,null,null,null,null,null,null,null,null,null,null,null,null,null,null,null,null,null,null,null,null,null,null,null,null,null,{"$f":"BJ63","v":1.7},{"$f":"BK63","v":0.4},{"$f":"BL63","v":0.15},{"$f":"BM63","v":35},{"$f":"BN63","v":35},{"$f":"22000*((BM11+8)/10)^0.3","v":34077.14619918933},{"$f":"BP63","v":1.5707963267948965E-4},{"$f":"BQ63","v":3.5999999999999997E-2},200000,500,2.261946710584651E-4,3.6999999999999998E-2,200000,500,0,0,200000,500,{"$f":"CB63","v":0},1,{"$f":"CD63","v":0},3.5000000000000001E-3,{"$f":"0.7*($M$21+8)^(0.31)/1000","v":2.246328469196467E-3},{"$f":"1.05*BO86*CF86/BN86","v":2.2964539096862753},1,0,null,{"$f":"1000*CJ103/(CC86*BK102/BJ102)","v":4504.4822103198303}]
[null,null,null,null,null,null,null,null,null,null,null,null,null,null,null,null,null,null,null,null,null,null,null,null,null,null,null,null,null,null,null,null,null,null,null,null,null,null,null,null,null,null,null,null,null,null,null,null,null,null,null,null,null,null,null,null,null,null,null,null,null,"hc","e0","a'","b'","N'","tN'","t'","Nc","sac","Nac","sat","Nat","sat","Nat","Mtot","N","N","A","B1","B2","B2'","B3","C1","C2",null,"e0"]
[]
[null,null,null,null,null,null,null,null,null,null,null,null,null,null,null,null,null,null,null,null,null,null,null,null,null,null,null,null,null,null,null,null,null,null,null,null,null,null,null,null,null,null,null,null,null,null,null,null,null,null,null,null,null,null,null,null,null,null,null,null,null,{"$f":"0.5*(-(CB89+CC89+CD89+CE89)+SQRT(MAX((CB89+CC89+CD89+CE89)^2+4*CA89*(CF89+CG89+CH89),0)))/CA89","v":6.9232617471705379E-2},{"$f":"MIN(BZ89/(BK86*BL86*BO86)+0.1*CF86,CK103)","v":1.6594308523981249E-5},null,null,{"$f":"0.5*BK89*$BO$86","v":0.28274333882308134},{"$f":"0.5*2*BK89*$BO$86/3","v":0.18849555921538755},{"$f":"BO89/BN89","v":0.66666666666666663},{"$f":"BN89*BJ89*BL$86","v":2.9362592129116758E-3},{"$f":"MAX(MIN(BS$86,CC$86*BR$86*BK89*(BJ89-BQ$86)/BJ89),-BS$86)","v":1.5930996906488755},{"$f":"BR89*BP$86","v":2.5024351422893394E-4},{"$f":"MIN(BW$86,CC$86*BV$86*BK89*(BK$86-BJ89-BU$86)/BJ89)","v":14.082571937856445},{"$f":"BT89*BT$86","v":3.1854027271406098E-3},{"$f":"MIN($CA$86,CC$86*$BZ$86*BK89*(BK$86-BJ89-$BY$86)/BJ89)","v":15.856271785730135},{"$f":"BV89*$BX$86","v":0},{"$f":"(0.5*BK$86-BJ89+BP89*BJ89)*BQ89+(0.5*BK$86-BQ$86)*BS89+(0.5*BK$86-BU$86)*BU89+(0.5*BK$86-BY$86)*BW89","v":1.0797507864780381E-3},{"$f":"BQ89+BS89-BU89-BW89","v":1.0999999999999725E-6},{"$f":"$CI$86+0.000001","v":9.9999999999999995E-7},{"$f":"BN89*BL$86","v":4.2411500823462199E-2},{"$f":"IF(BR88<BS$86,CC$86*BK89*BP$86*BR$86,BP$86*BS$86)","v":5.2132557750341976E-4},{"$f":"IF(BT88<BW$86,CC$86*BK89*BT$86*BV$86,-BT$86*BW$86)","v":7.5070883160492435E-4},{"$f":"IF(BV88<CA$86,CC$86*BK89*$BX$86*$BZ$86,-$BX$86*CA$86)","v":0},{"$f":"-(BZ89+0.0000001)","v":-1.1000000000000001E-6},{"$f":"IF(BR88<BS$86,BQ$86*CC$86*BK89*BP$86*BR$86,0)","v":1.8767720790123109E-5},{"$f":"IF(BT88<BW$86,(BK$86-BU$86)*CC$86*BK89*BT$86*BV$86,0)","v":2.7250730587258763E-4},{"$f":"IF(BV88<CA$86,(BK$86-$BY$86)*CC$86*BK89*$BX$86*$BZ$86,0)","v":0}]
[null,null,null,null,null,null,null,null,null,null,null,null,null,null,null,null,null,null,null,null,null,null,null,null,null,null,null,null,null,null,null,null,null,null,null,null,null,null,null,null,null,null,null,null,null,null,null,null,null,null,null,null,null,null,null,null,null,null,null,null,null,6.9230840676228853E-2,{"$f":"MIN(BZ89/(BK86*BL86*BO86)+0.12*CF86,1.2*CK103)","v":1.9913170228777499E-5},null,null,{"$f":"0.5*BK90*$BO$86","v":0.33929200658769765},{"$f":"0.5*2*BK90*$BO$86/3","v":0.22619467105846511},{"$f":"BO90/BN90","v":0.66666666666666674},3.523420627618633E-3,1.9116664791804019,3.0028386835535077E-4,16.899622250543409,3.822604495973984E-3,19.028116693967814,0,1.2957054220757622E-3,{"$f":"BQ90+BS90-BU90-BW90","v":1.0999999999999725E-6},{"$f":"$CI$86+0.000001","v":9.9999999999999995E-7},5.0893800988154644E-2,6.2559069300410363E-4,9.0085059792590944E-4,0,{"$f":"-(BZ90+0.0000001)","v":-1.1000000000000001E-6},2.2521264948147735E-5,3.2700876704710514E-4,0,{"$f":"BK90","v":1.9913170228777499E-5}]
[null,null,null,null,null,null,null,null,null,null,null,null,null,null,null,null,null,null,null,null,null,null,null,null,null,null,null,null,null,null,null,null,null,null,null,null,null,null,null,null,null,null,null,null,null,null,null,null,null,null,null,null,null,null,null,null,null,null,null,null,null,6.922704590340531E-2,{"$f":"IF(BX90<>BX89,BK90+(BK90-BK89)*($CJ$103-BX90)/(BX90-BX89),BK90)","v":3.4762683420051328E-5},null,null,{"$f":"0.5*BK91*$BO$86","v":0.59230652259061201},0.394871015060408,{"$f":"BO91/BN91","v":0.66666666666666663},{"$f":"BN91*BJ91*BL$86","v":6.1505446242399999E-3},{"$f":"MAX(MIN(BS$86,CC$86*BR$86*BK91*(BJ91-BQ$86)/BJ91),-BS$86)","v":3.3370231609630894},{"$f":"BR91*BP$86","v":5.2417837236703156E-4},{"$f":"MIN(BW$86,CC$86*BV$86*BK91*(BK$86-BJ91-BU$86)/BJ91)","v":29.503891340048767},{"$f":"BT91*BT$86","v":6.6736229966070284E-3},{"$f":"MIN($CA$86,CC$86*$BZ$86*BK91*(BK$86-BJ91-$BY$86)/BJ91)","v":33.219835794291697},{"$f":"BV91*$BX$86","v":0},{"$f":"(0.5*BK$86-BJ91+BP91*BJ91)*BQ91+(0.5*BK$86-BQ$86)*BS91+(0.5*BK$86-BU$86)*BU91+(0.5*BK$86-BY$86)*BW91","v":2.2619467146854037E-3},{"$f":"BQ91+BS91-BU91-BW91","v":1.1000000000030083E-6},9.9999999999999995E-7,{"$f":"BN91*BL$86","v":8.8845978388591804E-2},{"$f":"IF(BR90<BS$86,CC$86*BK91*BP$86*BR$86,BP$86*BS$86)","v":1.0921019085150094E-3},{"$f":"IF(BT90<BW$86,CC$86*BK91*BT$86*BV$86,-BT$86*BW$86)","v":1.5726267482616136E-3},{"$f":"IF(BV90<CA$86,CC$86*BK91*$BX$86*$BZ$86,-$BX$86*CA$86)","v":0},-1.1000000000000001E-6,{"$f":"IF(BR90<BS$86,BQ$86*CC$86*BK91*BP$86*BR$86,0)","v":3.9315668706540335E-5},{"$f":"IF(BT90<BW$86,(BK$86-BU$86)*CC$86*BK91*BT$86*BV$86,0)","v":5.7086350961896586E-4},{"$f":"IF(BV90<CA$86,(BK$86-$BY$86)*CC$86*BK91*$BX$86*$BZ$86,0)","v":0},3.4762683420051328E-5]
[null,null,null,null,null,null,null,null,null,null,null,null,null,null,null,null,null,null,null,null,null,null,null,null,null,null,null,null,null,null,null,null,null,null,null,null,null,null,null,null,null,null,null,null,null,null,null,null,null,null,null,null,null,null,null,null,null,null,null,null,null,6.9227045903414525E-2,{"$f":"IF(BX91<>BX90,BK91+(BK91-BK90)*($CJ$103-BX91)/(BX91-BX90),BK91)","v":3.4762683357029624E-5},null,null,0.59230652151681207,0.39487101434454136,{"$f":"BO92/BN92","v":0.66666666666666663},6.1505446130904204E-3,3.3370231549138394,5.2417837141681758E-4,29.503891286555941,6.6736229845072359E-3,33.219835734061689,0,2.2619467105846518E-3,{"$f":"BQ92+BS92-BU92-BW92","v":1.1000000000021409E-6},9.9999999999999995E-7,8.8845978227521813E-2,1.0921019065351244E-3,1.5726267454105789E-3,0,-1.1000000000000001E-6,3.9315668635264471E-5,5.7086350858404024E-4,0,3.4762683357029624E-5]
[null,null,null,null,null,null,null,null,null,null,null,null,null,null,null,null,null,null,null,null,null,null,null,null,null,null,null,null,null,null,null,null,null,null,null,null,null,null,null,null,null,null,null,null,null,null,null,null,null,null,null,null,null,null,null,null,null,null,null,null,null,6.9227045903414525E-2,3.4762683357029617E-5,null,null,0.59230652151681196,0.3948710143445413,0.66666666666666663,6.1505446130904178E-3,3.3370231549138385,5.2417837141681748E-4,29.503891286555934,6.6736229845072341E-3,33.219835734061689,0,2.2619467105846509E-3,1.1000000000012736E-6,9.9999999999999995E-7,8.8845978227521785E-2,1.0921019065351241E-3,1.5726267454105789E-3,0,-1.1000000000000001E-6,3.9315668635264464E-5,5.7086350858404013E-4,0,3.4762683357029617E-5]
[null,null,null,null,null,null,null,null,null,null,null,null,null,null,null,null,null,null,null,null,null,null,null,null,null,null,null,null,null,null,null,null,null,null,null,null,null,null,null,null,null,null,null,null,null,null,null,null,null,null,null,null,null,null,null,null,null,null,null,null,null,6.9227045903414525E-2,3.4762683357029617E-5,null,null,0.59230652151681196,0.3948710143445413,0.66666666666666663,6.1505446130904178E-3,3.3370231549138385,5.2417837141681748E-4,29.503891286555934,6.6736229845072341E-3,33.219835734061689,0,2.2619467105846509E-3,1.1000000000012736E-6,9.9999999999999995E-7,8.8845978227521785E-2,1.0921019065351241E-3,1.5726267454105789E-3,0,-1.1000000000000001E-6,3.9315668635264464E-5,5.7086350858404013E-4,0,3.4762683357029617E-5]
[null,null,null,null,null,null,null,null,null,null,null,null,null,null,null,null,null,null,null,null,null,null,null,null,null,null,null,null,null,null,null,null,null,null,null,null,null,null,null,null,null,null,null,null,null,null,null,null,null,null,null,null,null,null,null,null,null,null,null,null,null,6.9227045903414525E-2,3.4762683357029617E-5,null,null,0.59230652151681196,0.3948710143445413,0.66666666666666663,6.1505446130904178E-3,3.3370231549138385,5.2417837141681748E-4,29.503891286555934,6.6736229845072341E-3,33.219835734061689,0,2.2619467105846509E-3,1.1000000000012736E-6,9.9999999999999995E-7,8.8845978227521785E-2,1.0921019065351241E-3,1.5726267454105789E-3,0,-1.1000000000000001E-6,3.9315668635264464E-5,5.7086350858404013E-4,0,3.4762683357029617E-5]
[null,null,null,null,null,null,null,null,null,null,null,null,null,null,null,null,null,null,null,null,null,null,null,null,null,null,null,null,null,null,null,null,null,null,null,null,null,null,null,null,null,null,null,null,null,null,null,null,null,null,null,null,null,null,null,null,null,null,null,null,null,6.9227045903414525E-2,3.4762683357029617E-5,null,null,{"$f":"0.5*BK96*$BO$86","v":0.59230652151681196},0.3948710143445413,0.66666666666666663,6.1505446130904178E-3,3.3370231549138385,5.2417837141681748E-4,29.503891286555934,6.6736229845072341E-3,33.219835734061689,0,2.2619467105846509E-3,1.1000000000012736E-6,9.9999999999999995E-7,8.8845978227521785E-2,1.0921019065351241E-3,1.5726267454105789E-3,0,-1.1000000000000001E-6,3.9315668635264464E-5,5.7086350858404013E-4,0,3.4762683357029617E-5]
[null,null,null,null,null,null,null,null,null,null,null,null,null,null,null,null,null,null,null,null,null,null,null,null,null,null,null,null,null,null,null,null,null,null,null,null,null,null,null,null,null,null,null,null,null,null,null,null,null,null,null,null,null,null,null,null,null,null,null,null,null,6.9227045903414525E-2,3.4762683357029617E-5,null,null,0.59230652151681196,0.3948710143445413,0.66666666666666663,6.1505446130904178E-3,3.3370231549138385,5.2417837141681748E-4,29.503891286555934,6.6736229845072341E-3,33.219835734061689,0,2.2619467105846509E-3,1.1000000000012736E-6,9.9999999999999995E-7,8.8845978227521785E-2,1.0921019065351241E-3,1.5726267454105789E-3,0,-1.1000000000000001E-6,3.9315668635264464E-5,5.7086350858404013E-4,0,3.4762683357029617E-5]
[null,null,null,null,null,null,null,null,null,null,null,null,null,null,null,null,null,null,null,null,null,null,null,null,null,null,null,null,null,null,null,null,null,null,null,null,null,null,null,null,null,null,null,null,null,null,null,null,null,null,null,null,null,null,null,null,null,null,null,null,null,6.9227045903414525E-2,3.4762683357029617E-5,null,null,0.59230652151681196,0.3948710143445413,0.66666666666666663,6.1505446130904178E-3,3.3370231549138385,5.2417837141681748E-4,29.503891286555934,6.6736229845072341E-3,33.219835734061689,0,2.2619467105846509E-3,1.1000000000012736E-6,9.9999999999999995E-7,8.8845978227521785E-2,1.0921019065351241E-3,1.5726267454105789E-3,0,-1.1000000000000001E-6,3.9315668635264464E-5,5.7086350858404013E-4,0,3.4762683357029617E-5]
[null,null,null,null,null,null,null,null,null,null,null,null,null,null,null,null,null,null,null,null,null,null,null,null,null,null,null,null,null,null,null,null,null,null,null,null,null,null,null,null,null,null,null,null,null,null,null,null,null,null,null,null,null,null,null,null,null,null,null,null,null,6.9227045903414525E-2,3.4762683357029617E-5,null,null,0.59230652151681196,0.3948710143445413,0.66666666666666663,6.1505446130904178E-3,3.3370231549138385,5.2417837141681748E-4,29.503891286555934,6.6736229845072341E-3,33.219835734061689,0,2.2619467105846509E-3,1.1000000000012736E-6,9.9999999999999995E-7,8.8845978227521785E-2,1.0921019065351241E-3,1.5726267454105789E-3,0,-1.1000000000000001E-6,3.9315668635264464E-5,5.7086350858404013E-4,0,3.4762683357029617E-5]
[null,null,null,null,null,null,null,null,null,null,null,null,null,null,null,null,null,null,null,null,null,null,null,null,null,null,null,null,null,null,null,null,null,null,null,null,null,null,null,null,null,null,null,null,null,null,null,null,null,null,null,null,null,null,null,null,null,null,null,null,null,{"$f":"BJ99","v":6.9227045903414525E-2},{"$f":"BK99","v":3.4762683357029617E-5},null,null,null,null,null,null,{"$f":"BR99","v":3.3370231549138385},5.2417837141681748E-4,29.503891286555934,6.6736229845072341E-3,33.219835734061689,0,2.2619467105846509E-3,null,null,null,null,null,null,null,null,null,null,{"$f":"CI99","v":3.4762683357029617E-5}]
[null,null,null,null,null,null,null,null,null,null,null,null,null,null,null,null,null,null,null,null,null,null,null,null,null,null,null,null,null,null,null,null,null,null,null,null,null,null,null,null,null,null,null,null,null,null,null,null,null,null,null,null,null,null,null,null,null,null,null,null,null,{"$f":"0.5*(-(CB101+CC101+CD101+CE101)+SQRT(MAX((CB101+CC101+CD101+CE101)^2+4*CA101*(CF101+CG101+CH101),0)))/CA101","v":6.9227045903414525E-2},{"$f":"IF(BX100<>BX99,BK100+(BK100-BK99)*($CJ$103-BX100)/(BX100-BX99),BK100)","v":3.4762683357029617E-5},null,null,{"$f":"0.5*BK101*$BO$86","v":0.59230652151681196},{"$f":"0.5*2*BK101*$BO$86/3","v":0.3948710143445413},{"$f":"BO101/BN101","v":0.66666666666666663},{"$f":"BN101*BJ101*BL$86","v":6.1505446130904178E-3},{"$f":"MAX(MIN(BS$86,CC$86*BR$86*BK101*(BJ101-BQ$86)/BJ101),-BS$86)","v":3.3370231549138385},{"$f":"BR101*BP$86","v":5.2417837141681748E-4},{"$f":"MIN(BW$86,CC$86*BV$86*BK101*(BK$86-BJ101-BU$86)/BJ101)","v":29.503891286555934},{"$f":"BT101*BT$86","v":6.6736229845072341E-3},{"$f":"MIN($CA$86,CC$86*$BZ$86*BK101*(BK$86-BJ101-$BY$86)/BJ101)","v":33.219835734061689},{"$f":"BV101*$BX$86","v":0},{"$f":"(0.5*BK$86-BJ101+BP101*BJ101)*BQ101+(0.5*BK$86-BQ$86)*BS101+(0.5*BK$86-BU$86)*BU101+(0.5*BK$86-BY$86)*BW101","v":2.2619467105846509E-3},{"$f":"BQ101+BS101-BU101-BW101","v":1.1000000000012736E-6},{"$f":"$CI$86+0.000001","v":9.9999999999999995E-7},{"$f":"BN101*BL$86","v":8.8845978227521785E-2},{"$f":"IF(BR100<BS$86,CC$86*BK101*BP$86*BR$86,BP$86*BS$86)","v":1.0921019065351241E-3},{"$f":"IF(BT100<BW$86,CC$86*BK101*BT$86*BV$86,-BT$86*BW$86)","v":1.5726267454105789E-3},{"$f":"IF(BV100<CA$86,CC$86*BK101*$BX$86*$BZ$86,-$BX$86*CA$86)","v":0},{"$f":"-(BZ101+0.0000001)","v":-1.1000000000000001E-6},{"$f":"IF(BR100<BS$86,BQ$86*CC$86*BK101*BP$86*BR$86,0)","v":3.9315668635264464E-5},{"$f":"IF(BT100<BW$86,(BK$86-BU$86)*CC$86*BK101*BT$86*BV$86,0)","v":5.7086350858404013E-4},{"$f":"IF(BV100<CA$86,(BK$86-$BY$86)*CC$86*BK101*$BX$86*$BZ$86,0)","v":0},{"$f":"CI100","v":3.4762683357029617E-5}]
[null,null,null,null,null,null,null,null,null,null,null,null,null,null,null,null,null,null,null,null,null,null,null,null,null,null,null,null,null,null,null,null,null,null,null,null,null,null,null,null,null,null,null,null,null,null,null,null,null,null,null,null,null,null,null,null,null,null,null,null,null,{"$f":"0.5*(-(CB102+CC102+CD102+CE102)+SQRT(MAX((CB102+CC102+CD102+CE102)^2+4*CA102*(CF102+CG102+CH102),0)))/CA102","v":6.9227045903414525E-2},{"$f":"IF(BX101<>BX100,BK101+(BK101-BK100)*($CJ$103-BX101)/(BX101-BX100),BK101)","v":3.4762683357029617E-5},null,null,{"$f":"0.5*BK102*$BO$86","v":0.59230652151681196},{"$f":"0.5*2*BK102*$BO$86/3","v":0.3948710143445413},{"$f":"BO102/BN102","v":0.66666666666666663},{"$f":"BN102*BJ102*BL$86","v":6.1505446130904178E-3},{"$f":"MAX(MIN(BS$86,CC$86*BR$86*BK102*(BJ102-BQ$86)/BJ102),-BS$86)","v":3.3370231549138385},{"$f":"BR102*BP$86","v":5.2417837141681748E-4},{"$f":"MIN(BW$86,CC$86*BV$86*BK102*(BK$86-BJ102-BU$86)/BJ102)","v":29.503891286555934},{"$f":"BT102*BT$86","v":6.6736229845072341E-3},{"$f":"MIN($CA$86,CC$86*$BZ$86*BK102*(BK$86-BJ102-$BY$86)/BJ102)","v":33.219835734061689},{"$f":"BV102*$BX$86","v":0},{"$f":"(0.5*BK$86-BJ102+BP102*BJ102)*BQ102+(0.5*BK$86-BQ$86)*BS102+(0.5*BK$86-BU$86)*BU102+(0.5*BK$86-BY$86)*BW102","v":2.2619467105846509E-3},{"$f":"BQ102+BS102-BU102-BW102","v":1.1000000000012736E-6},{"$f":"$CI$86+0.000001","v":9.9999999999999995E-7},{"$f":"BN102*BL$86","v":8.8845978227521785E-2},{"$f":"IF(BR101<BS$86,CC$86*BK102*BP$86*BR$86,BP$86*BS$86)","v":1.0921019065351241E-3},{"$f":"IF(BT101<BW$86,CC$86*BK102*BT$86*BV$86,-BT$86*BW$86)","v":1.5726267454105789E-3},{"$f":"IF(BV101<CA$86,CC$86*BK102*$BX$86*$BZ$86,-$BX$86*CA$86)","v":0},{"$f":"-(BZ102+0.0000001)","v":-1.1000000000000001E-6},{"$f":"IF(BR101<BS$86,BQ$86*CC$86*BK102*BP$86*BR$86,0)","v":3.9315668635264464E-5},{"$f":"IF(BT101<BW$86,(BK$86-BU$86)*CC$86*BK102*BT$86*BV$86,0)","v":5.7086350858404013E-4},{"$f":"IF(BV101<CA$86,(BK$86-$BY$86)*CC$86*BK102*$BX$86*$BZ$86,0)","v":0},{"$f":"CI101","v":3.4762683357029617E-5}]
[null,null,null,null,null,null,null,null,null,null,null,null,null,null,null,null,null,null,null,null,null,null,null,null,null,null,null,null,null,null,null,null,null,null,null,null,null,null,null,null,null,null,null,null,null,null,null,null,null,null,null,null,null,null,null,null,null,null,null,null,null,null,null,null,null,null,null,null,null,null,null,null,null,null,null,null,null,null,null,null,null,null,null,null,null,null,"korr-M_kort =",{"$f":"MAX((AU22-AU21)/1000,0.05*(BT86*BS86+BX86*BW86)*BK86)","v":2.2619467105846514E-3},{"$f":"CJ103/((BL86*BK86^2/6)*BO86)","v":1.6594308523981249E-5}]
[]
[]
[]
[null,null,null,null,null,null,null,null,null,null,null,null,null,null,null,null,null,null,null,null,null,null,null,null,null,null,null,null,null,null,null,null,null,null,null,null,null,null,null,null,null,null,null,null,null,null,null,null,null,null,null,null,null,null,null,null,null,null,null,null,null,"FORSKYDNING"]
[]
[null,null,null,null,null,null,null,null,null,null,null,null,null,null,null,null,null,null,null,null,null,null,null,null,null,null,null,null,null,null,null,null,null,null,null,null,null,null,null,null,null,null,null,null,null,null,null,null,null,null,null,null,null,null,null,null,null,null,null,null,null,null,null,"V","v","f_cd","b","h","h_int","c","b","cot0","w","a","d","A","f_yd"]
[null,null,null,null,null,null,null,null,null,null,null,null,null,null,null,null,null,null,null,null,null,null,null,null,null,null,null,null,null,null,null,null,null,null,null,null,null,null,null,null,null,null,null,null,null,null,null,null,null,null,null,null,null,null,null,null,null,null,null,null,null," Betontrykbrud",null,{"$f":"1000*(BM110*BN110*BT110)/((1+BT110^2)*(1/(BO110*BQ110)+BU110/((1.4*BS110)*(BO110-BS110*BO110)*(BP110-BS110*BO110))))","v":317.07240400523267},{"$f":"0.7-$M$21/200","v":0.52499999999999991},{"$f":"$M$22","v":25},{"$f":"$P$9/1000","v":0.15},{"$f":"$P$7/1000","v":0.4},{"$f":"$K$34/1000","v":0.34894740758247839},{"$f":"$O$13/1000","v":3.6999999999999998E-2},{"$f":"MIN(BP110/(2*(BO110+BP110)),0.5)","v":0.36363636363636365},{"$f":"$P$15","v":1.5},{"$f":"$P$33/$P$9","v":0}]
[null,null,null,null,null,null,null,null,null,null,null,null,null,null,null,null,null,null,null,null,null,null,null,null,null,null,null,null,null,null,null,null,null,null,null,null,null,null,null,null,null,null,null,null,null,null,null,null,null,null,null,null,null,null,null,null,null,null,null,null,null," Bøjler, type 1",null,{"$f":"MIN($BL$110,1000*BX111*BY111*BT111/(BV111*(1/BQ111+BU111*BO111/((BO111-BS111*BO111)*(BP111-BS111*BO111)))))","v":82.218795911273816},null,null,{"$f":"$P$9/1000","v":0.15},{"$f":"$P$7/1000","v":0.4},{"$f":"$K$34/1000","v":0.34894740758247839},{"$f":"$O$13/1000","v":3.6999999999999998E-2},{"$f":"MIN(BP111/(2*(BO111+BP111)),0.5)","v":0.36363636363636365},{"$f":"$P$15","v":1.5},{"$f":"$P$33/$P$9","v":0},{"$f":"$O$15/1000","v":0.15},{"$f":"N15","v":6},{"$f":"2*PI()*(BW111/1000)^2/4","v":5.6548667764616275E-5},{"$f":"P22","v":416.66666666666669}]
[null,null,null,null,null,null,null,null,null,null,null,null,null,null,null,null,null,null,null,null,null,null,null,null,null,null,null,null,null,null,null,null,null,null,null,null,null,null,null,null,null,null,null,null,null,null,null,null,null,null,null,null,null,null,null,null,null,null,null,null,null," Bøjler, type 2",null,{"$f":"MIN($BL$110,1000*BX112*BY112*BT112/(BV112*(1/BQ112+BU112*BO112/((BO112-BS112*BO112)*(BP112-BS112*BO112)))))","v":82.218795911273816},null,null,{"$f":"$P$9/1000","v":0.15},{"$f":"$P$7/1000","v":0.4},{"$f":"$K$34/1000","v":0.34894740758247839},{"$f":"$O$13/1000","v":3.6999999999999998E-2},0.36363636363636365,{"$f":"$P$15","v":1.5},{"$f":"$P$33/$P$9","v":0},{"$f":"$O$16/1000","v":0.15},{"$f":"N16","v":6},{"$f":"2*PI()*(BW112/1000)^2/4","v":5.6548667764616275E-5},{"$f":"P22","v":416.66666666666669},null,null,null,null,"Vederlagsforankring:",null,{"$f":"0.5*BU110*BO110*$AU$24*BT110/(MIN(BP110,BO110)*(1-BS110))+0.5*$AU$24*BT110","v":82.210147058823523},"KN"]
[]
[]
[null,null,null,null,null,null,null,null,null,null,null,null,null,null,null,null,null,null,null,null,null,null,null,null,null,null,null,null,null,null,null,null,null,null,null,null,null,null,null,null,null,null,null,null,null,null,null,null,null,null,null,null,null,"<"]
[]
[null,null,null,null,null,null,null,null,null,null,null,null,null,null,null,null,null,null,null,null,null,null,null,null,null,null,null,null,null,null,null,null,null,null,null,null,null,null,null,null,null,null,null,null,null,null,null,null,null,null,null,null,null,null,null,null,null,null,null,null,null,"ANVENDELSESSTADIE  - HENSYN TIL KRYBNING, TENSION STIFFENING, SVIND MV:"]
[null,null,null,null,null,null,null,null,null,null,null,null,null,null,null,null,null,null,null,null,null,null,null,null,null,null,null,null,null,null,null,null,null,null,null,null,null,null,null,null,null,null,null,null,null,null,null,null,null,null,null,null,null,null,null,null,null,null,null,null,null,"L","h","b","fck","fcd","Ecd = Ecm","Ac","ac","Esc","fyd_c","At","at","Est","fyd_t","At","at","Est","fyd_t","Modenhed","1+f",null,"RH","feff = fctm","EI_k"]
[null,null,null,null,null,null,null,null,null,null,null,null,null,null,null,null,null,null,null,null,null,null,null,null,null,null,null,null,null,null,null,null,null,null,null,null,null,null,null,null,null,null,null,null,null,null,null,null,null,null,null,null,null,null,null,null,null,null,null,null,null,"(m)","(m)","(m)","(Mpa)","(Mpa)","(Mpa)","(m2)","(m)","(Mpa)","(Mpa)","(m2)","(m)","(Mpa)","(Mpa)","(m2)","(m)","(Mpa)","(Mpa)","(døgn)",null,null,null,"(Mpa)","(kNm2)"]
[null,null,null,null,null,null,null,null,null,null,null,null,null,null,null,null,null,null,null,null,null,null,null,null,null,null,null,null,null,null,null,null,null,null,null,null,null,null,null,null,null,null,null,null,null,null,null,null,null,null,null,null,null,null,null,null,null,null,null,null,null,{"$f":"BJ63","v":1.7},{"$f":"BK63","v":0.4},{"$f":"BL63","v":0.15},{"$f":"BM63","v":35},{"$f":"BN63","v":35},{"$f":"22000*((BM120+8)/10)^0.3","v":34077.14619918933},{"$f":"BP63","v":1.5707963267948965E-4},{"$f":"BQ63","v":3.5999999999999997E-2},200000,500,2.261946710584651E-4,3.6999999999999998E-2,"-",500,0,0,"-",500,0,3.2889533583655259,null,{"$f":"P24","v":0.5},{"$f":"0.3*BM120^(2/3)","v":3.2099624416952368},5565.9999455214083]
[null,null,null,null,null,null,null,null,null,null,null,null,null,null,null,null,null,null,null,null,null,null,null,null,null,null,null,null,null,null,null,null,null,null,null,null,null,null,null,null,null,null,null,null,null,null,null,null,null,null,null,null,null,null,null,null,null,null,null,null,null,"Nedbøjninger",null,"Urevnet","Revnet, korttid","Urevnet","Revnet, langtid",null,"Revnevidder",null,"Korttid","Langtid",null,"Udtørringssvind"]
[null,null,null,null,null,null,null,null,null,null,null,null,null,null,null,null,null,null,null,null,null,null,null,null,null,null,null,null,null,null,null,null,null,null,null,null,null,null,null,null,null,null,null,null,null,null,null,null,null,null,null,null,null,null,null,null,null,null,null,null,null,"(1+ f)",null,1,1,{"$f":"CC120","v":3.2889533583655259},{"$f":"CC120","v":3.2889533583655259},null,"(1+ f)",null,1,{"$f":"CC120","v":3.2889533583655259},null,null,"CEM-klasse:","N"]
[null,null,null,null,null,null,null,null,null,null,null,null,null,null,null,null,null,null,null,null,null,null,null,null,null,null,null,null,null,null,null,null,null,null,null,null,null,null,null,null,null,null,null,null,null,null,null,null,null,null,null,null,null,"<",null,null,null,null,null,null,null,"aeff","-",{"$f":"BR120/BO120","v":5.8690360639635326},{"$f":"BR120/BO120","v":5.8690360639635326},{"$f":"BN122*BR120/BO120","v":19.30298587294125},{"$f":"BO122*BR120/BO120","v":19.30298587294125},null,"aeff",null,{"$f":"BR120/BO120","v":5.8690360639635326},{"$f":"BT122*BR120/BO120","v":19.30298587294125},null,null,"fcmo",10,"MPa"]
[null,null,null,null,null,null,null,null,null,null,null,null,null,null,null,null,null,null,null,null,null,null,null,null,null,null,null,null,null,null,null,null,null,null,null,null,null,null,null,null,null,null,null,null,null,null,null,null,null,null,null,null,null,null,null,null,null,null,null,null,null,"hc","(m)","-",{"$f":"BJ102","v":6.9227045903414525E-2},"-",{"$f":"BJ79","v":0.1088575407204796},null,"kt",null,0.6,0.4,null,null,"fcm",{"$f":"BM120+8","v":43},"MPa"]
[null,null,null,null,null,null,null,null,null,null,null,null,null,null,null,null,null,null,null,null,null,null,null,null,null,null,null,null,null,null,null,null,null,null,null,null,null,null,null,null,null,null,null,null,null,null,null,null,null,null,null,null,null,null,null,null,null,null,null,null,null,"Atr","(m2)",{"$f":"BK120*BL120+BL123*BP120+BL123*BT120+BL123*BX120","v":6.2249450711028567E-2},{"$f":"BM124*BL120+BM123*BP120+BM123*BT120+BM123*BX120","v":1.263350759654075E-2},{"$f":"BK120*BL120+BN123*BP120+BN123*BT120+BN123*BX120","v":6.7398338470515129E-2},{"$f":"BO124*BL120+BO123*BP120+BO123*BT120+BO123*BX120","v":2.3726969578587075E-2},null,"x1",null,0,0,null,null,"ads1",4]
[null,null,null,null,null,null,null,null,null,null,null,null,null,null,null,null,null,null,null,null,null,null,null,null,null,null,null,null,null,null,null,null,null,null,null,null,null,null,null,null,null,null,null,null,null,null,null,null,null,null,null,null,null,null,null,null,null,null,null,null,null,"Sy","(m3)",{"$f":"BL123*(0.5*BK120-BQ120)*BP120-BL123*(0.5*BK120-BU120)*BT120-BL123*(0.5*BK120-BY120)*BX120","v":-6.5197194378664117E-5},{"$f":"BM124*BL120*(0.5*BK120-0.5*BM124)+BM123*(0.5*BK120-BQ120)*BP120-BM123*(0.5*BK120-BU120)*BT120-BM123*(0.5*BK120-BY120)*BX120","v":1.6521853913852619E-3},{"$f":"BN123*(0.5*BK120-BQ120)*BP120-BN123*(0.5*BK120-BU120)*BT120-BN123*(0.5*BK120-BY120)*BX120","v":-2.1443053140771736E-4},{"$f":"BO124*BL120*(0.5*BK120-0.5*BO124)+BO123*(0.5*BK120-BQ120)*BP120-BO123*(0.5*BK120-BU120)*BT120-BO123*(0.5*BK120-BY120)*BX120","v":2.162548377328355E-3},null,"As",null,{"$f":"BT120+BX120","v":2.261946710584651E-4},{"$f":"BT120+BX120","v":2.261946710584651E-4},null,null,"ads2",0.12]
[null,null,null,null,null,null,null,null,null,null,null,null,null,null,null,null,null,null,null,null,null,null,null,null,null,null,null,null,null,null,null,null,null,null,null,null,null,null,null,null,null,null,null,null,null,null,null,null,null,null,null,null,null,null,null,null,null,null,null,null,null,"Iy","(m4)",{"$f":"BL120*BK120^3/12+BL123*(0.5*BK120-BQ120)^2*BP120+BL123*(0.5*BK120-BU120)^2*BT120+BL123*(0.5*BK120-BY120)^2*BX120","v":8.6006711921283725E-4},{"$f":"BL120*BM124^3/12+BL120*BM124*(0.5*BK120-0.5*BM124)^2+BM123*(0.5*BK120-BQ120)^2*BP120+BM123*(0.5*BK120-BU120)^2*BT120+BM123*(0.5*BK120-BY120)^2*BX120","v":3.4824600705592016E-4},{"$f":"BL120*BK120^3/12+BN123*(0.5*BK120-BQ120)^2*BP120+BN123*(0.5*BK120-BU120)^2*BT120+BN123*(0.5*BK120-BY120)^2*BX120","v":9.9755795346240304E-4},{"$f":"BL120*BO124^3/12+BL120*BO124*(0.5*BK120-0.5*BO124)^2+BO123*(0.5*BK120-BQ120)^2*BP120+BO123*(0.5*BK120-BU120)^2*BT120+BO123*(0.5*BK120-BY120)^2*BX120","v":5.5970217050186634E-4},null,"d",null,{"$f":"BK120-(BX120*BY120+BT120*BU120)/(BT120+BX120)","v":0.36300000000000004},{"$f":"BK120-(BX120*BY120+BT120*BU120)/(BT120+BX120)","v":0.36300000000000004},null,null,"RH0",1]
[null,null,null,null,null,null,null,null,null,null,null,null,null,null,null,null,null,null,null,null,null,null,null,null,null,null,null,null,null,null,null,null,null,null,null,null,null,null,null,null,null,null,null,null,null,null,null,null,null,null,null,null,null,null,null,null,null,null,null,null,null,"z","(m)",{"$f":"BL126/BL125","v":-1.0473537297753747E-3},{"$f":"BM126/BM125","v":0.1307780423417528},{"$f":"BN126/BN125","v":-3.1815403209312742E-3},{"$f":"BO126/BO125","v":9.1143050112897445E-2},null,"hc,eff",null,{"$f":"MIN(2.5*(BK120-BS127),(BK120-BM124)/3,BK120/2)","v":9.2499999999999943E-2},{"$f":"MIN(2.5*(BK120-BT127),(BK120-BO124)/3,BK120/2)","v":9.2499999999999943E-2},null,null,"RH",{"$f":"CE120","v":0.5}]
[null,null,null,null,null,null,null,null,null,null,null,null,null,null,null,null,null,null,null,null,null,null,null,null,null,null,null,null,null,null,null,null,null,null,null,null,null,null,null,null,null,null,null,null,null,null,null,null,null,null,null,null,null,null,null,null,null,null,null,null,null,"Io","(m4)",{"$f":"BL127-BL125*BL128^2","v":8.5999883468813388E-4},{"$f":"BM127-BM125*BM128^2","v":1.3217643598491296E-4},{"$f":"BN127-BN125*BN128^2","v":9.968757340806907E-4},{"$f":"BO127-BO125*BO128^2","v":3.6260091537546307E-4},null,"Ac,eff",null,{"$f":"BS128*BL120","v":1.3874999999999992E-2},{"$f":"BT128*BL120","v":1.3874999999999992E-2},null,null,"bRH",{"$f":"1.55*(1-(BX128/BX127)^3)","v":1.35625}]
[null,null,null,null,null,null,null,null,null,null,null,null,null,null,null,null,null,null,null,null,null,null,null,null,null,null,null,null,null,null,null,null,null,null,null,null,null,null,null,null,null,null,null,null,null,null,null,null,null,null,null,null,null,null,null,null,null,null,null,null,null,"aeff*Sa","(m3)",{"$f":"-(BL123*(0.5*BK120-BQ120-BL128)*BP120-BL123*(0.5*BK120-BU120+BL128)*BT120-BL123*(0.5*BK120-BY120+BL128)*BX120)","v":6.2841223786522438E-5},{"$f":"-(BM123*(0.5*BK120-BQ120-BM128)*BP120-BM123*(0.5*BK120-BU120+BM128)*BT120-BM123*(0.5*BK120-BY120+BM128)*BX120)","v":3.5937595471124435E-4},{"$f":"-(BN123*(0.5*BK120-BQ120-BN128)*BP120-BN123*(0.5*BK120-BU120+BN128)*BT120-BN123*(0.5*BK120-BY120+BN128)*BX120)","v":1.9089241925587656E-4},{"$f":"-(BO123*(0.5*BK120-BQ120-BO128)*BP120-BO123*(0.5*BK120-BU120+BO128)*BT120-BO123*(0.5*BK120-BY120+BO128)*BX120)","v":8.8873766537805529E-4},null,"rp,eff",null,{"$f":"BS126/BS129","v":1.630231863484434E-2},{"$f":"BT126/BT129","v":1.630231863484434E-2},null,null,"ecd,0",{"$f":"0.85*((220+110*BX125)*EXP(-BX126*BX124/BX123))*BX129/1000000","v":4.5415767696248949E-4}]
[null,null,null,null,null,null,null,null,null,null,null,null,null,null,null,null,null,null,null,null,null,null,null,null,null,null,null,null,null,null,null,null,null,null,null,null,null,null,null,null,null,null,null,null,null,null,null,null,null,null,null,null,null,null,null,null,null,null,null,null,null,"Sa/Io","(m)",{"$f":"MAX(BL130/BL129,0)","v":7.3071289462050146E-2},{"$f":"MAX(BM130/BM129,0)","v":2.7189109165590204},{"$f":"MAX(BN130/BN129,0)","v":0.19149068708339634},{"$f":"MAX(BO130/BO129,0)","v":2.4510077820895524},null,"esm-ecm",null,{"$f":"MAX(BM133-BS124*CF120*(1+BS123*BS130)/BS130,0.6*BM133)/BR120","v":0},{"$f":"MAX(BO133-BT124*CF120*(1+BT123*BT130)/BT130,0.6*BO133)/BR120","v":1.4069568500945538E-3},null,null,"b",1]
[null,null,null,null,null,null,null,null,null,null,null,null,null,null,null,null,null,null,null,null,null,null,null,null,null,null,null,null,null,null,null,null,null,null,null,null,null,null,null,null,null,null,null,null,null,null,null,null,null,null,null,null,null,null,null,null,null,null,null,null,null,"Mcr","(MNm)",{"$f":"CF120*BL129/(0.5*BK120+BL128)","v":1.3875482487933754E-2},null,{"$f":"CF120*BN129/(0.5*BK120+BN128)","v":1.6258300520460237E-2},null,null,"seq",null,{"$f":"((N12^2*P12+N13^2*P13)/(N12*P12+N13*P13))/1000","v":1.2E-2},{"$f":"((N12^2*P12+N13^2*P13)/(N12*P12+N13*P13))/1000","v":1.2E-2},null,null,"h0",{"$f":"2*BK120*BL120/(2*(BK120+BL120))","v":0.10909090909090907},"m"]
[null,null,null,null,null,null,null,null,null,null,null,null,null,null,null,null,null,null,null,null,null,null,null,null,null,null,null,null,null,null,null,null,null,null,null,null,null,null,null,null,null,null,null,null,null,null,null,null,null,null,null,null,null,null,null,null,null,null,null,null,null,"sat2","(MPa)","-",{"$f":"(AU22-AU21)/1000*BM123*(0.5*BK120+BM128-BU120)/BM129","v":0},"-",{"$f":"(AU21/1000)*BO123*(0.5*BK120+BO128-BU120)/BO129","v":384.93699480229554},null,"c",null,{"$f":"BK120-BS127-0.5*BS132","v":3.0999999999999979E-2},{"$f":"BK120-BT127-0.5*BT132","v":3.0999999999999979E-2},null,null,"kn",{"$f":"IF(BX132<0.1,1,IF(BX132<0.2,0.85+0.15*(0.2-BX132)/0.1,IF(BX132<0.3,0.75+0.1*(0.3-BX132)/0.1,IF(BX132<0.5,0.7+0.05*(0.5-BX132)/0.2,0.7))))","v":0.98636363636363633}]
[null,null,null,null,null,null,null,null,null,null,null,null,null,null,null,null,null,null,null,null,null,null,null,null,null,null,null,null,null,null,null,null,null,null,null,null,null,null,null,null,null,null,null,null,null,null,null,null,null,null,null,null,null,null,null,null,null,null,null,null,null,"sr2","(MPa, spænding i armering svarende til korttids-revnemoment)",null,null,null,{"$f":"BO123*BL132*(0.5*BK120+BO128-BU120)/BO129","v":187.7249201131298},null,"k1",null,0.8,0.8,null,null,"ecd",{"$f":"BX130*BX131*BX133","v":4.479646177311828E-4}]
[null,null,null,null,null,null,null,null,null,null,null,null,null,null,null,null,null,null,null,null,null,null,null,null,null,null,null,null,null,null,null,null,null,null,null,null,null,null,null,null,null,null,null,null,null,null,null,null,null,null,null,null,null,null,null,null,null,null,null,null,null,"EI","(MNm2)",{"$f":"BL129*BO120","v":29.306306020799994},{"$f":"BM129*BO120","v":4.5041957331456688},{"$f":"BN129*BO120/BN122","v":10.328720547613331},{"$f":"BO129*BO120/BO122","v":3.7569412086008285},null,"k2",null,0.5,0.5]
[null,null,null,null,null,null,null,null,null,null,null,null,null,null,null,null,null,null,null,null,null,null,null,null,null,null,null,null,null,null,null,null,null,null,null,null,null,null,null,null,null,null,null,null,null,null,null,null,null,null,null,null,null,null,null,null,null,null,null,null,null,"x","(faktor vedr. tension stiffening)",null,{"$f":"MAX(1-1*(BO134/(BM133+BO133))^2,MAX(0,1-0.5*(BO134/BO133)^2),0)","v":0.88108557018988365},null,{"$f":"IF(BL132>CJ80,0,BM136)","v":0.88108557018988365},null,"k3",null,{"$f":"3.4*(25/(1000*BS133))^(2/3)","v":2.9457629365826512},{"$f":"BS136","v":2.9457629365826512},null,"Autogent svind"]
[null,null,null,null,null,null,null,null,null,null,null,null,null,null,null,null,null,null,null,null,null,null,null,null,null,null,null,null,null,null,null,null,null,null,null,null,null,null,null,null,null,null,null,null,null,null,null,null,null,null,null,null,null,null,null,null,null,null,null,null,null,"u","(mm, elastisk u)",{"$f":"BM137*BM135/BL135","v":0},{"$f":"Kold2!D8-Kold!BO137","v":0},{"$f":"BO137*BO135/BN135","v":0.59033289258144772},{"$f":"Kold2!D7","v":1.6229648373467145},null,"k4",null,0.42499999999999999,0.42499999999999999,null,null,"eca",{"$f":"2.5*(BM120-10)/1000000","v":6.2500000000000001E-5}]
[null,null,null,null,null,null,null,null,null,null,null,null,null,null,null,null,null,null,null,null,null,null,null,null,null,null,null,null,null,null,null,null,null,null,null,null,null,null,null,null,null,null,null,null,null,null,null,null,null,null,null,null,null,null,null,null,null,null,null,null,null,"uts","(mm, incl tension stiffening)",null,{"$f":"BM136*BM137+(1-BM136)*BL137","v":0},null,{"$f":"BO136*BO137+(1-BO136)*BN137","v":1.5001699984312411},null,"s,rmaks",null,{"$f":"MIN(1.3*(BK120-BM124),BS136*BS133+BS134*BS135*BS137*BS132/BS130)","v":0.21645422504006478},{"$f":"MIN(1.3*(BK120-BO124),BT136*BT133+BT134*BT135*BT137*BT132/BT130)","v":0.21645422504006478}]
[null,null,null,null,null,null,null,null,null,null,null,null,null,null,null,null,null,null,null,null,null,null,null,null,null,null,null,null,null,null,null,null,null,null,null,null,null,null,null,null,null,null,null,null,null,null,null,null,null,null,null,null,null,null,null,null,null,null,null,null,null,"us","(mm, svindtillæg - langtid)",null,null,{"$f":"1000*0.1*BX140*BN131*BJ120^2","v":2.8249524690140051E-2},{"$f":"1000*0.1*BX140*BO131*BJ120^2","v":0.3615831449062038},null,"wk",null,{"$f":"1000*BS138*BS131","v":0},{"$f":"1000*BT138*BT131","v":0.30454175465202726},null,"Resulterende svind"]
[null,null,null,null,null,null,null,null,null,null,null,null,null,null,null,null,null,null,null,null,null,null,null,null,null,null,null,null,null,null,null,null,null,null,null,null,null,null,null,null,null,null,null,null,null,null,null,null,null,null,null,null,null,null,null,null,null,null,null,null,null,"ucs","(mm, svindtillæg incl tension stiffening)",null,null,null,{"$f":"BO136*BO139+(1-BO136)*BN139","v":0.32194496752166868},null,null,null,null,null,null,null,"esc",{"$f":"BX134+BX137","v":5.104646177311828E-4}]
[null,null,null,null,null,null,null,null,null,null,null,null,null,null,null,null,null,null,null,null,null,null,null,null,null,null,null,null,null,null,null,null,null,null,null,null,null,null,null,null,null,null,null,null,null,null,null,null,null,null,null,null,null,null,null,null,null,null,null,null,null,"ures","(mm, resulterende udbøjning)",null,{"$f":"BO141+BM138","v":1.8221149659529097},null,{"$f":"BO140+BO138","v":1.8221149659529097},null,"wk, res",null,{"$f":"BS139+BT139","v":0.30454175465202726},{"$f":"BT139","v":0.30454175465202726}]

{"sheet":"Kold2","index":1,"n_rows":101,"n_cols":66,"rows_kept":101,"cut":false,"hidden":false,"merged":[[84,2,84,5],[84,6,84,9]]}
[]
[]
[null,"Nedbøjninger",null,null,null,null,null,null,null,null,"p/P","x1","x2","R1","R2",0,1,2,3,4,5,6,7,8,9,10,11,12,13,14,15,16,17,18,19,20,21,22,23,24,25,26,27,28,29,30,31,32,33,34,35,36,37,38,39,40]
[null,"L","(m)",{"$f":"IF(Makro!E20=1,0.00001,Kold!M8)","v":1.7},null,null,null,null,null,null,null,null,null,null,null,0,{"$f":"Q3*($BD$4-$P$4)/40","v":4.2499999999999996E-2},{"$f":"R3*($BD$4-$P$4)/40","v":8.4999999999999992E-2},0.1275,0.16999999999999998,0.21249999999999999,0.255,0.29749999999999999,0.33999999999999997,0.38249999999999995,0.42499999999999999,0.46749999999999997,0.51,0.55249999999999999,0.59499999999999997,0.63749999999999996,0.67999999999999994,0.72249999999999992,0.7649999999999999,0.80749999999999988,0.85,0.89249999999999985,0.93499999999999994,0.97750000000000004,1.02,1.0625,1.105,1.1475,1.19,1.2324999999999999,1.2749999999999999,1.3174999999999999,1.3599999999999999,1.4025000000000001,1.4449999999999998,1.4875,1.5299999999999998,1.5725,1.6149999999999998,1.6575,{"$f":"$D$4","v":1.7},{"$f":"L18","v":0.26},{"$f":"L22","v":0},{"$f":"L26","v":0}]
[null,"EI_L","(kNm2)",{"$f":"Kold!M31","v":3756.9544470269357}]
[null,"EI_k","(kNm2)",{"$f":"Kold!M32","v":4504.4822103198303},null,null,null,null,"p1","L",{"$f":"D12","v":1.4},{"$f":"D16","v":0},{"$f":"D17","v":1.7},{"$f":"(M6-L6)*K6-O6","v":1.19},{"$f":"0.5*K6*(M6^2-L6^2)/$D$4","v":1.19},{"$f":"$N6*P$4-IF(P$4>$L6,0.5*($L6-P$4)^2*$K6)+IF(P$4>$M6,0.5*(P$4-$M6)^2*$K6)","v":0},{"$f":"$N6*Q$4-IF(Q$4>$L6,0.5*($L6-Q$4)^2*$K6)+IF(Q$4>$M6,0.5*(Q$4-$M6)^2*$K6)","v":4.9310624999999997E-2},9.6092499999999997E-2,0.140345625,0.18206999999999998,0.22126562499999997,0.25793250000000001,0.29207062499999997,0.32367999999999997,0.35276062499999994,0.37931249999999994,0.40333562499999998,0.42483000000000004,0.44379562499999992,0.46023249999999999,0.47414062499999993,0.48552000000000001,0.49437062499999995,{"$f":"$N6*AH$4-IF(AH$4>$L6,0.5*($L6-AH$4)^2*$K6)+IF(AH$4>$M6,0.5*(AH$4-$M6)^2*$K6)","v":0.50069249999999998},0.50448562500000005,0.50574999999999992,0.50448562500000005,0.50069249999999998,0.49437062499999995,0.48552000000000006,0.47414062500000009,0.46023249999999982,0.44379562500000003,0.42483000000000004,0.4033356250000002,0.37931249999999994,0.35276062499999994,0.32368000000000019,0.29207062500000003,0.25793250000000012,0.2212656249999998,0.18207000000000018,0.14034562499999992,9.6092500000000358E-2,4.9310625000000163E-2,0,0.26207999999999998,{"$f":"$N6*BF$4-IF(BF$4>$L6,0.5*($L6-BF$4)^2*$K6)+IF(BF$4>$M6,0.5*(BF$4-$M6)^2*$K6)","v":0},0]
[null,"u_L","(mm)",{"$f":"1000*MAX(P70:BD70)","v":1.6229648373467145},null,null,null,null,"p1","K",{"$f":"D13","v":1.4},{"$f":"D16","v":0},{"$f":"D17","v":1.7},{"$f":"(M7-L7)*K7-O7","v":1.19},{"$f":"0.5*K7*(M7^2-L7^2)/$D$4","v":1.19},{"$f":"$N7*P$4-IF(P$4>$L7,0.5*($L7-P$4)^2*$K7)+IF(P$4>$M7,0.5*(P$4-$M7)^2*$K7)","v":0},4.9310624999999997E-2,9.6092499999999997E-2,0.140345625,0.18206999999999998,0.22126562499999997,0.25793250000000001,0.29207062499999997,0.32367999999999997,0.35276062499999994,0.37931249999999994,0.40333562499999998,0.42483000000000004,0.44379562499999992,0.46023249999999999,0.47414062499999993,0.48552000000000001,0.49437062499999995,0.50069249999999998,0.50448562500000005,0.50574999999999992,0.50448562500000005,0.50069249999999998,0.49437062499999995,0.48552000000000006,0.47414062500000009,0.46023249999999982,0.44379562500000003,0.42483000000000004,0.4033356250000002,0.37931249999999994,0.35276062499999994,0.32368000000000019,0.29207062500000003,0.25793250000000012,0.2212656249999998,0.18207000000000018,0.14034562499999992,9.6092500000000358E-2,4.9310625000000163E-2,0,0.26207999999999998,0,0]
[null,"u_k","(mm)",{"$f":"1000*MAX(P74:BD74)","v":1.6229648373467145},null,null,null,null,"p1","d",{"$f":"D14","v":1.4},{"$f":"D16","v":0},{"$f":"D17","v":1.7},{"$f":"(M8-L8)*K8-O8","v":1.19},{"$f":"0.5*K8*(M8^2-L8^2)/$D$4","v":1.19},{"$f":"$N8*P$4-IF(P$4>$L8,0.5*($L8-P$4)^2*$K8)+IF(P$4>$M8,0.5*(P$4-$M8)^2*$K8)","v":0},4.9310624999999997E-2,9.6092499999999997E-2,0.140345625,0.18206999999999998,0.22126562499999997,0.25793250000000001,0.29207062499999997,0.32367999999999997,0.35276062499999994,0.37931249999999994,0.40333562499999998,0.42483000000000004,0.44379562499999992,0.46023249999999999,0.47414062499999993,0.48552000000000001,0.49437062499999995,0.50069249999999998,0.50448562500000005,0.50574999999999992,0.50448562500000005,0.50069249999999998,0.49437062499999995,0.48552000000000006,0.47414062500000009,0.46023249999999982,0.44379562500000003,0.42483000000000004,0.4033356250000002,0.37931249999999994,0.35276062499999994,0.32368000000000019,0.29207062500000003,0.25793250000000012,0.2212656249999998,0.18207000000000018,0.14034562499999992,9.6092500000000358E-2,4.9310625000000163E-2,0,0.26207999999999998,0,0]
[]
[null,null,null,null,null,null,null,null,"p2","L",{"$f":"E12","v":0},{"$f":"E16","v":0},{"$f":"E17","v":0},{"$f":"(M10-L10)*K10-O10","v":0},{"$f":"0.5*K10*(M10^2-L10^2)/$D$4","v":0},{"$f":"$N10*P$4-IF(P$4>$L10,0.5*($L10-P$4)^2*$K10)+IF(P$4>$M10,0.5*(P$4-$M10)^2*$K10)+IF(P$4>$D$4,(P$4-$D$4)*$O10)","v":0},0,0,0,0,0,0,0,0,0,0,0,0,0,0,0,0,0,0,0,0,0,0,0,0,0,0,0,0,0,0,0,0,0,0,0,0,0,0,0,0,0,0,0]
[null,"Jævnt fordelte laste",null,"p1","p2","p3",null,null,"p2","K",{"$f":"E13","v":0},{"$f":"E16","v":0},{"$f":"E17","v":0},{"$f":"(M11-L11)*K11-O11","v":0},{"$f":"0.5*K11*(M11^2-L11^2)/$D$4","v":0},{"$f":"$N11*P$4-IF(P$4>$L11,0.5*($L11-P$4)^2*$K11)+IF(P$4>$M11,0.5*(P$4-$M11)^2*$K11)+IF(P$4>$D$4,(P$4-$D$4)*$O11)","v":0},0,0,0,0,0,0,0,0,0,0,0,0,0,0,0,0,0,0,0,0,0,0,0,0,0,0,0,0,0,0,0,0,0,0,0,0,0,0,0,0,0,0,0]
[null,"Langtidsværdi","(kN/m)",{"$f":"Kold2!D87*D26","v":1.4},{"$f":"Kold2!E87*D26","v":0},{"$f":"Kold2!F87*D26","v":0},null,null,"p2","d",{"$f":"E14","v":0},{"$f":"E16","v":0},{"$f":"E17","v":0},{"$f":"(M12-L12)*K12-O12","v":0},{"$f":"0.5*K12*(M12^2-L12^2)/$D$4","v":0},{"$f":"$N12*P$4-IF(P$4>$L12,0.5*($L12-P$4)^2*$K12)+IF(P$4>$M12,0.5*(P$4-$M12)^2*$K12)+IF(P$4>$D$4,(P$4-$D$4)*$O12)","v":0},0,0,0,0,0,0,0,0,0,0,0,0,0,0,0,0,0,0,0,0,0,0,0,0,0,0,0,0,0,0,0,0,0,0,0,0,0,0,0,0,0,0,0]
[null,"Kar. værdi","(kN/m)",{"$f":"Kold2!D88*D26","v":1.4},{"$f":"Kold2!E88*D26","v":0},{"$f":"Kold2!F88*D26","v":0}]
[null,"Regnm. værdi","(kN/m)",{"$f":"Kold2!D89*D26","v":1.4},{"$f":"Kold2!E89*D26","v":0},{"$f":"Kold2!F89*D26","v":0},null,null,"p3","L",{"$f":"F12","v":0},{"$f":"F16","v":0},{"$f":"F17","v":0},{"$f":"(M14-L14)*K14-O14","v":0},{"$f":"0.5*K14*(M14^2-L14^2)/$D$4","v":0},{"$f":"$N14*P$4-IF(P$4>$L14,0.5*($L14-P$4)^2*$K14)+IF(P$4>$M14,0.5*(P$4-$M14)^2*$K14)+IF(P$4>$D$4,(P$4-$D$4)*$O14)","v":0},0,0,0,0,0,0,0,0,0,0,0,0,0,0,0,0,0,0,0,0,0,0,0,0,0,0,0,0,0,0,0,0,0,0,0,0,0,0,0,0,0,0,0]
[null,"exc","(m)",{"$f":"Kold2!D90","v":0},{"$f":"Kold2!E90","v":0},{"$f":"Kold2!F90","v":0},null,null,"p3","K",{"$f":"F13","v":0},{"$f":"F16","v":0},{"$f":"F17","v":0},{"$f":"(M15-L15)*K15-O15","v":0},{"$f":"0.5*K15*(M15^2-L15^2)/$D$4","v":0},{"$f":"$N15*P$4-IF(P$4>$L15,0.5*($L15-P$4)^2*$K15)+IF(P$4>$M15,0.5*(P$4-$M15)^2*$K15)+IF(P$4>$D$4,(P$4-$D$4)*$O15)","v":0},0,0,0,0,0,0,0,0,0,0,0,0,0,0,0,0,0,0,0,0,0,0,0,0,0,0,0,0,0,0,0,0,0,0,0,0,0,0,0,0,0,0,0]
[null,"x1","(m)",{"$f":"Kold2!D91","v":0},{"$f":"Kold2!E91","v":0},{"$f":"Kold2!F91","v":0},null,null,"p3","d",{"$f":"F14","v":0},{"$f":"F16","v":0},{"$f":"F17","v":0},{"$f":"(M16-L16)*K16-O16","v":0},{"$f":"0.5*K16*(M16^2-L16^2)/$D$4","v":0},{"$f":"$N16*P$4-IF(P$4>$L16,0.5*($L16-P$4)^2*$K16)+IF(P$4>$M16,0.5*(P$4-$M16)^2*$K16)+IF(P$4>$D$4,(P$4-$D$4)*$O16)","v":0},0,0,0,0,0,0,0,0,0,0,0,0,0,0,0,0,0,0,0,0,0,0,0,0,0,0,0,0,0,0,0,0,0,0,0,0,0,0,0,0,0,0,0]
[null,"x2","(m)",{"$f":"Kold2!D92","v":1.7},{"$f":"Kold2!E92","v":0},{"$f":"Kold2!F92","v":0}]
[null,null,null,null,null,null,null,null,"P1","L",{"$f":"D20","v":128},{"$f":"D24","v":0.26},null,{"$f":"K18-O18","v":108.4235294117647},{"$f":"K18*L18/$D$4","v":19.576470588235296},{"$f":"$N18*P$4-IF(P$4>$L18,(P$4-$L18)*$K18)","v":0},{"$f":"$N18*Q$4-IF(Q$4>$L18,(Q$4-$L18)*$K18)","v":4.6079999999999997},9.2159999999999993,13.824,18.431999999999999,23.04,27.648,27.456000000000003,26.624000000000002,25.792000000000002,24.96,24.128,23.295999999999999,22.463999999999999,21.632000000000005,20.799999999999997,19.968000000000004,19.135999999999996,18.304000000000002,17.472000000000008,16.64,15.808000000000007,14.975999999999999,14.144000000000005,13.311999999999998,12.480000000000004,11.647999999999996,10.816000000000003,9.9840000000000089,9.1519999999999868,8.3199999999999932,7.4879999999999995,6.6560000000000059,5.8239999999999839,4.9919999999999902,4.1599999999999966,3.328000000000003,2.4960000000000093,1.6640000000000157,0.83199999999999363,0,{"$f":"$N18*BE$4-IF(BE$4>$L18,(BE$4-$L18)*$K18)","v":28.190117647058823},0,0]
[null,"Punktlaste",null,"P1","P2","P3",null,null,"P1","K",{"$f":"D21","v":128},{"$f":"D24","v":0.26},null,{"$f":"K19-O19","v":108.4235294117647},{"$f":"K19*L19/$D$4","v":19.576470588235296},{"$f":"$N19*P$4-IF(P$4>$L19,(P$4-$L19)*$K19)","v":0},4.6079999999999997,9.2159999999999993,13.824,18.431999999999999,23.04,27.648,27.456000000000003,26.624000000000002,25.792000000000002,24.96,24.128,23.295999999999999,22.463999999999999,21.632000000000005,20.799999999999997,19.968000000000004,19.135999999999996,18.304000000000002,17.472000000000008,16.64,15.808000000000007,14.975999999999999,14.144000000000005,13.311999999999998,12.480000000000004,11.647999999999996,10.816000000000003,9.9840000000000089,9.1519999999999868,8.3199999999999932,7.4879999999999995,6.6560000000000059,5.8239999999999839,4.9919999999999902,4.1599999999999966,3.328000000000003,2.4960000000000093,1.6640000000000157,0.83199999999999363,0,28.190117647058823,0,0]
[null,"Langtidsværdi","(kN)",{"$f":"Kold2!H87*D26","v":128},{"$f":"Kold2!I87*D26","v":0},{"$f":"Kold2!J87*D26","v":0},null,null,"P1","d",{"$f":"D22","v":128},{"$f":"D24","v":0.26},null,{"$f":"K20-O20","v":108.4235294117647},{"$f":"K20*L20/$D$4","v":19.576470588235296},{"$f":"$N20*P$4-IF(P$4>$L20,(P$4-$L20)*$K20)","v":0},4.6079999999999997,9.2159999999999993,13.824,18.431999999999999,23.04,27.648,27.456000000000003,26.624000000000002,25.792000000000002,24.96,24.128,23.295999999999999,22.463999999999999,21.632000000000005,20.799999999999997,19.968000000000004,19.135999999999996,18.304000000000002,17.472000000000008,16.64,15.808000000000007,14.975999999999999,14.144000000000005,13.311999999999998,12.480000000000004,11.647999999999996,10.816000000000003,9.9840000000000089,9.1519999999999868,8.3199999999999932,7.4879999999999995,6.6560000000000059,5.8239999999999839,4.9919999999999902,4.1599999999999966,3.328000000000003,2.4960000000000093,1.6640000000000157,0.83199999999999363,0,28.190117647058823,0,0]
[null,"Kar. værdi","(kN)",{"$f":"Kold2!H88*D26","v":128},{"$f":"Kold2!I88*D26","v":0},{"$f":"Kold2!J88*D26","v":0}]
[null,"Regnm. værdi","(kN)",{"$f":"Kold2!H89*D26","v":128},{"$f":"Kold2!I89*D26","v":0},{"$f":"Kold2!J89*D26","v":0},null,null,"P2","L",{"$f":"E20","v":0},{"$f":"E24","v":0},null,{"$f":"K22-O22","v":0},{"$f":"K22*L22/$D$4","v":0},{"$f":"$N22*P$4-IF(P$4>$L22,(P$4-$L22)*$K22)","v":0},0,0,0,0,0,0,0,0,0,0,0,0,0,0,0,0,0,0,0,0,0,0,0,0,0,0,0,0,0,0,0,0,0,0,0,0,0,0,0,0,0,0,0]
[null,"exc","(m)",{"$f":"Kold2!H90","v":0},{"$f":"Kold2!I90","v":0},{"$f":"Kold2!J90","v":0},null,null,"P2","K",{"$f":"E21","v":0},{"$f":"E24","v":0},null,{"$f":"K23-O23","v":0},{"$f":"K23*L23/$D$4","v":0},{"$f":"$N23*P$4-IF(P$4>$L23,(P$4-$L23)*$K23)","v":0},0,0,0,0,0,0,0,0,0,0,0,0,0,0,0,0,0,0,0,0,0,0,0,0,0,0,0,0,0,0,0,0,0,0,0,0,0,0,0,0,0,0,0]
[null,"x","(m)",{"$f":"Kold2!H91","v":0.26},{"$f":"Kold2!I91","v":0},{"$f":"Kold2!J91","v":0},null,null,"P2","d",{"$f":"E22","v":0},{"$f":"E24","v":0},null,{"$f":"K24-O24","v":0},{"$f":"K24*L24/$D$4","v":0},{"$f":"$N24*P$4-IF(P$4>$L24,(P$4-$L24)*$K24)","v":0},0,0,0,0,0,0,0,0,0,0,0,0,0,0,0,0,0,0,0,0,0,0,0,0,0,0,0,0,0,0,0,0,0,0,0,0,0,0,0,0,0,0,0]
[]
[null,"Inddatatest",{"$f":"MAX(Kold!BE17:BE46)","v":0},{"$f":"IF(C26=1,0,1)","v":1},null,null,null,null,"P3","L",{"$f":"F20","v":0},{"$f":"F24","v":0},null,{"$f":"K26-O26","v":0},{"$f":"K26*L26/$D$4","v":0},{"$f":"$N26*P$4-IF(P$4>$L26,(P$4-$L26)*$K26)","v":0},0,0,0,0,0,0,0,0,0,0,0,0,0,0,0,{"$f":"$N26*AF$4-IF(AF$4>$L26,(AF$4-$L26)*$K26)","v":0},0,0,0,0,0,0,0,0,0,0,0,0,0,0,0,0,0,0,0,0,0,0,0,0,0,0,0]
[null,null,null,null,null,null,null,null,"P3","K",{"$f":"F21","v":0},{"$f":"F24","v":0},null,{"$f":"K27-O27","v":0},{"$f":"K27*L27/$D$4","v":0},{"$f":"$N27*P$4-IF(P$4>$L27,(P$4-$L27)*$K27)","v":0},{"$f":"$N27*Q$4-IF(Q$4>$L27,(Q$4-$L27)*$K27)","v":0},0,0,0,0,0,0,0,0,0,0,0,0,0,0,0,0,0,0,0,0,0,0,0,0,0,0,0,0,0,0,0,0,0,0,0,0,0,0,0,0,{"$f":"$N27*BF$4-IF(BF$4>$L27,(BF$4-$L27)*$K27)","v":0},{"$f":"$N27*BG$4-IF(BG$4>$L27,(BG$4-$L27)*$K27)","v":0}]
[null,null,null,null,null,null,null,null,"P3","d",{"$f":"F22","v":0},{"$f":"F24","v":0},null,{"$f":"K28-O28","v":0},{"$f":"K28*L28/$D$4","v":0},{"$f":"$N28*P$4-IF(P$4>$L28,(P$4-$L28)*$K28)","v":0},0,0,0,0,0,0,0,0,0,0,0,0,0,0,0,0,0,0,0,0,0,0,0,0,0,0,0,0,0,0,0,0,0,0,0,0,0,0,0,0,{"$f":"$N28*BE$4-IF(BE$4>$L28,(BE$4-$L28)*$K28)","v":0},{"$f":"$N28*BF$4-IF(BF$4>$L28,(BF$4-$L28)*$K28)","v":0},{"$f":"$N28*BG$4-IF(BG$4>$L28,(BG$4-$L28)*$K28)","v":0}]
[]
[null,null,null,null,null,null,null,null,"MOMENTER",null,null,null,null,null,"punkt",{"$f":"P3","v":0},{"$f":"Q3","v":1},2,3,4,5,6,7,8,9,10,11,12,13,14,15,16,17,18,19,20,21,22,23,24,25,26,27,28,29,30,31,32,33,34,35,36,37,38,39,40,{"$f":"BE4*40/$D$4","v":6.1176470588235299},{"$f":"BF4*40/$D$4","v":0},{"$f":"BG4*40/$D$4","v":0}]
[null,null,null,null,null,null,null,null,null,null,null,null,null,null," :    ",{"$f":"P6+P10+P14+P18+P22+P26","v":0},{"$f":"Q6+Q10+Q14+Q18+Q22+Q26","v":4.657310625},9.3120924999999986,13.964345625,18.614069999999998,23.261265625,27.905932499999999,27.748070625000004,26.947680000000002,26.144760625,25.339312500000002,24.531335625000001,23.720829999999999,22.907795624999999,22.092232500000005,21.274140624999998,{"$f":"AF6+AF10+AF14+AF18+AF22+AF26","v":20.453520000000005},19.630370624999994,18.804692500000002,17.976485625000009,17.14575,16.312485625000008,15.476692499999999,14.638370625000006,13.797519999999997,12.954140625000004,12.108232499999996,11.259795625000002,10.408830000000009,9.5553356249999872,8.6993124999999925,7.8407606249999997,6.9796800000000063,6.1160706249999839,5.2499324999999901,4.3812656249999966,3.5100700000000034,2.6363456250000095,1.760092500000016,0.8813106249999938,0,{"$f":"BE6+BE10+BE14+BE18+BE22+BE26","v":28.452197647058824},0,0]
[null,null,null,null,null,null,null,null,null,null,null,null,null,null," :    ",{"$f":"P7+P11+P15+P19+P23+P27","v":0},4.657310625,9.3120924999999986,13.964345625,18.614069999999998,23.261265625,27.905932499999999,27.748070625000004,26.947680000000002,26.144760625,25.339312500000002,24.531335625000001,23.720829999999999,22.907795624999999,22.092232500000005,21.274140624999998,{"$f":"AF7+AF11+AF15+AF19+AF23+AF27","v":20.453520000000005},19.630370624999994,18.804692500000002,17.976485625000009,17.14575,16.312485625000008,15.476692499999999,14.638370625000006,13.797519999999997,12.954140625000004,12.108232499999996,11.259795625000002,10.408830000000009,9.5553356249999872,8.6993124999999925,7.8407606249999997,6.9796800000000063,6.1160706249999839,5.2499324999999901,4.3812656249999966,3.5100700000000034,2.6363456250000095,1.760092500000016,0.8813106249999938,0,28.452197647058824,0,0]
[null,null,null,null,null,null,null,null,null,null,null,null,null,null," :    ",{"$f":"P8+P12+P16+P20+P24+P28","v":0},4.657310625,9.3120924999999986,13.964345625,18.614069999999998,23.261265625,27.905932499999999,27.748070625000004,26.947680000000002,26.144760625,25.339312500000002,24.531335625000001,23.720829999999999,22.907795624999999,22.092232500000005,21.274140624999998,{"$f":"AF8+AF12+AF16+AF20+AF24+AF28","v":20.453520000000005},19.630370624999994,18.804692500000002,17.976485625000009,17.14575,16.312485625000008,15.476692499999999,14.638370625000006,13.797519999999997,12.954140625000004,12.108232499999996,11.259795625000002,10.408830000000009,9.5553356249999872,8.6993124999999925,7.8407606249999997,6.9796800000000063,6.1160706249999839,5.2499324999999901,4.3812656249999966,3.5100700000000034,2.6363456250000095,1.760092500000016,0.8813106249999938,0,28.452197647058824,0,0]
[]
[null,null,null,null,null,null,null,null,null,null,"p/P","x1","x2",null,null,0,1,2,3,4,5,6,7,8,9,10,11,12,13,14,15,16,17,18,19,20,21,22,23,24,25,26,27,28,29,30,31,32,33,34,35,36,37,38,39,40,null,null,null,null,null,"hi cot 0","L-hi cot 0",null,"½hi cot 0","L-½hi cot 0"]
[null,null,null,null,null,null,null,null,null,null,null,null,null,null,null,0,{"$f":"Q35*($BD$4-$P$4)/40","v":4.2499999999999996E-2},8.4999999999999992E-2,0.1275,0.16999999999999998,0.21249999999999999,0.255,0.29749999999999999,0.33999999999999997,0.38249999999999995,0.42499999999999999,0.46749999999999997,0.51,0.55249999999999999,0.59499999999999997,0.63749999999999996,0.67999999999999994,0.72249999999999992,0.7649999999999999,0.80749999999999988,0.85,0.89249999999999985,0.93499999999999994,0.97750000000000004,1.02,1.0625,1.105,1.1475,1.19,1.2324999999999999,1.2749999999999999,1.3174999999999999,1.3599999999999999,1.4025000000000001,1.4449999999999998,1.4875,1.5299999999999998,1.5725,1.6149999999999998,1.6575,{"$f":"$D$4","v":1.7},0,{"$f":"Kold!K34*Kold!P15/1000","v":0.52342111137371761},{"$f":"BH36-Kold!K34*Kold!P15/1000","v":1.1765788886262825},{"$f":"Kold!M8","v":1.7},null,{"$f":"BF36","v":0.52342111137371761},{"$f":"BG36","v":1.1765788886262825},null,{"$f":"0.5*BJ36","v":0.2617105556868588},{"$f":"BH36-BM36","v":1.4382894443131411}]
[null,"Excentriciteter",null,null,null,null,null,null,"Venstresidig forskydning"]
[null,"exc. p_1","(mm)",{"$f":"D15","v":0},null,null,null,null,{"$f":"I8","v":"p1"},{"$f":"J8","v":"d"},{"$f":"K8","v":1.4},{"$f":"L8","v":0},{"$f":"M8","v":1.7},null,null,{"$f":"IF(P$36<=$L38,$K38*($M38-$L38)*($D$4-0.5*($L38+$M38))/$D$4,IF(P$36<=$M38,$K38*($M38-P$36)*($D$4-0.5*(P$36+$M38))/$D$4,0))","v":1.19},{"$f":"IF(Q$36<=$L38,$K38*($M38-$L38)*($D$4-0.5*($L38+$M38))/$D$4,IF(Q$36<=$M38,$K38*($M38-Q$36)*($D$4-0.5*(Q$36+$M38))/$D$4,0))","v":1.1312437499999999},1.0739749999999999,1.01819375,0.96390000000000009,0.91109375000000015,0.85977499999999973,0.80994374999999985,0.76159999999999983,0.7147437499999999,0.66937499999999994,0.62549374999999985,0.58309999999999995,0.54219374999999992,0.50277499999999997,0.46484375,0.42839999999999995,{"$f":"IF(AG$36<=$L38,$K38*($M38-$L38)*($D$4-0.5*($L38+$M38))/$D$4,IF(AG$36<=$M38,$K38*($M38-AG$36)*($D$4-0.5*(AG$36+$M38))/$D$4,0))","v":0.39344375000000004},0.35997500000000004,0.32799375000000003,0.29750000000000004,0.26849375000000009,0.24097500000000005,0.21494374999999988,0.19040000000000001,0.1673437499999999,0.14577500000000004,0.12569374999999994,0.10710000000000004,8.9993749999999956E-2,7.4375000000000038E-2,6.0243749999999985E-2,4.7600000000000052E-2,{"$f":"IF(AW$36<=$L38,$K38*($M38-$L38)*($D$4-0.5*($L38+$M38))/$D$4,IF(AW$36<=$M38,$K38*($M38-AW$36)*($D$4-0.5*(AW$36+$M38))/$D$4,0))","v":3.6443749999999969E-2},2.6775000000000045E-2,1.8593749999999985E-2,1.1900000000000036E-2,6.693749999999994E-3,2.9750000000000206E-3,7.4374999999999929E-4,0,null,null,null,null,null,{"$f":"IF(BJ$36<=$L38,$K38*($M38-$L38)*($D$4-0.5*($L38+$M38))/$D$4,IF(BJ$36<=$M38,$K38*($M38-BJ$36)*($D$4-0.5*(BJ$36+$M38))/$D$4,0))","v":0.57002148047808276},0.11281103640128728,null,{"$f":"IF(BM$36<=$L38,$K38*($M38-$L38)*($D$4-0.5*($L38+$M38))/$D$4,IF(BM$36<=$M38,$K38*($M38-BM$36)*($D$4-0.5*(BM$36+$M38))/$D$4,0))","v":0.85180798113871947},2.8202759100321807E-2]
[null,"exc. p_2","(mm)",{"$f":"E15","v":0},null,null,null,null,{"$f":"I12","v":"p2"},{"$f":"J12","v":"d"},{"$f":"K12","v":0},{"$f":"L12","v":0},{"$f":"M12","v":0},null,null,{"$f":"IF(P$36<=$L39,$K39*($M39-$L39)*($D$4-0.5*($L39+$M39))/$D$4,IF(P$36<=$M39,$K39*($M39-P$36)*($D$4-0.5*(P$36+$M39))/$D$4,0))","v":0},0,0,0,0,0,0,0,0,0,0,0,0,0,0,0,0,0,0,0,0,0,0,0,0,0,0,0,0,0,0,0,0,0,0,0,0,0,0,0,0,null,null,null,null,null,0,0,null,0,0]
[null,"exc. p_3","(mm)",{"$f":"F15","v":0},null,null,null,null,{"$f":"I16","v":"p3"},{"$f":"J16","v":"d"},{"$f":"K16","v":0},{"$f":"L16","v":0},{"$f":"M16","v":0},null,null,{"$f":"IF(P$36<=$L40,$K40*($M40-$L40)*($D$4-0.5*($L40+$M40))/$D$4,IF(P$36<=$M40,$K40*($M40-P$36)*($D$4-0.5*(P$36+$M40))/$D$4,0))","v":0},0,0,0,0,0,0,0,0,0,0,0,0,0,0,0,0,0,0,0,0,0,0,0,0,0,0,0,0,0,0,0,0,0,0,0,0,0,0,0,0,null,null,null,null,null,0,0,null,0,0]
[null,"exc. P_1","(mm)",{"$f":"D23","v":0},null,null,null,null,{"$f":"I20","v":"P1"},{"$f":"J20","v":"d"},{"$f":"K20","v":128},{"$f":"L20","v":0.26},{"$f":"M20","v":0},null,null,{"$f":"IF(P$36<=$L41,$K41*($D$4-$L41)/$D$4,0)","v":108.4235294117647},{"$f":"IF(Q$36<=$L41,$K41*($D$4-$L41)/$D$4,0)","v":108.4235294117647},108.4235294117647,108.4235294117647,108.4235294117647,108.4235294117647,108.4235294117647,0,0,0,0,0,0,0,0,0,0,{"$f":"IF(AG$36<=$L41,$K41*($D$4-$L41)/$D$4,0)","v":0},0,0,0,0,0,0,0,0,0,0,0,0,0,0,0,{"$f":"IF(AW$36<=$L41,$K41*($D$4-$L41)/$D$4,0)","v":0},0,0,0,0,0,0,0,null,null,null,null,null,{"$f":"IF(BJ$36<=$L41,$K41*($D$4-$L41)/$D$4,0)","v":0},0,null,{"$f":"IF(BM$36<=$L41,$K41*($D$4-$L41)/$D$4,0)","v":0},0]
[null,"exc. P_2","(mm)",{"$f":"E23","v":0},null,null,null,null,{"$f":"I24","v":"P2"},{"$f":"J24","v":"d"},{"$f":"K24","v":0},{"$f":"L24","v":0},{"$f":"M24","v":0},null,null,{"$f":"IF(P$36<=$L42,$K42*($D$4-$L42)/$D$4,0)","v":0},0,0,0,0,0,0,0,0,0,0,0,0,0,0,0,0,0,0,0,0,0,0,0,0,0,0,0,0,0,0,0,0,0,0,0,0,0,0,0,0,null,null,null,null,null,0,0,null,0,0]
[null,"exc. P_3","(mm)",{"$f":"F23","v":0},null,null,null,null,{"$f":"I28","v":"P3"},{"$f":"J28","v":"d"},{"$f":"K28","v":0},{"$f":"L28","v":0},{"$f":"M28","v":0},null,null,{"$f":"IF(P$36<=$L43,$K43*($D$4-$L43)/$D$4,0)","v":0},0,0,0,0,0,0,0,0,0,0,0,0,0,0,0,0,0,0,0,0,0,0,0,0,0,0,0,0,0,0,0,0,0,0,0,0,0,0,0,0,null,null,null,null,null,0,0,null,0,0]
[null,null,null,null,null,null,null,null,"Højresidig forskydning"]
[null,null,null,null,null,null,null,null,{"$f":"I38","v":"p1"},"d",1.4,0,1.7,null,null,{"$f":"IF(P$36<$L45,0,IF(P$36<$M45,$K45*(P$36-$L45)*0.5*($L45+P$36)/$D$4,$K45*($M45-$L45)*0.5*($L45+$M45)/$D$4))","v":0},{"$f":"IF(Q$36<$L45,0,IF(Q$36<$M45,$K45*(Q$36-$L45)*0.5*($L45+Q$36)/$D$4,$K45*($M45-$L45)*0.5*($L45+$M45)/$D$4))","v":7.4374999999999984E-4},2.9749999999999993E-3,6.6937499999999992E-3,1.1899999999999997E-2,1.8593749999999999E-2,2.6774999999999997E-2,3.6443749999999997E-2,4.759999999999999E-2,6.0243749999999978E-2,7.4374999999999997E-2,8.9993749999999997E-2,0.10709999999999999,0.12569374999999999,0.14577499999999999,0.16734374999999999,0.19039999999999996,{"$f":"IF(AG$36<$L45,0,IF(AG$36<$M45,$K45*(AG$36-$L45)*0.5*($L45+AG$36)/$D$4,$K45*($M45-$L45)*0.5*($L45+$M45)/$D$4))","v":0.21494374999999993},0.24097499999999991,0.26849374999999992,0.29749999999999999,0.32799374999999986,0.35997499999999999,0.39344375000000004,0.42839999999999995,0.46484375,0.50277499999999997,0.54219374999999992,0.58309999999999995,0.62549374999999985,0.66937499999999994,0.7147437499999999,0.76159999999999983,{"$f":"IF(AW$36<$L45,0,IF(AW$36<$M45,$K45*(AW$36-$L45)*0.5*($L45+AW$36)/$D$4,$K45*($M45-$L45)*0.5*($L45+$M45)/$D$4))","v":0.80994375000000007},0.85977499999999973,0.91109375000000015,0.96389999999999965,1.01819375,1.0739749999999997,1.1312437499999999,1.19,null,null,null,null,null,{"$f":"IF(BJ$36<$L45,0,IF(BJ$36<$M45,$K45*(BJ$36-$L45)*0.5*($L45+BJ$36)/$D$4,$K45*($M45-$L45)*0.5*($L45+$M45)/$D$4))","v":0.11281103640128728},0.57002148047808276,null,{"$f":"IF(BM$36<$L45,0,IF(BM$36<$M45,$K45*(BM$36-$L45)*0.5*($L45+BM$36)/$D$4,$K45*($M45-$L45)*0.5*($L45+$M45)/$D$4))","v":2.8202759100321821E-2},0.85180798113871947]
[null,null,null,null,null,null,null,null,"p2","d",0,0,0,null,null,{"$f":"IF(P$36<$L46,0,IF(P$36<$M46,$K46*(P$36-$L46)*0.5*($L46+P$36)/$D$4,$K46*($M46-$L46)*0.5*($L46+$M46)/$D$4))","v":0},0,0,0,0,0,0,0,0,0,0,0,0,0,0,0,0,0,0,0,0,0,0,0,0,0,0,0,0,0,0,0,0,0,0,0,0,0,0,0,0,null,null,null,null,null,0,0,null,0,0]
[null,null,null,null,null,null,null,null,"p3","d",0,0,0,null,null,{"$f":"IF(P$36<$L47,0,IF(P$36<$M47,$K47*(P$36-$L47)*0.5*($L47+P$36)/$D$4,$K47*($M47-$L47)*0.5*($L47+$M47)/$D$4))","v":0},0,0,0,0,0,0,0,0,0,0,0,0,0,0,0,0,0,0,0,0,0,0,0,0,0,0,0,0,0,0,0,0,0,0,0,0,0,0,0,0,null,null,null,null,null,0,0,null,0,0]
[null,null,null,null,null,null,null,null,"P1","d",128,0.26,0,null,null,{"$f":"IF(P$36<$L48,0,$K48*$L48/$D$4)","v":0},{"$f":"IF(Q$36<$L48,0,$K48*$L48/$D$4)","v":0},0,0,0,0,0,19.576470588235296,19.576470588235296,19.576470588235296,19.576470588235296,19.576470588235296,19.576470588235296,19.576470588235296,19.576470588235296,19.576470588235296,19.576470588235296,{"$f":"IF(AG$36<$L48,0,$K48*$L48/$D$4)","v":19.576470588235296},19.576470588235296,19.576470588235296,19.576470588235296,19.576470588235296,19.576470588235296,19.576470588235296,19.576470588235296,19.576470588235296,19.576470588235296,19.576470588235296,19.576470588235296,19.576470588235296,19.576470588235296,19.576470588235296,19.576470588235296,{"$f":"IF(AW$36<$L48,0,$K48*$L48/$D$4)","v":19.576470588235296},19.576470588235296,19.576470588235296,19.576470588235296,19.576470588235296,19.576470588235296,19.576470588235296,19.576470588235296,null,null,null,null,null,{"$f":"IF(BJ$36<$L48,0,$K48*$L48/$D$4)","v":19.576470588235296},19.576470588235296,null,{"$f":"IF(BM$36<$L48,0,$K48*$L48/$D$4)","v":19.576470588235296},19.576470588235296]
[null,null,null,null,null,null,null,null,{"$f":"I42","v":"P2"},"d",0,0,0,null,null,{"$f":"IF(P$36<$L49,0,$K49*$L49/$D$4)","v":0},0,0,0,0,0,0,0,0,0,0,0,0,0,0,0,0,0,0,0,0,0,0,0,0,0,0,0,0,0,0,0,0,0,0,0,0,0,0,0,0,null,null,null,null,null,0,0,null,0,0]
[null,null,null,null,null,null,null,null,"P3","d",0,0,0,null,null,{"$f":"IF(P$36<$L50,0,$K50*$L50/$D$4)","v":0},0,0,0,0,0,0,0,0,0,0,0,0,0,0,0,0,0,0,0,0,0,0,0,0,0,0,0,0,0,0,0,0,0,0,0,0,0,0,0,0,null,null,null,null,null,0,0,null,0,0]
[]
[null,null,null,null,null,null,null,null,"V_d - venstre",null,null,null,null,null,null,{"$f":"SUM(P38:P43)","v":109.6135294117647},{"$f":"SUM(Q38:Q43)","v":109.5547731617647},109.49750441176471,109.4417231617647,109.3874294117647,109.33462316176471,109.2833044117647,0.80994374999999985,0.76159999999999983,0.7147437499999999,0.66937499999999994,0.62549374999999985,0.58309999999999995,0.54219374999999992,0.50277499999999997,0.46484375,0.42839999999999995,0.39344375000000004,0.35997500000000004,0.32799375000000003,0.29750000000000004,0.26849375000000009,0.24097500000000005,0.21494374999999988,0.19040000000000001,0.1673437499999999,0.14577500000000004,0.12569374999999994,0.10710000000000004,8.9993749999999956E-2,7.4375000000000038E-2,6.0243749999999985E-2,4.7600000000000052E-2,3.6443749999999969E-2,2.6775000000000045E-2,1.8593749999999985E-2,1.1900000000000036E-2,6.693749999999994E-3,2.9750000000000206E-3,7.4374999999999929E-4,0,null,null,null,null,null,{"$f":"SUM(BJ38:BJ43)","v":0.57002148047808276},{"$f":"SUM(BK38:BK43)","v":0.11281103640128728},null,{"$f":"SUM(BM38:BM43)","v":0.85180798113871947},{"$f":"SUM(BN38:BN43)","v":2.8202759100321807E-2}]
[null,null,null,null,null,null,null,null,"V_d - højre",null,null,null,null,null,null,{"$f":"SUM(P45:P50)","v":0},{"$f":"SUM(Q45:Q50)","v":7.4374999999999984E-4},2.9749999999999993E-3,6.6937499999999992E-3,1.1899999999999997E-2,1.8593749999999999E-2,2.6774999999999997E-2,19.612914338235296,19.624070588235295,19.636714338235297,19.650845588235295,19.666464338235297,19.683570588235295,19.702164338235296,19.722245588235296,19.743814338235296,19.766870588235296,19.791414338235295,19.817445588235294,19.844964338235297,19.873970588235295,19.904464338235297,19.936445588235294,19.969914338235295,20.004870588235296,20.041314338235296,20.079245588235295,20.118664338235295,20.159570588235297,20.201964338235296,20.245845588235294,20.291214338235296,20.338070588235297,20.386414338235294,20.436245588235295,20.487564338235295,20.540370588235294,20.594664338235297,20.650445588235296,20.707714338235295,20.766470588235297,null,null,null,null,null,{"$f":"SUM(BJ45:BJ50)","v":19.689281624636582},{"$f":"SUM(BK45:BK50)","v":20.146492068713378},null,{"$f":"SUM(BM45:BM50)","v":19.604673347335616},{"$f":"SUM(BN45:BN50)","v":20.428278569374015}]
[]
[null,null,null,null,null,null,null,null,"FORSKYDNING",null,null,null,null,null,null,{"$f":"P35","v":0},{"$f":"Q35","v":1},2,3,4,5,6,7,8,9,10,11,12,13,14,15,16,17,18,19,20,21,22,23,24,25,26,27,28,29,30,31,32,33,34,35,36,37,38,39,40,{"$f":"BF55","v":12.31579085585218},{"$f":"40*BF36/Kold!$M$8","v":12.31579085585218},{"$f":"40*BG36/Kold!$M$8","v":27.684209144147825},{"$f":"BG55","v":27.684209144147825}]
[null,null,null,null,null,null,null,null,null,null,"fyd","d","a","hicot"," :             ",{"$f":"MAX(P53,P52)","v":109.6135294117647},{"$f":"MAX(Q53,Q52)","v":109.5547731617647},109.49750441176471,109.4417231617647,109.3874294117647,109.33462316176471,109.2833044117647,19.612914338235296,19.624070588235295,19.636714338235297,19.650845588235295,19.666464338235297,19.683570588235295,19.702164338235296,19.722245588235296,19.743814338235296,19.766870588235296,19.791414338235295,19.817445588235294,19.844964338235297,19.873970588235295,19.904464338235297,19.936445588235294,19.969914338235295,20.004870588235296,20.041314338235296,20.079245588235295,20.118664338235295,20.159570588235297,20.201964338235296,20.245845588235294,20.291214338235296,20.338070588235297,20.386414338235294,20.436245588235295,20.487564338235295,20.540370588235294,20.594664338235297,20.650445588235296,20.707714338235295,20.766470588235297]
[null,null,null,null,null,null,null,null,null,null,{"$f":"550/1.3","v":423.07692307692304},12,150,900," :             ",{"$f":"Kold!$P$31","v":82.218795911273816},{"$f":"Kold!$P$31","v":82.218795911273816},{"$f":"Kold!$P$31","v":82.218795911273816},{"$f":"Kold!$P$31","v":82.218795911273816},{"$f":"Kold!$P$31","v":82.218795911273816},{"$f":"Kold!$P$31","v":82.218795911273816},{"$f":"Kold!$P$31","v":82.218795911273816},{"$f":"Kold!$P$31","v":82.218795911273816},{"$f":"Kold!$P$31","v":82.218795911273816},{"$f":"Kold!$P$31","v":82.218795911273816},{"$f":"Kold!$P$31","v":82.218795911273816},{"$f":"Kold!$P$31","v":82.218795911273816},{"$f":"Kold!$P$31","v":82.218795911273816},{"$f":"Kold!$P$31","v":82.218795911273816},{"$f":"Kold!$P$31","v":82.218795911273816},{"$f":"Kold!$P$31","v":82.218795911273816},{"$f":"Kold!$P$31","v":82.218795911273816},{"$f":"Kold!$P$31","v":82.218795911273816},{"$f":"Kold!$P$31","v":82.218795911273816},{"$f":"Kold!$P$31","v":82.218795911273816},{"$f":"Kold!$P$31","v":82.218795911273816},{"$f":"Kold!$P$31","v":82.218795911273816},{"$f":"Kold!$P$31","v":82.218795911273816},{"$f":"Kold!$P$31","v":82.218795911273816},{"$f":"Kold!$P$31","v":82.218795911273816},{"$f":"Kold!$P$31","v":82.218795911273816},{"$f":"Kold!$P$31","v":82.218795911273816},{"$f":"Kold!$P$31","v":82.218795911273816},{"$f":"Kold!$P$31","v":82.218795911273816},{"$f":"Kold!$P$31","v":82.218795911273816},{"$f":"Kold!$P$31","v":82.218795911273816},{"$f":"Kold!$P$31","v":82.218795911273816},{"$f":"Kold!$P$31","v":82.218795911273816},{"$f":"Kold!$P$31","v":82.218795911273816},{"$f":"Kold!$P$31","v":82.218795911273816},{"$f":"Kold!$P$31","v":82.218795911273816},{"$f":"Kold!$P$31","v":82.218795911273816},{"$f":"Kold!$P$31","v":82.218795911273816},{"$f":"Kold!$P$31","v":82.218795911273816},{"$f":"Kold!$P$31","v":82.218795911273816},{"$f":"Kold!$P$31","v":82.218795911273816}]
[null,null,null,null,null,null,null,null,null,null,{"$f":"550/1.3","v":423.07692307692304},12,100,900," :             ",{"$f":"Kold!$P$32","v":82.218795911273816},{"$f":"Kold!$P$32","v":82.218795911273816},{"$f":"Kold!$P$32","v":82.218795911273816},{"$f":"Kold!$P$32","v":82.218795911273816},{"$f":"Kold!$P$32","v":82.218795911273816},{"$f":"Kold!$P$32","v":82.218795911273816},{"$f":"Kold!$P$32","v":82.218795911273816},{"$f":"Kold!$P$32","v":82.218795911273816},{"$f":"Kold!$P$32","v":82.218795911273816},{"$f":"Kold!$P$32","v":82.218795911273816},{"$f":"Kold!$P$32","v":82.218795911273816},{"$f":"Kold!$P$32","v":82.218795911273816},{"$f":"Kold!$P$32","v":82.218795911273816},{"$f":"Kold!$P$32","v":82.218795911273816},{"$f":"Kold!$P$32","v":82.218795911273816},{"$f":"Kold!$P$32","v":82.218795911273816},{"$f":"Kold!$P$32","v":82.218795911273816},{"$f":"Kold!$P$32","v":82.218795911273816},{"$f":"Kold!$P$32","v":82.218795911273816},{"$f":"Kold!$P$32","v":82.218795911273816},{"$f":"Kold!$P$32","v":82.218795911273816},{"$f":"Kold!$P$32","v":82.218795911273816},{"$f":"Kold!$P$32","v":82.218795911273816},{"$f":"Kold!$P$32","v":82.218795911273816},{"$f":"Kold!$P$32","v":82.218795911273816},{"$f":"Kold!$P$32","v":82.218795911273816},{"$f":"Kold!$P$32","v":82.218795911273816},{"$f":"Kold!$P$32","v":82.218795911273816},{"$f":"Kold!$P$32","v":82.218795911273816},{"$f":"Kold!$P$32","v":82.218795911273816},{"$f":"Kold!$P$32","v":82.218795911273816},{"$f":"Kold!$P$32","v":82.218795911273816},{"$f":"Kold!$P$32","v":82.218795911273816},{"$f":"Kold!$P$32","v":82.218795911273816},{"$f":"Kold!$P$32","v":82.218795911273816},{"$f":"Kold!$P$32","v":82.218795911273816},{"$f":"Kold!$P$32","v":82.218795911273816},{"$f":"Kold!$P$32","v":82.218795911273816},{"$f":"Kold!$P$32","v":82.218795911273816},{"$f":"Kold!$P$32","v":82.218795911273816},{"$f":"Kold!$P$32","v":82.218795911273816}]
[null,null,null,null,null,null,null,null,null,null,{"$f":"550/1.3","v":423.07692307692304},12,65,900," :             ",null,null,null,null,null,null,null,null,null,null,null,null,null,null,null,null,null,null,null,null,null,null,null,null,null,null,null,null,null,null,null,null,null,null,null,null,null,null,null,null,null,{"$f":"1.1*MAX(P56:BD56)","v":120.57488235294119},0,0,{"$f":"1.1*MAX(P56:BD56)","v":120.57488235294119}]
[null,null,null,null,null,null,null,null,null,null,null,null,null,null,null,null,null,null,null,0,null,null,null,0,null,null,null,0,null,null,null,0,null,null,null,0,null,null,null,0,null,null,null,0,null,null,null,0,null,null,null,0]
[null,null,null,null,null,null,null,null,"EXCENTRICITET",null,null,null,null,null,null,{"$f":"IF(P52>=P53,IF(P52=0,0,SUMPRODUCT($D$38:$D$43,P38:P43)/P52),IF(P53=0,0,SUMPRODUCT($D$38:$D$43,P45:P50)/P53))","v":0},{"$f":"IF(Q52>=Q53,IF(Q52=0,0,SUMPRODUCT($D$38:$D$43,Q38:Q43)/Q52),IF(Q53=0,0,SUMPRODUCT($D$38:$D$43,Q45:Q50)/Q53))","v":0},0,0,0,0,0,0,0,0,0,0,0,0,0,0,0,0,0,0,0,0,0,0,0,0,0,0,0,0,0,0,0,0,0,0,0,0,0,0,0]
[]
[]
[]
[null,null,null,null,null,null,null,null,null,null,null,null,null,null,null,0,1,2,3,4,5,6,7,8,9,10,11,12,13,14,15,16,17,18,19,20,21,22,23,24,25,26,27,28,29,30,31,32,33,34,35,36,37,38,39,40]
[null,null,null,null,null,null,null,null,"UDBØJNINGER",null,null,null,null,null,null,0,{"$f":"Q65*($BD$4-$P$4)/40","v":4.2499999999999996E-2},8.4999999999999992E-2,0.1275,0.16999999999999998,0.21249999999999999,0.255,0.29749999999999999,0.33999999999999997,0.38249999999999995,0.42499999999999999,0.46749999999999997,0.51,0.55249999999999999,0.59499999999999997,0.63749999999999996,0.67999999999999994,0.72249999999999992,0.7649999999999999,0.80749999999999988,0.85,0.89249999999999985,0.93499999999999994,0.97750000000000004,1.02,1.0625,1.105,1.1475,1.19,1.2324999999999999,1.2749999999999999,1.3174999999999999,1.3599999999999999,1.4025000000000001,1.4449999999999998,1.4875,1.5299999999999998,1.5725,1.6149999999999998,1.6575,{"$f":"$D$4","v":1.7}]
[]
[null,null,null,null,null,null,null,null,null,"L",null,null,null,null,"a1",0,{"$f":"P68+(0.5*(Q31+P31)/$D$5)*(Q66-P66)","v":2.6342574065429022E-5},{"$f":"Q68+(0.5*(R31+Q31)/$D$5)*(R66-Q66)","v":1.0535599320367861E-4},2.3701165129867382E-4,4.212809422343396E-4,6.5813525989460119E-4,9.4754599816338349E-4,1.2623349004728425E-3,1.5717037568615654E-3,1.8720040078199079E-3,2.1632070472317956E-3,2.4452842689811527E-3,2.7182070669519048E-3,2.9819468350279765E-3,3.2364749670932931E-3,3.4817628570317795E-3,3.7177818987273606E-3,3.9445034860639619E-3,4.161899012925508E-3,4.3699398731959242E-3,4.5685974607591363E-3,4.757843169499067E-3,4.9376483932996439E-3,5.1079845260447914E-3,5.2688229616184336E-3,5.4201350939044957E-3,5.5618923167869037E-3,5.6940660241495819E-3,5.8166276098764553E-3,5.9295484678514492E-3,6.0327999919584886E-3,6.1263535760814987E-3,6.2101806141044037E-3,6.2842524999111296E-3,6.3485406273856007E-3,6.403016390411743E-3,6.4476511828734807E-3,6.482416398654739E-3,6.5072834316394429E-3,6.5222236757115177E-3,{"$f":"BC68+(0.5*(BD31+BC31)/$D$5)*(BD66-BC66)","v":6.5272085247548885E-3}]
[null,null,null,null,null,null,null,null,null,null,null,null,null,null,"u1",0,{"$f":"P69+P68*(Q66-P66)+0.5*(0.5*(Q31+P31)/$D$5)*(Q66-P66)^2","v":5.5977969889036669E-7},3.3583742533589035E-6,1.0633686699033894E-5,2.4622404311610425E-5,4.7559998606850426E-5,8.1680725340582604E-5,1.2864069443660239E-4,1.8886401590495852E-4,2.6204280590443979E-4,3.4779104082428857E-4,4.4572148129381367E-4,5.5544567218239124E-4,6.7657394259946363E-4,8.0871540589454052E-4,9.5147795965719827E-4,1.1044682857170799E-3,1.2672918501438954E-3,1.4395529032474215E-3,1.6208544795775018E-3,1.8107983979240472E-3,2.0089852613170331E-3,2.215014457026506E-3,2.4284841565625761E-3,2.6489913156754192E-3,2.8761316743552813E-3,3.1094997568324734E-3,3.3486888715773735E-3,3.5932911113004265E-3,3.8428973529521446E-3,4.0970972577231059E-3,4.3554792710439553E-3,4.6176306225854053E-3,4.8831373262582366E-3,5.1515841802132912E-3,5.4225547668414857E-3,5.6956314527737955E-3,5.9703953888812708E-3,6.2464265102750204E-3,6.5233035363062297E-3,6.800603970566141E-3]
[null,null,null,null,null,null,null,null,null,null,null,null,null,null,"u2",0,{"$f":"-(Q69-Q65*$BD$69/40)","v":1.6945531956526314E-4},{"$f":"-(R69-R65*$BD$69/40)","v":3.3667182427494813E-4},4.9941161109342668E-4,6.5543799274500364E-4,8.0251549771391724E-4,9.3840987024433858E-4,1.0614650004124723E-3,1.1712567782082696E-3,1.268093087472942E-3,1.3523599518172466E-3,1.4244446106118751E-3,1.4847355189874512E-3,1.5336223478345326E-3,1.5714959838036089E-3,1.5987485293051046E-3,1.6157733025093763E-3,1.6229648373467145E-3,1.6207188835073421E-3,1.6094324064414151E-3,1.5895035873590233E-3,1.5613318232301911E-3,1.5253177267848714E-3,1.4818631265129554E-3,1.4313710666642655E-3,1.3742458072485567E-3,1.3108928240355188E-3,1.241718808554771E-3,1.1671316680958721E-3,1.0875405257083073E-3,1.0033557202015E-3,9.1498880614480395E-4,8.228525538675072E-4,7.2736094945882995E-4,6.2892919476792864E-4,5.2797370740388823E-4,4.2491212073573169E-4,3.2016328389240963E-4,2.1414726176281328E-4,1.072853349957572E-4,0]
[]
[null,null,null,null,null,null,null,null,null,"K",null,null,null,null,"a1",0,{"$f":"P72+(0.5*(Q32-Q31+P32-P31)/$D$6)*(Q66-P66)","v":0},0,0,0,0,0,0,0,0,0,0,0,0,0,0,0,0,0,0,0,0,0,0,0,0,0,0,0,0,0,0,0,0,0,0,0,0,0,0,0]
[null,null,null,null,null,null,null,null,null,null,null,null,null,null,"u1",0,{"$f":"P73+P72*(Q66-P66)+0.5*(0.5*(Q32-Q31+P32-P31)/$D$6)*(Q66-P66)^2","v":0},0,0,0,0,0,0,0,0,0,0,0,0,0,0,0,0,0,0,0,0,0,0,0,0,0,0,0,0,0,0,0,0,0,0,0,0,0,0,0]
[null,null,null,null,null,null,null,null,null,null,null,null,null,null,"u2",0,{"$f":"-(Q73-Q65*$BD$73/40)+Q70","v":1.6945531956526314E-4},{"$f":"-(R73-R65*$BD$73/40)+R70","v":3.3667182427494813E-4},4.9941161109342668E-4,6.5543799274500364E-4,8.0251549771391724E-4,9.3840987024433858E-4,1.0614650004124723E-3,1.1712567782082696E-3,1.268093087472942E-3,1.3523599518172466E-3,1.4244446106118751E-3,1.4847355189874512E-3,1.5336223478345326E-3,1.5714959838036089E-3,1.5987485293051046E-3,1.6157733025093763E-3,1.6229648373467145E-3,1.6207188835073421E-3,1.6094324064414151E-3,1.5895035873590233E-3,1.5613318232301911E-3,1.5253177267848714E-3,1.4818631265129554E-3,1.4313710666642655E-3,1.3742458072485567E-3,1.3108928240355188E-3,1.241718808554771E-3,1.1671316680958721E-3,1.0875405257083073E-3,1.0033557202015E-3,9.1498880614480395E-4,8.228525538675072E-4,7.2736094945882995E-4,6.2892919476792864E-4,5.2797370740388823E-4,4.2491212073573169E-4,3.2016328389240963E-4,2.1414726176281328E-4,1.072853349957572E-4,0]
[]
[]
[]
[null,null,"ϒg",{"$f":"Kold!H22","v":1},null,null,null,null,"Bøjlekapacitet"]
[null,null,"ϒq",{"$f":"Kold!I22","v":0},null,null,null,null,null,null,{"$f":"2*MAX(Kold!P31,Kold!P32)*Kold2!D4/(Kold2!D4-Kold!P15*Kold!K34/1000)^2","v":201.93329237214451},0,{"$f":"Kold!M8","v":1.7},null,null,{"$f":"IF(P$36<=$L79,$K79*($M79-$L79)*($D$4-0.5*($L79+$M79))/$D$4,IF(P$36<=$M79,$K79*($M79-P$36)*($D$4-0.5*(P$36+$M79))/$D$4,0))","v":171.64329851632283},{"$f":"IF(Q$36<=$L79,$K79*($M79-$L79)*($D$4-0.5*($L79+$M79))/$D$4,IF(Q$36<=$M79,$K79*($M79-Q$36)*($D$4-0.5*(Q$36+$M79))/$D$4,0))","v":163.16841065207939},{"$f":"IF(R$36<=$L79,$K79*($M79-$L79)*($D$4-0.5*($L79+$M79))/$D$4,IF(R$36<=$M79,$K79*($M79-R$36)*($D$4-0.5*(R$36+$M79))/$D$4,0))","v":154.90807691098135},146.86229729302872,139.03107179822149,131.41440042655967,124.01228317804321,116.82472005267221,109.85171105044658,103.09325617136638,96.549355415431592,90.220008782642182,84.105216272998177,78.204977886499591,72.519293623146396,67.048163482938605,61.791587465876226,56.749565571959245,51.922097801187661,47.309184153561489,42.910824629080707,38.727019227745345,34.75776794955538,31.003070794510794,27.46292776261166,24.137338853857887,21.026304068249551,18.129823405786592,15.447896866469064,12.980524450296908,10.727706157270186,8.6894419873888413,6.865731940652922,5.2565760170623825,3.8619742166172704,2.6819265393175424,1.7164329851632336,0.96549355415431515,0.42910824629081012,0.10727706157270168,0]
[null,null,"ψ1",{"$f":"Kold!J22","v":0},null,null,null,null,null,null,{"$f":"2*MAX(Kold!P31,Kold!P32)*Kold2!D4/(Kold2!D4-Kold!P15*Kold!K34/1000)^2","v":201.93329237214451},0,{"$f":"Kold!M8","v":1.7},null,null,{"$f":"IF(P$36<$L80,0,IF(P$36<$M80,$K80*(P$36-$L80)*0.5*($L80+P$36)/$D$4,$K80*($M80-$L80)*0.5*($L80+$M80)/$D$4))","v":0},{"$f":"IF(Q$36<$L80,0,IF(Q$36<$M80,$K80*(Q$36-$L80)*0.5*($L80+Q$36)/$D$4,$K80*($M80-$L80)*0.5*($L80+$M80)/$D$4))","v":0.10727706157270174},{"$f":"IF(R$36<$L80,0,IF(R$36<$M80,$K80*(R$36-$L80)*0.5*($L80+R$36)/$D$4,$K80*($M80-$L80)*0.5*($L80+$M80)/$D$4))","v":0.42910824629080696},0.96549355415431604,1.7164329851632278,2.6819265393175442,3.8619742166172641,5.2565760170623861,6.8657319406529114,8.6894419873888413,10.727706157270177,12.980524450296912,15.447896866469057,18.129823405786599,21.026304068249544,24.137338853857898,27.462927762611645,31.003070794510801,34.757767949555365,38.72701922774533,42.910824629080707,47.309184153561468,51.922097801187647,56.749565571959245,61.791587465876226,67.048163482938605,72.519293623146396,78.204977886499591,84.105216272998177,90.220008782642182,96.549355415431592,103.09325617136638,109.85171105044658,116.82472005267225,124.01228317804321,131.41440042655967,139.03107179822146,146.86229729302872,154.90807691098132,163.16841065207939,171.64329851632283]
[null,null,"ψ2",{"$f":"Kold!K22","v":0},null,null,null,null,{"$f":"MAX(Q81:BC81)","v":0},null,null,null,null,null,null,null,{"$f":"IF(Q56>MAX(Q79:Q80,Kold!$P$32,Kold!$P$31),1,0)","v":0},{"$f":"IF(R56>MAX(R79:R80,Kold!$P$32,Kold!$P$31),1,0)","v":0},{"$f":"IF(S56>MAX(S79:S80,Kold!$P$32,Kold!$P$31),1,0)","v":0},{"$f":"IF(T56>MAX(T79:T80,Kold!$P$32,Kold!$P$31),1,0)","v":0},{"$f":"IF(U56>MAX(U79:U80,Kold!$P$32,Kold!$P$31),1,0)","v":0},{"$f":"IF(V56>MAX(V79:V80,Kold!$P$32,Kold!$P$31),1,0)","v":0},{"$f":"IF(W56>MAX(W79:W80,Kold!$P$32,Kold!$P$31),1,0)","v":0},{"$f":"IF(X56>MAX(X79:X80,Kold!$P$32,Kold!$P$31),1,0)","v":0},{"$f":"IF(Y56>MAX(Y79:Y80,Kold!$P$32,Kold!$P$31),1,0)","v":0},{"$f":"IF(Z56>MAX(Z79:Z80,Kold!$P$32,Kold!$P$31),1,0)","v":0},{"$f":"IF(AA56>MAX(AA79:AA80,Kold!$P$32,Kold!$P$31),1,0)","v":0},{"$f":"IF(AB56>MAX(AB79:AB80,Kold!$P$32,Kold!$P$31),1,0)","v":0},{"$f":"IF(AC56>MAX(AC79:AC80,Kold!$P$32,Kold!$P$31),1,0)","v":0},{"$f":"IF(AD56>MAX(AD79:AD80,Kold!$P$32,Kold!$P$31),1,0)","v":0},{"$f":"IF(AE56>MAX(AE79:AE80,Kold!$P$32,Kold!$P$31),1,0)","v":0},{"$f":"IF(AF56>MAX(AF79:AF80,Kold!$P$32,Kold!$P$31),1,0)","v":0},{"$f":"IF(AG56>MAX(AG79:AG80,Kold!$P$32,Kold!$P$31),1,0)","v":0},{"$f":"IF(AH56>MAX(AH79:AH80,Kold!$P$32,Kold!$P$31),1,0)","v":0},{"$f":"IF(AI56>MAX(AI79:AI80,Kold!$P$32,Kold!$P$31),1,0)","v":0},{"$f":"IF(AJ56>MAX(AJ79:AJ80,Kold!$P$32,Kold!$P$31),1,0)","v":0},{"$f":"IF(AK56>MAX(AK79:AK80,Kold!$P$32,Kold!$P$31),1,0)","v":0},{"$f":"IF(AL56>MAX(AL79:AL80,Kold!$P$32,Kold!$P$31),1,0)","v":0},{"$f":"IF(AM56>MAX(AM79:AM80,Kold!$P$32,Kold!$P$31),1,0)","v":0},{"$f":"IF(AN56>MAX(AN79:AN80,Kold!$P$32,Kold!$P$31),1,0)","v":0},{"$f":"IF(AO56>MAX(AO79:AO80,Kold!$P$32,Kold!$P$31),1,0)","v":0},{"$f":"IF(AP56>MAX(AP79:AP80,Kold!$P$32,Kold!$P$31),1,0)","v":0},{"$f":"IF(AQ56>MAX(AQ79:AQ80,Kold!$P$32,Kold!$P$31),1,0)","v":0},{"$f":"IF(AR56>MAX(AR79:AR80,Kold!$P$32,Kold!$P$31),1,0)","v":0},{"$f":"IF(AS56>MAX(AS79:AS80,Kold!$P$32,Kold!$P$31),1,0)","v":0},{"$f":"IF(AT56>MAX(AT79:AT80,Kold!$P$32,Kold!$P$31),1,0)","v":0},{"$f":"IF(AU56>MAX(AU79:AU80,Kold!$P$32,Kold!$P$31),1,0)","v":0},{"$f":"IF(AV56>MAX(AV79:AV80,Kold!$P$32,Kold!$P$31),1,0)","v":0},{"$f":"IF(AW56>MAX(AW79:AW80,Kold!$P$32,Kold!$P$31),1,0)","v":0},{"$f":"IF(AX56>MAX(AX79:AX80,Kold!$P$32,Kold!$P$31),1,0)","v":0},{"$f":"IF(AY56>MAX(AY79:AY80,Kold!$P$32,Kold!$P$31),1,0)","v":0},{"$f":"IF(AZ56>MAX(AZ79:AZ80,Kold!$P$32,Kold!$P$31),1,0)","v":0},{"$f":"IF(BA56>MAX(BA79:BA80,Kold!$P$32,Kold!$P$31),1,0)","v":0},{"$f":"IF(BB56>MAX(BB79:BB80,Kold!$P$32,Kold!$P$31),1,0)","v":0},{"$f":"IF(BC56>MAX(BC79:BC80,Kold!$P$32,Kold!$P$31),1,0)","v":0}]
[]
[]
[]
[null,null,"Jævnt fordelte laste",null,null,null,"Punktlaste"]
[null,null,null,"p1","p2","p3",null,"P1","P2","P3"]
[null,"Langtidsværdi","(kN/m)",{"$f":"B95+C95*J95","v":1.4},{"$f":"B96+C96*J96","v":0},{"$f":"B97+C97*J97","v":0},"(kN)",{"$f":"B99+C99*J99","v":128},{"$f":"B100+C100*J100","v":0},{"$f":"B101+C101*J101","v":0}]
[null,"Kar. værdi","(kN/m)",{"$f":"B95+C95","v":1.4},{"$f":"B96+C96","v":0},{"$f":"B97+C97","v":0},"(kN)",{"$f":"B99+C99","v":128},{"$f":"B100+C100","v":0},{"$f":"B101+C101","v":0}]
[null,"Regnm. værdi","(kN/m)",{"$f":"G95*B95+C95*H95","v":1.4},{"$f":"G96*B96+C96*H96","v":0},{"$f":"G97*B97+C97*H97","v":0},"(kN)",{"$f":"G99*B99+C99*H99","v":128},{"$f":"G100*B100+C100*H100","v":0},{"$f":"G101*B101+C101*H101","v":0}]
[null,"Excentricitet, exc.","(mm)",{"$f":"Kold!E22","v":0},{"$f":"Kold!E23","v":0},{"$f":"Kold!E24","v":0},"(mm)",{"$f":"Kold!E26","v":0},{"$f":"Kold!E27","v":0},{"$f":"Kold!E28","v":0}]
[null,"x1","(m)",{"$f":"Kold!F22","v":0},{"$f":"Kold!F23","v":0},{"$f":"Kold!F24","v":0},"(m)",{"$f":"Kold!F26","v":0.26},{"$f":"Kold!F27","v":0},{"$f":"Kold!F28","v":0}]
[null,"x2","(m)",{"$f":"Kold!G22","v":1.7},{"$f":"Kold!G23","v":0},{"$f":"Kold!G24","v":0}]
[]
[{"$f":"Kold!B21","v":"Lastparametre:"},{"$f":"Kold!C21","v":"gk [kN/m]"},{"$f":"Kold!D21","v":"qk [kN/m]"},{"$f":"Kold!E21","v":"e [mm]"},{"$f":"Kold!F21","v":"x1 [m]"},{"$f":"Kold!G21","v":"x2 [m]"},{"$f":"Kold!H21","v":"ϒg"},{"$f":"Kold!I21","v":"ϒq"},{"$f":"Kold!J21","v":"ψ1"},{"$f":"Kold!K21","v":"ψ2"}]
[{"$f":"Kold!B22","v":"p1"},{"$f":"Kold!C22","v":1.4},{"$f":"Kold!D22","v":0},{"$f":"Kold!E22","v":0},{"$f":"Kold!F22","v":0},{"$f":"Kold!G22","v":1.7},{"$f":"Kold!H22","v":1},{"$f":"Kold!I22","v":0},{"$f":"Kold!J22","v":0},{"$f":"Kold!K22","v":0}]
[{"$f":"Kold!B23","v":"p2"},{"$f":"Kold!C23","v":0},{"$f":"Kold!D23","v":0},{"$f":"Kold!E23","v":0},{"$f":"Kold!F23","v":0},{"$f":"Kold!G23","v":0},{"$f":"Kold!H23","v":1},{"$f":"Kold!I23","v":1.5},{"$f":"Kold!J23","v":0.6},{"$f":"Kold!K23","v":0.5}]
[{"$f":"Kold!B24","v":"p3"},{"$f":"Kold!C24","v":0},{"$f":"Kold!D24","v":0},{"$f":"Kold!E24","v":0},{"$f":"Kold!F24","v":0},{"$f":"Kold!G24","v":0},{"$f":"Kold!H24","v":1},{"$f":"Kold!I24","v":1.5},{"$f":"Kold!J24","v":0.6},{"$f":"Kold!K24","v":0.5}]
[{"$f":"Kold!B25","v":0},{"$f":"Kold!C25","v":"Gk [kN]"},{"$f":"Kold!D25","v":"Qk [kN]"},{"$f":"Kold!E25","v":"e [mm]"},{"$f":"Kold!F25","v":"x1 [m]"},{"$f":"Kold!G25","v":0}]
[{"$f":"Kold!B26","v":"P1"},{"$f":"Kold!C26","v":128},{"$f":"Kold!D26","v":0},{"$f":"Kold!E26","v":0},{"$f":"Kold!F26","v":0.26},{"$f":"Kold!G26","v":0},{"$f":"Kold!H26","v":1},{"$f":"Kold!I26","v":1.5},{"$f":"Kold!J26","v":0.6},{"$f":"Kold!K26","v":0.5}]
[{"$f":"Kold!B27","v":"P2"},{"$f":"Kold!C27","v":0},{"$f":"Kold!D27","v":0},{"$f":"Kold!E27","v":0},{"$f":"Kold!F27","v":0},{"$f":"Kold!G27","v":0},{"$f":"Kold!H27","v":1},{"$f":"Kold!I27","v":1.5},{"$f":"Kold!J27","v":0.6},{"$f":"Kold!K27","v":0.5}]
[{"$f":"Kold!B28","v":"P3"},{"$f":"Kold!C28","v":0},{"$f":"Kold!D28","v":0},{"$f":"Kold!E28","v":0},{"$f":"Kold!F28","v":0},{"$f":"Kold!G28","v":0},{"$f":"Kold!H28","v":1},{"$f":"Kold!I28","v":1.5},{"$f":"Kold!J28","v":0.6},{"$f":"Kold!K28","v":0.5}]

{"sheet":"Brand","index":2,"n_rows":66,"n_cols":213,"rows_kept":66,"cut":false,"hidden":false,"merged":[[34,2,34,14],[35,2,35,14],[36,2,36,14],[28,8,28,9],[30,16,31,19],[28,2,28,4],[28,5,28,7],[2,10,5,14],[4,8,4,9],[4,2,4,6],[1,10,1,11],[1,12,1,14],[1,2,1,9],[2,8,2,9],[3,8,3,9],[2,2,2,6],[3,2,3,6]]}
[]
[null,"Bruger:",{"$f":"Kold!D2","v":0},null,null,null,null,null,null,null,{"$f":"Kold!L2","v":"Bjælkeberegning"},null,{"$f":"Kold!N2","v":" Betonelement-Foreningen maj 2021"}]
[null,"Sagsnavn:",{"$f":"Kold!D3","v":0},null,null,null,null,"Sag nr.:",{"$f":"Kold!J3","v":0},null,{"$f":"BD15","v":"M_d > M_ud  !"},null,null,null,null,null,null,null,null,null,null,null,null,null,null,null,null,null,null,null,null,null,null,null,null,null,null,null,null,null,null,null,null,null,2]
[null,"Bygningsdel:",{"$f":"Kold!D4","v":0},null,null,null,null,"Dato:",{"$f":"Kold!J4","v":"00:00:00"},null,null,null,null,null,null,null,null,null,null,null,null,null,null,null,null,null,null,null,null,null,null,null,null,null,null,null,null,null,null,null,null,null,null,null,"Tilslag: Kvartsholdigt"]
[null,"Emne:","Brandlastkombinationer",null,null,null,null,"Init:",{"$f":"Kold!J5","v":0},null,null,null,null,null,null,null,null,null,null,null,null,null,null,null,null,null,null,null,null,null,null,null,null,null,null,null,null,null,null,null,null,null,null,null,"Tilslag: Søsand / granit"]
[]
[null,null,null,null,null,null,null,null,null,null,"Spændvidde",null,"Tværsnit","h",{"$f":"Kold!P7","v":400}]
[null,null,null,null,null,null,null,null,null,null,"L",{"$f":"Kold!M8","v":1.7},null,"b",{"$f":"Kold!P8","v":150},null,null,null,null,null,null,null,null,null,null,null,null,null,null,null,null,null,null,null,null,null,null,null,null,null,null,null,null,null,null,null,null,null,null,null,null,null,null,null,null,null,null,null,null,"BRUDLAST, MOMENTKAPACITET"]
[null,null,null,null,null,null,null,null,null,null,"Længdearmering                c' =",null,{"$f":"Kold!N9","v":37},"beff",{"$f":"Kold!P9","v":150},null,null,null,null,null,null,null,null,null,null,null,null,null,null,null,null,null,null,null,null,null,null,null,null,null,null,null,null,"A_1",{"$f":"O11*0.25*PI()*M11^2","v":157.07963267948966},"mm2",null,null,"a","y","EI","s_b","s_o","s_2","s_3","s_m","w",null,null,"L","h","b","fck","fcd","Ecd","Ac","ac","Esc","fyd_c","At","at","Est","fyd_t","At","at","Est","fyd_t","Modenhed","1+f","uterm","   emax","e1","k","Tilstand:","Nf",null,null,null,null,null,null,null,null,null,null,null,null,null,null,null,null,null,null,null,null,null,null,null,null,null,null,null,null,null,null,null,null,null,null,null,null,null,null,null,null,null,null,null,null,null,null,null,null,null,null,null,null,null,null,null,null,null,null,null,null,null,null,null,null,null,null,null,null,null,null,null,null,null,null,null,null,null,null,null,null,null,null,null,null,null,null,null,null,null,null,null,null,null,null,null,null,null,null,null,null,null,null,null,null,null,null,null,null,null,null,null,null,null,null,null,null,null,null,null,null,null,null,null,{"$f":"Makro!A20","v":1000000},null,null,"Bruger skal registreres",1]
[null,null,null,null,null,null,null,null,null,null,null,null,"d (mm)","c (mm)","antal",null,null,null,null,null,null,null,null,null,null,null,null,null,null,null,null,null,null,null,null,null,null,null,null,null,null,null,null,"A_2",{"$f":"O12*0.25*PI()*M12^2","v":0},"mm2",null,"Langtid","\"-\"","\"-\"","\"-\"","\"-\"","\"-\"","\"-\"","\"-\"","\"-\"","\"-\"",null,null,"(m)","(m)","(m)","(Mpa)","(Mpa)","(Mpa)","(m2)","(m)","(Mpa)","(Mpa)","(m2)","(m)","(Mpa)","(Mpa)","(m2)","(m)","(Mpa)","(Mpa)","(døgn)",null,"(m)"]
[null,null,null,null,null,null,null,null,null,null,"Tryklag   t",null,{"$f":"Kold!N11","v":10},{"$f":"Kold!O11","v":36},{"$f":"Kold!P11","v":2},null,null,null,null,null,null,null,null,null,null,null,null,null,null,null,null,null,null,null,null,null,null,null,null,null,null,null,null,"A_3",{"$f":"O13*0.25*PI()*M13^2","v":226.1946710584651},"mm2",null,"Korttid","\"-\"","\"-\"","\"-\"","\"-\"","\"-\"","\"-\"","\"-\"","\"-\"","\"-\"",null,null,{"$f":"L8","v":1.7},{"$f":"AT32/1000","v":0.38238213203555638},{"$f":"AT33/1000","v":0.11476426407111269},{"$f":"L21","v":35},{"$f":"AT28","v":35},{"$f":"22000*((BK11+8)/10)^0.3/L18","v":34077.14619918933},{"$f":"AS9/1000000","v":1.5707963267948965E-4},{"$f":"AT34/1000","v":3.5999999999999997E-2},{"$f":"AT24*200000","v":198872.05455951556},{"$f":"AS24*O18/L19","v":455.90068199394437},{"$f":"AS11/1000000","v":2.261946710584651E-4},{"$f":"AT36/1000","v":1.9382132035556346E-2},{"$f":"AT26*200000","v":180365.88997710633},{"$f":"AS26*O18/L19","v":350.64933374609507},{"$f":"AS10/1000000","v":0},{"$f":"AT35/1000","v":-1.7617867964443656E-2},{"$f":"AT25*200000","v":200000},{"$f":"AS25*O19","v":500},null,1,0,{"$f":"IF(CF11=1,Kold!CE11,MIN(2*CD11,Firsidig!$G$21))","v":7.8067863401497552E-3},{"$f":"IF(CF11=1,Kold!CF11,Firsidig!$F$21)","v":3.9033931700748776E-3},{"$f":"Kold!CG11","v":2.2964539096862753},{"$f":"IF(AND(L23>0.1,MAX(AT38:AT40)>0),-1,1)","v":-1},0]
[null,null,null,null,null,null,null,null,null,null,"Træklag 1",null,{"$f":"Kold!N12","v":0},{"$f":"Kold!O12","v":0},{"$f":"Kold!P12","v":0},null,null,null,null,null,null,null,null,null,null,null,null,null,null,null,null,null,null,null,null,null,null,null,null,null,null,null,null,"E_sk",200000,"Mpa",null,"Kar. last",null,null,null,"\"-\"","\"-\"","\"-\"","\"-\"","\"-\"","\"-\"",null,null,"hc","e0","a'","b'","N'","tN'","t'","Nc","sac","Nac","sat","Nat","sat","Nat","Mtot","N","N","A","B1","B2","B2'","B3","C1","C2","C2'"]
[null,null,null,null,null,null,null,null,null,null,"Træklag 2",null,{"$f":"Kold!N13","v":12},{"$f":"Kold!O13","v":37},{"$f":"Kold!P13","v":2},null,null,null,null,null,null,null,null,null,null,null,null,null,null,null,null,null,null,null,null,null,null,null,null,null,null,null,null,"E_sd",{"$f":"AS12/L19","v":200000},"MPa"]
[null,null,null,null,null,null,null,null,null,null,"Bøjler",null,"d (mm)","a (mm)","cotq",null,null,null,null,null,null,null,null,null,null,null,null,null,null,null,null,null,null,null,null,null,null,null,null,null,null,null,null,"c_w",{"$f":"(AS11*AT36+AS10*AT35)/(AS10+AS11)","v":19.382132035556346},null,null,null,null,null,null,null,null,null,null,null,null,null,null,{"$f":"0.5*(-(BZ14+CA14+CB14+CC14)+SQRT(MAX((BZ14+CA14+CB14+CC14)^2+4*BY14*(CD14+CE14+CF14),0)))/BY14","v":0.10466081142035041},{"$f":"0.025*$CC$11","v":1.9516965850374388E-4},{"$f":"IF($CF$11=1,BI14/($CE$11*$CD$11),2^(1/3)*$CD$11/BI14)","v":25.198420997897465},{"$f":"IF($CF$11=1,-($CE$11-2)*BI14/$CD$11,3*($CD$11/BI14)^2)","v":1200},{"$f":"IF(CF$11=1,0.5*(CE$11*BI14*BL$11/CD$11)*(1-CG13^2+(BJ14-BK14)*(BK14^2*(1-CG13^2)+2*BK14*(1-CG13)+2*LN((1-BK14)/(1-BK14*CG13)))/(BK14^3)),BL$11*BK14*(LN((1-BJ14+BJ14^2)/(1+BJ14)^2)/(6*BJ14)+ATAN((2-BJ14)/(BJ14*3^0.5))/(BJ14*3^0.5)-LN((CG13^2-BJ14*CG13+BJ14^2)/(CG13+BJ14)^2)/(6*BJ14)-ATAN((2*CG13-BJ14)/(BJ14*3^0.5))/(BJ14*3^0.5)))","v":1.3124671887816339},{"$f":"IF(CF$11=1,(CE$11*BI14*BL$11/CD$11)*(1-CG13^3-(BJ14-BK14)*(-2*BK14^3*(1-CG13^3)-3*BK14^2*(1-CG13^2)-6*BK14*(1-CG13)-6*LN((1-BK14)/(1-BK14*CG13)))/(2*BK14^4))/3,BL$11*BK14*(LN((1+BJ14^3)/(BJ14^3+CG13^3)))/3)","v":0.8749726573903388},{"$f":"BM14/BL14","v":0.66666250011368111},{"$f":"BL14*BH14*BJ$11","v":1.5764464706085213E-2},{"$f":"MAX(MIN(BQ$11,CA$11*BP$11*BI14*(BH14-BO$11)/BH14),-BQ$11)","v":25.463077788430006},{"$f":"BP14*BN$11","v":3.9997309058958574E-3},{"$f":"MIN(BU$11,CA$11*BT$11*BI14*(BI$11-BH14-BS$11)/BH14)","v":86.890621781717428},{"$f":"BR14*BR$11","v":1.9654195611981076E-2},{"$f":"MIN($BY$11,CA$11*$BX$11*BI14*(BI$11-BH14-$BW$11)/BH14)","v":110.14867512608481},{"$f":"BT14*$BV$11","v":0},{"$f":"(0.5*BI$11-BH14+BN14*BH14)*BO14+(0.5*BI$11-BO$11)*BQ14+(0.5*BI$11-BS$11)*BS14+(0.5*BI$11-BW$11)*BU14","v":6.4615329480639996E-3},{"$f":"BO14+BQ14-BS14-BU14","v":1.0999999999999552E-4},{"$f":"$CG$11+0.00001","v":1.0000000000000001E-5},{"$f":"BL14*BJ$11","v":0.15062433103800635},{"$f":"IF(BP13<BQ$11,CA$11*BI14*BN$11*BP$11,BN$11*BQ$11)","v":6.0968560291444519E-3},{"$f":"IF(BR13<BU$11,CA$11*BI14*BR$11*BT$11,-BR$11*BU$11)","v":7.9624933091791486E-3},{"$f":"IF(BT13<BY$11,CA$11*BI14*$BV$11*$BX$11,-$BV$11*BY$11)","v":0},{"$f":"-(BX14+0.0001)","v":-1.1E-4},{"$f":"IF(BP13<BQ$11,BO$11*CA$11*BI14*BN$11*BP$11,0)","v":2.1948681704920026E-4},{"$f":"IF(BR13<BU$11,(BI$11-BS$11)*CA$11*BI14*BR$11*BT$11,0)","v":2.8903850712320308E-3},{"$f":"IF(BT13<BY$11,(BI$11-$BW$11)*CA$11*BI14*$BV$11*$BX$11,0)","v":0},{"$f":"IF(BV14>BV13,BI14,CG13)","v":1.9516965850374388E-4},{"$f":"IF(BV14>BV13,BP14,CH13)","v":25.463077788430006},{"$f":"IF(BV14>BV13,BR14,CI13)","v":86.890621781717428},{"$f":"IF(BV14>BV13,BT14,CJ13)","v":110.14867512608481}]
[null,null,null,null,null,null,null,null,null,null,"Type 1",null,{"$f":"Kold!N15","v":6},{"$f":"Kold!O15","v":150},2.5,null,null,null,null,null,null,null,null,null,null,null,null,null,null,null,null,null,null,null,null,null,null,null,null,null,null,null,null,"a_w",{"$f":"AS14*2*AT33/(O12*M12+O13*M13)","v":185.3646765991468},null,null,"Fejltabel",null,null,null,null,null,null,"Fejl",{"$f":"BD16&BD17&BD18&BD19&BD20&BD21&BD22&BD23&BD24&BD25&BD26&BD27&BD28&BD29&BD30&BD31&BD32&BD33&BD34&BD35&BD36&BD37&BD38&BD39&BD40&BD41&BD42&BD43&BD44&BD45","v":"M_d > M_ud  !"},"NB'er",null,null,{"$f":"0.5*(-(BZ15+CA15+CB15+CC15)+SQRT(MAX((BZ15+CA15+CB15+CC15)^2+4*BY15*(CD15+CE15+CF15),0)))/BY15","v":0.10454066904374333},{"$f":"0.025*$CC$11+BI14","v":3.9033931700748777E-4},12.599210498948732,300,2.6244750640134744,1.7495626457652698,{"$f":"BM15/BL15","v":0.66663336594623757},3.1487226052511669E-2,50.895469214772923,7.9946416093068049E-3,174.06187103162094,3.9371867661818473E-2,220.64024365617331,{"$f":"BT15*$BV$11","v":0},1.2927870372109126E-2,{"$f":"BO15+BQ15-BS15-BU15","v":1.0999999999999899E-4},1.0000000000000001E-5,0.30119594929449278,{"$f":"IF(2*BP14-BP13<BQ$11,CA$11*BI15*BN$11*BP$11,BN$11*BQ$11)","v":1.2193712058288904E-2},{"$f":"IF(2*BR14-BR13<BU$11,CA$11*BI15*BR$11*BT$11,-BR$11*BU$11)","v":1.5924986618358297E-2},{"$f":"IF(2*BT14-BT13<BY$11,CA$11*BI15*$BV$11*$BX$11,-$BV$11*BY$11)","v":0},{"$f":"-(BX15+0.0001)","v":-1.1E-4},{"$f":"IF(2*BP14-BP13<BQ$11,BO$11*CA$11*BI15*BN$11*BP$11,0)","v":4.3897363409840052E-4},{"$f":"IF(2*BR14-BR13<BU$11,(BI$11-BS$11)*CA$11*BI15*BR$11*BT$11,0)","v":5.7807701424640616E-3},{"$f":"IF(2*BT14-BT13<BY$11,(BI$11-$BW$11)*CA$11*BI15*$BV$11*$BX$11,0)","v":0},3.9033931700748777E-4,50.895469214772923,174.06187103162094,{"$f":"IF(BV15>BV14,BT15,CJ14)","v":220.64024365617331}]
[null,null,null,null,null,null,null,null,null,null,"Type 2",null,{"$f":"Kold!N16","v":6},{"$f":"Kold!O16","v":150},{"$f":"O15","v":2.5},null,null,null,null,null,null,null,null,null,null,null,null,null,null,null,null,null,null,null,null,null,null,null,null,null,null,null,null,"h_int",{"$f":"O7-BH56*(1-BN56)*1000-(AS10*N12+AS11*N13)/(AS10+AS11)","v":349.92270595491749},"mm",null,"Negative inddata accepteres ikke; ",null,null,null,null,null,null,{"$f":"IF(MIN(O15,L18,L19,L23)<0,1,0)","v":0},{"$f":"IF(BC16=1,AV16,\"\")","v":""}," ",null,null,0.10451570764111667,5.8550897551123168E-4,8.3994736659658216,133.33333333333331,3.9348443872895587,2.6227876446438083,{"$f":"BM16/BL16","v":0.66655435043784916},4.7197153124741972E-2,76.333627208594706,1.1990458123019153E-2,261.18038489284822,5.9077611247761112E-2,331.06737581069416,0,1.9389712083524954E-2,1.1000000000001287E-4,1.0000000000000001E-5,0.45157952034163451,{"$f":"IF(2*BP15-BP14<BQ$11,CA$11*BI16*BN$11*BP$11,BN$11*BQ$11)","v":1.8290568087433359E-2},{"$f":"IF(2*BR15-BR14<BU$11,CA$11*BI16*BR$11*BT$11,-BR$11*BU$11)","v":2.3887479927537442E-2},{"$f":"IF(2*BT15-BT14<BY$11,CA$11*BI16*$BV$11*$BX$11,-$BV$11*BY$11)","v":0},{"$f":"-(BX16+0.0001)","v":-1.1E-4},{"$f":"IF(2*BP15-BP14<BQ$11,BO$11*CA$11*BI16*BN$11*BP$11,0)","v":6.5846045114760076E-4},{"$f":"IF(2*BR15-BR14<BU$11,(BI$11-BS$11)*CA$11*BI16*BR$11*BT$11,0)","v":8.6711552136960919E-3},{"$f":"IF(2*BT15-BT14<BY$11,(BI$11-$BW$11)*CA$11*BI16*$BV$11*$BX$11,0)","v":0},5.8550897551123168E-4,76.333627208594706,261.18038489284822,331.06737581069416]
[null,null,null,null,null,null,null,null,null,null,"Partialkoefficienter",null,"Længdearmering",null,null,null,null,null,null,null,null,null,null,null,null,null,null,null,null,null,null,null,null,null,null,null,null,null,null,null,null,null,null,"Min arm",{"$f":"CEILING(AT33*AT32*0.45*SQRT(L21/10)/O18,1)","v":74},"mm2",null,null,null,null,null,null,null,null,null,null,null,null,null,0.10452799824500789,7.8067863401497554E-4,6.2996052494743662,75,5.241619139291454,3.4930186101428151,0.66640068980955958,6.2878876200011813E-2,101.78445753971896,1.5988265202820165E-2,348.1830099457801,7.8757141402832007E-2,441.35290561880453,0,2.5841679951855615E-2,1.0999999999997123E-4,1.0000000000000001E-5,0.60155056306184285,2.4387424116577808E-2,3.1849973236716594E-2,0,-1.1E-4,8.7794726819680105E-4,1.1561540284928123E-2,0,7.8067863401497554E-4,101.78445753971896,348.1830099457801,441.35290561880453]
[null,null,null,null,null,null,null,null,null,null,"gc",1,null,"fyk",{"$f":"Kold!P18","v":500},null,null,null,null,null,null,null,null,null,null,null,null,null,null,null,null,null,null,null,null,null,null,null,null,null,null,null,null,"Akt. arm",{"$f":"CEILING((M12^2*O12+M13^2*O13)*PI()/4,1)","v":227},"mm2",null,null,null,null,null,null,null,null,null,null,null,null,null,8.2831510807782213E-2,9.758482925187194E-4,5.0396841995794928,48,6.5420877582443886,4.357998645469209,0.66614799533638569,6.2189723296764705E-2,109.72324745608903,1.7235287406803211E-2,350.64933374609507,7.9315010703567917E-2,500,0,2.6472148161473891E-2,1.0999999999999899E-4,1.0000000000000001E-5,0.75079788706355266,3.048428014572226E-2,-7.9315010703567917E-2,0,-1.1E-4,1.0974340852460012E-3,0,0,9.758482925187194E-4,109.72324745608903,350.64933374609507,500]
[null,{"$f":"IF(AS21>L30,\" \"&TEXT(AS21,\"0,0\")&\" kNm > \",\" \"&TEXT(AS21,\"0,0\")&\" kNm < \")","v":" 28,5 kNm > "},{"$f":"IF(AS21>L30,\"!\",\" \")","v":"!"},null,null,null,null,null,null,null,"gs",1,null,"fyd",{"$f":"O18/L19","v":500},null,null,null,null,null,null,null,null,null,null,null,null,null,null,null,null,null,null,null,null,null,null,null,null,null,null,null,null,null,null,null,null,null,null,null,null,null,null,null,null,null,null,null,null,6.8918053886911648E-2,1.1710179510224634E-3,4.1997368329829108,33.333333333333329,7.8328228196299259,5.2148782378670377,0.66577252645086937,6.1952378440552076E-2,111.23423173943593,1.7472632263015826E-2,350.64933374609507,7.9315010703567917E-2,500,0,2.6756335034792425E-2,1.0999999999998511E-4,1.0000000000000001E-5,0.89892814649424635,3.6581136174866719E-2,-7.9315010703567917E-2,0,-1.1E-4,1.3169209022952015E-3,0,0,1.1710179510224634E-3,111.23423173943593,350.64933374609507,500]
[null,null,null,null,null,null,null,null,null,null,"Beton",null,"Bøjlearmering",null,null,null,null,null,null,null,null,null,null,null,null,null,null,null,null,null,null,null,null,null,null,null,null,null,null,null,null,null,null,"M_k",{"$f":"MAX(Brand2!P31:BG31)","v":28.452197647058824},"kNm",null,"x_2 skal være større end x_1; ",null,null,null,null,null,null,{"$f":"IF(OR(Brand2!D91>Brand2!D92,Brand2!E91>Brand2!E92,Brand2!F91>Brand2!F92),1,0)","v":0},{"$f":"IF(BC20=1,AV20,\"\")","v":""}," ",null,null,5.9745893741190048E-2,1.3661876095262073E-3,3.5997744282710658,24.489795918367342,9.1097439705790748,6.0602710962043735,0.66525152800964427,6.2462722510946755E-2,107.985280480198,1.6962288192621165E-2,350.64933374609507,7.9315010703567917E-2,500,0,2.6952492656939255E-2,1.0999999999999899E-4,1.0000000000000001E-5,1.0454730626597635,4.2677992204011174E-2,-7.9315010703567917E-2,0,-1.1E-4,1.536407719344402E-3,0,0,1.3661876095262073E-3,107.985280480198,350.64933374609507,500]
[null,"Lastparametre:","g [kN/m]","q [kN/m]","e [mm]","x1 [m]","x2 [m]","ϒg","ϒq","ψ1","fck",{"$f":"Kold!M21","v":35},null,"fyk ",{"$f":"Kold!P21","v":500},null,null,null,null,null,null,null,null,null,null,null,null,null,null,null,null,null,null,null,null,null,null,null,null,null,null,null,null,"M_d",{"$f":"MAX(Brand2!P32:BG32)","v":28.452197647058824},"kNm",null,"x_2 skal være mindre end L; ",null,null,null,null,null,null,{"$f":"IF(OR(Brand2!D92>L8,Brand2!E92>L8,Brand2!F92>L8),1,0)","v":0},{"$f":"IF(BC21=1,AV21,\"\")","v":""}," ",null,null,5.3395259074456282E-2,1.5613572680299513E-3,3.1498026247371826,18.749999999999993,10.368207377500296,6.8903334013877613,0.66456361746199699,6.353500218895583E-2,101.15893603491274,1.5890008514612083E-2,350.64933374609507,7.9315010703567917E-2,500,0,2.7102382435149057E-2,1.0999999999999899E-4,1.0000000000000001E-5,1.1898996894155027,4.8774848233155622E-2,-7.9315010703567917E-2,0,-1.1E-4,1.7558945363936021E-3,0,0,1.5613572680299513E-3,101.15893603491274,350.64933374609507,500]
[null,"p1",{"$f":"Kold!C22","v":1.4},{"$f":"Kold!D22","v":0},{"$f":"Kold!E22","v":0},{"$f":"Kold!F22","v":0},{"$f":"Kold!G22","v":1.7},{"$f":"Kold!H22","v":1},{"$f":"Kold!I22","v":0},{"$f":"Kold!J22","v":0},"fcd",{"$f":"L21/L18","v":35},null,"fyd ",{"$f":"O21/L19","v":500},null,null,null,null,null,null,null,null,null,null,null,null,null,null,null,null,null,null,null,null,null,null,null,null,null,null,null,null,"maks V_d",{"$f":"MAX(Brand2!P55:BD55)","v":109.6135294117647},"kN",null,"x_1 skal være mindre end L; ",null,null,null,null,null,null,{"$f":"IF(OR(Brand2!H91>L8,Brand2!I91>L8,Brand2!J91>L8),1,0)","v":0},{"$f":"IF(BC22=1,AV22,\"\")","v":""}," ",null,null,4.8822764954638005E-2,1.7565269265336953E-3,2.7998245553219401,14.814814814814811,11.603122771693675,7.7008672975692329,0.66368920238919082,6.5013558032470442E-2,91.746157189602528,1.4411452671097483E-2,350.64933374609507,7.9315010703567917E-2,500,0,2.7226069492190641E-2,1.1000000000001287E-4,1.0000000000000001E-5,1.3316238458201939,5.4871704262300078E-2,-7.9315010703567917E-2,0,-1.1E-4,1.9753813534428028E-3,0,0,1.7565269265336953E-3,91.746157189602528,350.64933374609507,500]
[null,"p2",{"$f":"Kold!C23","v":0},{"$f":"Kold!D23","v":0},{"$f":"Kold!E23","v":0},{"$f":"Kold!F23","v":0},{"$f":"Kold!G23","v":0},{"$f":"Kold!H23","v":1},{"$f":"Kold!I23","v":1.5},{"$f":"Kold!J23","v":0.6},"Brand, tid:",60,"Stålreduktioner",null,null,null,null,null,null,null,null,null,null,null,null,null,null,null,null,null,null,null,null,null,null,null,null,null,null,null,null,null,null,"Længdearmering","zs,0.2","Espk / Esk",null,null,null,null,null,null,null,null,null,null,null,null,null,4.5424606102646925E-2,1.9516965850374392E-3,2.5198420997897459,11.999999999999995,12.80909649064669,8.487447006879707,0.66261090413967227,6.6775376184032412E-2,80.530074483597858,1.2649634519535494E-2,350.64933374609507,7.9315010703567917E-2,500,0,2.7333609217724712E-2,1.0999999999998511E-4,1.0000000000000001E-5,1.4700265321649395,6.096856029144454E-2,-7.9315010703567917E-2,0,-1.1E-4,2.1948681704920029E-3,0,0,1.9516965850374392E-3,80.530074483597858,350.64933374609507,500]
[null,"p3",{"$f":"Kold!C24","v":0},{"$f":"Kold!D24","v":0},{"$f":"Kold!E24","v":0},{"$f":"Kold!F24","v":0},{"$f":"Kold!G24","v":0},{"$f":"Kold!H24","v":1},{"$f":"Kold!I24","v":1.5},{"$f":"Kold!J24","v":0.6},"Bund:",{"$f":"IF(Makro!A1=1,\"NEJ\",\"JA\")","v":"JA"},null,"fsy,q / fyk","Es,q / Es",null,null,null,null,null,null,null,null,null,null,null,null,null,null,null,null,null,null,null,null,null,null,null,null,null,null,null,null,"Tryklag",{"$f":"Firsidig!E47","v":0.9118013639878888},{"$f":"Firsidig!E46","v":0.99436027279757777},null,"Grænse forskydningstrykbrud (V_ud_0) overskredet; ",null,null,null,null,null,null,0,{"$f":"IF(BE24=1,AV24,\"\")","v":""},{"$f":"IF(AS22>O30,1,0)","v":0},null,null,4.2833655251058866E-2,2.1468662435411832E-3,2.2907655452634055,9.9173553719008218,13.980595960486413,9.2455632770767711,0.6613139599490363,6.8725435061063947E-2,68.11561409960602,1.069957564250398E-2,350.64933374609507,7.9315010703567917E-2,500,0,2.7430184222948097E-2,1.1000000000001287E-4,1.0000000000000001E-5,1.6044728066807941,6.7065416320588989E-2,-7.9315010703567917E-2,0,-1.1E-4,2.4143549875412034E-3,0,0,2.1468662435411832E-3,68.11561409960602,350.64933374609507,500]
[null,null,"G [kN]","Q [kN]","e [mm]","x1 [m]",null,null,null,null,"Sider:",{"$f":"IF(Makro!A2=1,\"NEJ\",\"JA\")","v":"JA"},"Tryklag  t:",{"$f":"AS24","v":0.9118013639878888},0.99436027279757777,null,null,null,null,null,null,null,null,null,null,null,null,null,null,null,null,null,null,null,null,null,null,null,null,null,null,null,null,"Træklag 1",{"$f":"Firsidig!E35","v":1},{"$f":"Firsidig!E34","v":1},null,null,null,null,null,null,null,null,null,null,null,null,null,4.0817168144081331E-2,2.3420359020449272E-3,2.0998684164914549,8.3333333333333286,15.112128219898624,9.9707793165977598,0.65978657482993786,7.079053203352223E-2,54.968798454372212,8.6344786700456866E-3,350.64933374609507,7.9315010703567917E-2,500,0,2.7518502508445068E-2,1.0999999999999899E-4,1.0000000000000001E-5,1.7343322737049598,7.3162272349733437E-2,-7.9315010703567917E-2,0,-1.1E-4,2.6338418045904039E-3,0,0,2.3420359020449272E-3,54.968798454372212,350.64933374609507,500]
[null,"P1",{"$f":"Kold!C26","v":128},{"$f":"Kold!D26","v":0},{"$f":"Kold!E26","v":0},{"$f":"Kold!F26","v":0.26},{"$f":"Kold!G26","v":0},{"$f":"Kold!H26","v":1},{"$f":"Kold!I26","v":1.5},{"$f":"Kold!J26","v":0.6},"Betonreduktioner",null,"Træklag 1:",1,1,null,null,null,null,null,null,null,null,null,null,null,null,null,null,null,null,null,null,null,null,null,null,null,null,null,null,null,null,"Træklag 2",{"$f":"Firsidig!E41","v":0.70129866749219016},{"$f":"Firsidig!E40","v":0.90182944988553171},null,"Partialkoefficienter skal være større end 1; ",null,null,null,null,null,null,{"$f":"IF(MIN(L18:L19)<1,1,0)","v":0},{"$f":"IF(BC26=1,AV26,\"\")","v":""}," ",null,null,3.9222093965546156E-2,2.5372055605486711E-3,1.938340076761343,7.1005917159763277,16.198422786728859,10.658889340727749,0.65802019622925434,7.2913875436583855E-2,41.451174515219321,6.5111352669840732E-3,350.64933374609507,7.9315010703567917E-2,500,0,2.7599973264098521E-2,1.1000000000001287E-4,1.0000000000000001E-5,1.8590000702316798,7.9259128378877899E-2,-7.9315010703567917E-2,0,-1.1E-4,2.8533286216396044E-3,0,0,2.5372055605486711E-3,41.451174515219321,350.64933374609507,500]
[null,"P2",{"$f":"Kold!C27","v":0},{"$f":"Kold!D27","v":0},{"$f":"Kold!E27","v":0},{"$f":"Kold!F27","v":0},{"$f":"Kold!G27","v":0},{"$f":"Kold!H27","v":1},{"$f":"Kold!I27","v":1.5},{"$f":"Kold!J27","v":0.6},"Randzone:",{"$f":"Firsidig!E23*1000","v":17.617867964443654},"Træklag 2:",0.70129866749219016,0.90182944988553171,null,null,null,null,null,null,null,null,null,null,null,null,null,null,null,null,null,null,null,null,null,null,null,null,null,null,null,null,"Bøjler","zs,0.2",{"$f":"Firsidig!E49","v":0.75957506215355586},null,"M_d > M_ud  !",null,null,null,null,null,null,null,{"$f":"IF(BE27=1,AV27,\"\")","v":"M_d > M_ud  !"},{"$f":"IF(AS21>L30,1,0)","v":1},null,null,3.7944449363207226E-2,2.7323752190524151E-3,1.7998872141355327,6.1224489795918329,17.234607831336351,11.306069726042663,0.65600968914916147,7.5050974650509819E-2,27.845978364254311,4.3740360530580835E-3,350.64933374609507,7.9315010703567917E-2,500,0,2.7675310037088799E-2,1.0999999999998511E-4,1.0000000000000001E-5,1.9779170843175518,8.5355984408022362E-2,-7.9315010703567917E-2,0,-1.1E-4,3.0728154386888045E-3,0,0,2.7323752190524151E-3,27.845978364254311,350.64933374609507,500]
[null,"P3",{"$f":"Kold!C28","v":0},{"$f":"Kold!D28","v":0},{"$f":"Kold!E28","v":0},{"$f":"Kold!F28","v":0},{"$f":"Kold!G28","v":0},{"$f":"Kold!H28","v":1},{"$f":"Kold!I28","v":1.5},{"$f":"Kold!J28","v":0.6},"kc,M",{"$f":"Firsidig!E21","v":1},"Bøjlearmering:",{"$f":"AT27","v":0.75957506215355586},null,null,null,null,null,null,null,null,null,null,null,null,null,null,null,null,null,null,null,null,null,null,null,null,null,null,null,null,null,"Beton","Red f_cd",{"$f":"AT29*L21/L18","v":35},null,null,null,null,null,null,null,null,null,null,null,null,null,3.6911480508322887E-2,2.9275448775561591E-3,1.6798947331931637,5.3333333333333313,18.216368536776983,11.909012807788146,0.65375339677307631,7.716670298084069E-2,14.37683348378556,2.2583077227272233E-3,350.64933374609507,7.9315010703567917E-2,500,0,2.7744853725953766E-2,1.0999999999999899E-4,1.0000000000000001E-5,2.0905881291713824,9.145284043716681E-2,-7.9315010703567917E-2,0,-1.1E-4,3.292302255738005E-3,0,0,2.9275448775561591E-3,14.37683348378556,350.64933374609507,500]
[null,null,"Jævnt fordelte laste [kN/m]",null,null,"Punktlaste [kN]",null,null,"Kontrolparametre",null,"Momentkapacitet",null,"Forskydningskapacitet",null,null,null,null,null,null,null,null,null,null,null,null,null,null,null,null,null,null,null,null,null,null,null,null,null,null,null,null,null,null,null,"zc,M  =",{"$f":"L28","v":1},null,null,null,null,null,null,null,null,null,null,null,null,null,3.6070908382150164E-2,3.122714536059903E-3,1.5749013123685911,4.6874999999999964,19.140077778844596,12.465034619997896,0.65125308078817834,7.9233246995197071E-2,1.2208056837140877,1.9176370837084211E-4,350.64933374609507,7.9315010703567917E-2,500,0,2.7808752415472253E-2,1.0999999999999899E-4,1.0000000000000001E-5,2.1965969405529573,9.7549696466311273E-2,-7.9315010703567917E-2,0,-1.1E-4,3.5117890727872051E-3,0,0,3.122714536059903E-3,1.2208056837140877,350.64933374609507,500]
[null,null,"p1","p2","p3","P1","P2","P3","M (kNm)",{"$f":"L30","v":28.16564772222862},"MRd",{"$f":"BV56*1000","v":28.16564772222862},"v/ trykbrud i krop:","VRd,0",{"$f":"BJ64","v":254.45333659962088},null,null,null,null,null,null,null,null,null,null,null,null,null,null,null,null,null,null,null,null,null,null,null,null,null,null,null,null,null,null,null,null,null,null,null,null,null,null,null,null,null,null,null,null,3.5384241924983489E-2,3.317884194563647E-3,1.4822600586998504,4.1522491349480939,20.002891690321992,12.972150208140619,0.64851374536097395,8.1228672395176393E-2,-11.48246695539914,-1.8036616916084747E-3,350.64933374609507,7.9315010703567917E-2,500,0,2.786706465983808E-2,1.0999999999999899E-4,1.0000000000000001E-5,2.2956171441339785,0.10364655249545572,-7.9315010703567917E-2,0,-1.1E-4,3.731275889836406E-3,0,0,3.317884194563647E-3,-11.48246695539914,350.64933374609507,500]
[null,"Regnm. værdi",{"$f":"Brand2!D89","v":1.4},{"$f":"Brand2!E89","v":0},{"$f":"Brand2!F89","v":0},{"$f":"Brand2!H89","v":128},{"$f":"Brand2!I89","v":0},{"$f":"Brand2!J89","v":0},"x (mm)",{"$f":"BH56*1000","v":32.825653528116},{"$f":"INDEX(AS4:AS5,Makro!A3,1)","v":"Tilslag: Søsand / granit"},null,"v/ type 1 bøjler:","VRd,1",{"$f":"BJ65","v":125.25179361120101},null,"NB:  Resultaterne skal altid kontrolleres af ansvarlig statiker",null,null,null,null,null,null,null,null,null,null,null,null,null,null,null,null,null,null,null,null,null,null,null,null,null,null,null,null,null,null,null,null,null,null,null,null,null,null,null,null,null,null,3.482250425645117E-2,3.513053853067391E-3,1.3999122776609698,3.7037037037037006,20.802805910256975,13.429113178837424,0.64554335779367633,8.3135898222414795E-2,-23.624243675299962,-3.7108875188468747E-3,350.64933374609507,7.9315010703567917E-2,500,0,2.7919819813992063E-2,1.0999999999999899E-4,1.0000000000000001E-5,2.3874187109048353,0.10974340852460017,-7.9315010703567917E-2,0,-1.1E-4,3.9507627068856056E-3,0,0,3.513053853067391E-3,-23.624243675299962,350.64933374609507,500]
[null,null,null,null,null,null,null,null,"e0 (o/oo)",{"$f":"BI56*1000","v":5.6599200966085741},{"$f":"INDEX(AR33:AR35,Makro!A4,1)","v":"Stål: Bratkølet"},null,"v/ type 2 bøjler:","VRd,2",{"$f":"BJ66","v":125.25179361120101},null,null,null,null,null,null,null,null,null,null,null,null,null,null,null,null,null,null,null,null,null,null,null,null,null,null,null,null,2,"h_red",{"$f":"O7-L27*AT39","v":382.38213203555637},null,null,null,null,null,null,null,null,null,null,null,null,null,3.4363432810447618E-2,3.7082235115711349E-3,1.3262326840998662,3.3240997229916882,21.538671856737928,13.8354194147486,0.64235248611304119,8.4941932637516482E-2,-35.121815857600474,-5.5169219339485575E-3,350.64933374609507,7.9315010703567917E-2,500,0,2.7967053053321464E-2,1.1000000000001287E-4,1.0000000000000001E-5,2.4718698247077144,0.11584026455374462,-7.9315010703567917E-2,0,-1.1E-4,4.1702495239348061E-3,0,0,3.7082235115711349E-3,-35.121815857600474,350.64933374609507,500]
[null,null,null,null,null,null,null,null,"sst (MPa)",{"$f":"IF(AND(AS11=0,AS10=0),0,BR56)","v":350.64933374609507},"Forskydningskraftens største excentricitet, exc.:",null,null,null,{"$f":"MAX(Brand2!P60:BD60)","v":0},null,"Vejledning",null,null,"Betonelementbyggeriers statik",null,null,null,null,null,null,null,null,null,null,null,null,null,null,null,null,null,null,null,null,null,null,null,"Stål: Varmvalset","b_red",{"$f":"O8-2*L27*AT40","v":114.76426407111269},null,"Forskydningsarmering bør vurderes nærmere !",null,null,null,null,null,null,null,{"$f":"IF(BE33=1,AV33,\"\")","v":""},{"$f":"IF(Brand2!I68=1,1,0)","v":0},null,null,3.3989603791668856E-2,3.9033931700748789E-3,1.2599210498948727,2.9999999999999982,22.210175679800489,14.191277891434682,0.63895387843965767,8.663727261686345E-2,-45.914685374975548,-7.212261913295495E-3,350.64933374609507,7.9315010703567917E-2,500,0,2.8008824782595199E-2,1.1000000000004062E-4,1.0000000000000001E-5,2.5489344667824283,0.12193712058288908,-7.9315010703567917E-2,0,-1.1E-4,4.3897363409840075E-3,0,0,3.9033931700748789E-3,-45.914685374975548,350.64933374609507,500]
[null,null,null,null,null,null,null,null,"z (mm)",{"$f":"AS16","v":349.92270595491749},"Forankringskrav til hovedarmering over lejer, Na :",null,null,null,{"$f":"CD66","v":137.01691176470587},null,null,null,null,"Polyteknisk Forlag 2011, eller www.bef.dk ",null,null,null,null,null,null,null,null,null,null,null,null,null,null,null,null,null,null,null,null,null,null,null,"Stål: Bratkølet","a_t_red",{"$f":"N11","v":36},null,null,null,null,null,null,null,null,null,null,null,null,null,3.36871501674346E-2,4.0985628285786224E-3,1.1999248094236885,2.7210884353741482,22.817785221145044,14.497553897033756,0.63536201066521558,8.8215405851213499E-2,-55.961393579151952,-8.7903951476455394E-3,350.64933374609507,7.9315010703567917E-2,500,0,2.8045230071585624E-2,1.1000000000004062E-4,1.0000000000000001E-5,2.6186663286374223,0.12803397661203353,-7.9315010703567917E-2,0,-1.1E-4,4.6092231580332071E-3,0,0,4.0985628285786224E-3,-55.961393579151952,350.64933374609507,500]
[null,"Note:",null,null,null,null,null,null,null,null,null,null,null,null,null,null,null,null,null,null,null,null,null,null,null,null,null,null,null,null,null,null,null,null,null,null,null,null,null,null,null,null,null,"Stål: Kolddeformeret","a_1_red",{"$f":"N12-L27*AT39","v":-17.617867964443654},null,null,null,null,null,null,null,null,null,{"$f":"IF(BC35=1,AV35,\"\")","v":""}," ",null,null,3.3444868922405536E-2,4.2937324870823664E-3,1.1453827726317027,2.4793388429752055,23.362672066269521,14.755691445579432,0.63159262792047466,8.9672378087193583E-2,-65.236766911307726,-1.0247367383625703E-2,350.64933374609507,7.9315010703567917E-2,500,0,2.8076401603992211E-2,1.0999999999995735E-4,1.0000000000000001E-5,2.6811998664201635,0.13413083264117798,-7.9315010703567917E-2,0,-1.1E-4,4.8287099750824068E-3,0,0,4.2937324870823664E-3,-65.236766911307726,350.64933374609507,500]
[null,null,null,null,null,null,null,null,null,null,null,null,null,null,null,null,null,null,null,null,null,null,null,null,null,null,null,null,null,null,null,null,null,null,null,null,null,null,null,null,null,null,null,{"$f":"IF(Makro!A4=1,\"Q\",IF(Makro!A4=2,\"AC\",\"C\"))","v":"AC"},"a_2_red",{"$f":"N13-L27*AT39","v":19.382132035556346},null,null,null,null,null,null,null,null,null,""," ",null,null,3.3253588459017241E-2,4.4889021455861104E-3,1.0955835216477157,2.2684310018903577,23.846616548406274,14.967622240303847,0.6276623021098634,9.1006405686071795E-2,-73.729450374606529,-1.1581394982503854E-2,350.64933374609507,7.9315010703567917E-2,500,0,2.8102508433430623E-2,1.1000000000002674E-4,1.0000000000000001E-5,2.7367393987638633,0.14022768867032243,-7.9315010703567917E-2,0,-1.1E-4,5.0481967921316073E-3,0,0,4.4889021455861104E-3,-73.729450374606529,350.64933374609507,500]
[null,null,null,null,null,null,null,null,null,null,null,null,null,null,null,null,null,null,null,null,null,null,null,null,null,null,null,null,null,null,null,null,null,null,null,null,null,null,null,null,null,null,null,null,null,null,null,null,null,null,null,null,null,null,null,""," ",null,null,3.3105712810279471E-2,4.6840718040898543E-3,1.0499342082457275,2.0833333333333321,24.271903443884007,15.135668287455895,0.62358802318281936,9.2217523515249658E-2,-81.439665941821815,-1.2792512811681714E-2,350.64933374609507,7.9315010703567917E-2,500,0,2.8123752133352376E-2,1.1000000000002674E-4,1.0000000000000001E-5,2.7855471363424535,0.14632454469946687,-7.9315010703567917E-2,0,-1.1E-4,5.2676836091808078E-3,0,0,4.6840718040898543E-3,-81.439665941821815,350.64933374609507,500]
[null,null,null,null,null,null,null,null,null,null,null,null,null,null,null,null,null,null,null,null,null,null,null,null,null,null,null,null,null,null,null,null,null,null,null,null,null,null,null,null,null,null,null,"Brand, trykside",1,{"$f":"AS38-1","v":0},null,null,null,null,null,null,null,null,null,""," ",null,null,3.2994887878218103E-2,4.8792414625935983E-3,1.0079368399158983,1.919999999999999,24.641215288652504,15.262444387581256,0.61938683659850768,9.3307264240513832E-2,-88.377170866395304,-1.3882253536945869E-2,350.64933374609507,7.9315010703567917E-2,500,0,2.8140361472381775E-2,1.1000000000004062E-4,1.0000000000000001E-5,2.8279309384200553,0.15242140072861132,-7.9315010703567917E-2,0,-1.1E-4,5.4871704262300074E-3,0,0,4.8792414625935983E-3,-88.377170866395304,350.64933374609507,500]
[null,null,null,null,null,null,null,null,null,null,null,null,null,null,null,null,null,null,null,null,null,null,null,null,null,null,null,null,null,null,null,null,null,null,null,null,null,null,null,null,null,null,null,"Brand, trækside",2,{"$f":"Makro!A1-1","v":1},null,null,null,null,null,null,null,null,null,""," ",null,null,3.2915753090315768E-2,5.0744111210973422E-3,0.96917003838067151,1.7751479289940819,24.957528997779569,15.350765483217808,0.61507553430403872,9.4278368066899321E-2,-94.559409835383661,-1.4853357363331387E-2,350.64933374609507,7.9315010703567917E-2,500,0,2.8152586427330484E-2,1.1000000000001287E-4,1.0000000000000001E-5,2.864232448463627,0.1585182567577558,-7.9315010703567917E-2,0,-1.1E-4,5.7066572432792088E-3,0,0,5.0744111210973422E-3,-94.559409835383661,350.64933374609507,500]
[null,null,null,null,null,null,null,null,null,null,null,null,null,null,null,null,null,null,null,null,null,null,null,null,null,null,null,null,null,null,null,null,null,null,null,null,null,null,null,null,null,null,null,"Brand, sider",2,{"$f":"Makro!A2-1","v":1},null,null,null,null,null,null,null,null,null,""," ",null,null,3.2863753663324509E-2,5.2695807796010862E-3,0.93327485177397995,1.6460905349794233,25.224020029296902,15.403562451010908,0.61067040198668399,9.51345230656781E-2,-100.00986183972253,-1.5709512362110125E-2,350.64933374609507,7.9315010703567917E-2,500,0,2.8160692107386892E-2,1.100000000000545E-4,1.0000000000000001E-5,2.8948160955772653,0.16461511278690025,-7.9315010703567917E-2,0,-1.1E-4,5.9261440603284084E-3,0,0,5.2695807796010862E-3,-100.00986183972253,350.64933374609507,500]
[null,null,null,null,null,null,null,null,null,null,null,null,null,null,null,null,null,null,null,null,null,null,null,null,null,null,null,null,null,null,null,null,null,null,null,null,null,null,null,null,null,null,null,null,null,null,null,null,null,null,null,null,null,null,null,""," ",null,null,3.2834996446424985E-2,5.4647504381048302E-3,0.89994360706776633,1.5306122448979582,25.443976902652295,15.423808578091618,0.60618702167127936,9.5880136222529111E-2,-104.75658262161059,-1.6455125518961201E-2,350.64933374609507,7.9315010703567917E-2,500,0,2.8164952978174174E-2,1.0999999999999899E-4,1.0000000000000001E-5,2.9200592842752799,0.17071196881604472,-7.9315010703567917E-2,0,-1.1E-4,6.1456308773776089E-3,0,0,5.4647504381048302E-3,-104.75658262161059,350.64933374609507,500]
[null,null,null,null,null,null,null,null,null,null,null,null,null,null,null,null,null,null,null,null,null,null,null,null,null,null,null,null,null,null,null,null,null,null,null,null,null,null,null,null,null,null,null,null,null,"NEJ",null,null,null,null,null,null,null,null,null,""," ",null,null,3.2826137523113308E-2,5.6599200966085741E-3,0.86891106889301573,1.4268727705112954,25.620727601131424,15.414457782735559,0.60164012602260553,9.6520134805922392E-2,-108.83094014636458,-1.7095124102354472E-2,350.64933374609507,7.9315010703567917E-2,500,0,2.8165647630553306E-2,1.0999999999999899E-4,1.0000000000000001E-5,2.9403439481102924,0.17680882484518917,-7.9315010703567917E-2,0,-1.1E-4,6.3651176944268095E-3,0,0,5.6599200966085741E-3,-108.83094014636458,350.64933374609507,500]
[null,null,null,null,null,null,null,null,null,null,null,null,null,null,null,null,null,null,null,null,null,null,null,null,null,null,null,null,null,null,null,null,null,null,null,null,null,null,null,null,null,null,null,null,null,"JA",null,null,null,null,null,null,null,null,null,""," ",null,null,3.2834293277737722E-2,5.8550897551123181E-3,0.83994736659658187,1.3333333333333328,25.757578336255769,15.378394694238525,0.59704349894540565,9.7059796949338153E-2,-112.26653605533222,-1.7634786245770268E-2,350.64933374609507,7.9315010703567917E-2,500,0,2.8163054228931502E-2,1.0999999999997123E-4,1.0000000000000001E-5,2.9560495220144283,0.18290568087433362,-7.9315010703567917E-2,0,-1.1E-4,6.58460451147601E-3,0,0,5.6599200966085741E-3,-108.83094014636458,350.64933374609507,500]
[null,null,null,null,null,null,null,null,null,null,null,null,null,null,null,null,null,null,null,null,null,null,null,null,null,null,null,null,null,null,null,null,null,null,null,null,null,null,null,null,null,null,null,null,null,null,null,null,null,null,null,null,null,null,null,""," ",null,null,3.2856931850338437E-2,6.0502594136160621E-3,0.81285229025475669,1.2486992715920908,25.857855798191949,15.318396541054774,0.59240784157075688,9.7504844105311309E-2,-115.09979424661678,-1.8079833401743399E-2,350.64933374609507,7.9315010703567917E-2,500,0,2.8157446823964601E-2,1.0999999999999899E-4,1.0000000000000001E-5,2.967557791136453,0.18900253690347807,-7.9315010703567917E-2,0,-1.1E-4,6.8040913285252096E-3,0,0,5.6599200966085741E-3,-108.83094014636458,350.64933374609507,500]
[null,null,null,null,null,null,null,null,null,null,null,null,null,null,null,null,null,null,null,null,null,null,null,null,null,null,null,null,null,null,null,null,null,null,null,null,null,null,null,null,null,null,null,null,null,null,null,null,null,null,null,null,null,null,null,""," ",null,null,3.2891924584121005E-2,6.245429072119806E-3,0.78745065618429555,1.1718749999999991,25.924603926866368,15.237103252844534,0.58774680978072391,9.7860649070546854E-2,-117.36491900637198,-1.8435638366978965E-2,350.64933374609507,7.9315010703567917E-2,500,0,2.814909197217786E-2,1.0999999999997123E-4,1.0000000000000001E-5,2.975218091001897,0.19509939293262255,-7.9315010703567917E-2,0,-1.1E-4,7.0235781455744101E-3,0,0,5.6599200966085741E-3,-108.83094014636458,350.64933374609507,500]
[null,null,null,null,null,null,null,null,null,null,null,null,null,null,null,null,null,null,null,null,null,null,null,null,null,null,null,null,null,null,null,null,null,null,null,null,null,null,null,null,null,null,null,null,null,null,null,null,null,null,null,null,null,null,null,null,null,null,null,3.2937390945744355E-2,6.44059873062355E-3,0.76358851508780168,1.1019283746556465,25.960812315718698,15.136999472771208,0.58307110304118215,9.8132790404989387E-2,-119.09742455021805,-1.8707779701421484E-2,350.64933374609507,7.9315010703567917E-2,500,0,2.8138246513602562E-2,1.0999999999998511E-4,1.0000000000000001E-5,2.9793735201017353,0.20119624896176697,-7.9315010703567917E-2,0,-1.1E-4,7.2430649626236106E-3,0,0,5.6599200966085741E-3,-108.83094014636458,350.64933374609507,500]
[null,null,null,null,null,null,null,null,null,null,null,null,null,null,null,null,null,null,null,null,null,null,null,null,null,null,null,null,null,null,null,null,null,null,null,null,null,null,null,null,null,null,null,null,null,null,null,null,null,null,null,null,null,null,null,null,null,null,null,3.2991694116873846E-2,6.635768389127294E-3,0.74113002934992522,1.0380622837370235,25.969314186173293,15.020402244015974,0.57839040863132263,9.832677019086572E-2,-120.3323382215027,-1.8901759487297758E-2,350.64933374609507,7.9315010703567917E-2,500,0,2.8125155758590356E-2,1.1000000000004062E-4,1.0000000000000001E-5,2.9803492310076849,0.20729310499091144,-7.9315010703567917E-2,0,-1.1E-4,7.462551779672812E-3,0,0,5.6599200966085741E-3,-108.83094014636458,350.64933374609507,500]
[null,null,null,null,null,null,null,null,null,null,null,null,null,null,null,null,null,null,null,null,null,null,null,null,null,null,null,null,null,null,null,null,null,null,null,null,null,null,null,null,null,null,null,null,null,null,null,null,null,null,null,null,null,null,null,null,null,null,null,3.3053407802730694E-2,6.8309380476310379E-3,0.71995488565421306,0.97959183673469341,25.952774254074601,14.889455362657715,0.5737134387596371,9.8447956775269269E-2,-121.10383597927266,-1.9022946071701314E-2,350.64933374609507,7.9315010703567917E-2,500,0,2.8110052242283169E-2,1.1000000000004062E-4,1.0000000000000001E-5,2.9784510378725924,0.21338996102005586,-7.9315010703567917E-2,0,-1.1E-4,7.6820385967220116E-3,0,0,5.6599200966085741E-3,-108.83094014636458,350.64933374609507,500]
[null,null,null,null,null,null,null,null,null,null,null,null,null,null,null,null,null,null,null,null,null,null,null,null,null,null,null,null,null,null,null,null,null,null,null,null,null,null,null,null,null,null,null,null,null,null,null,null,null,null,null,null,null,null,null,null,null,null,null,3.312128819242767E-2,7.0261077061347819E-3,0.69995613883048491,0.92592592592592515,25.913682521089434,14.746128660032708,0.56904797872829571,9.8501542032154776E-2,-121.44497031967998,-1.9076531328586856E-2,350.64933374609507,7.9315010703567917E-2,500,0,2.8093154939778861E-2,1.0999999999999899E-4,1.0000000000000001E-5,2.9739647039052852,0.21948681704920034,-7.9315010703567917E-2,0,-1.1E-4,7.9015254137712113E-3,0,0,5.6599200966085741E-3,-108.83094014636458,350.64933374609507,500]
[null,null,null,null,null,null,null,null,null,null,null,null,null,null,null,null,null,null,null,null,null,null,null,null,null,null,null,null,null,null,null,null,null,null,null,null,null,null,null,null,null,null,null,null,null,null,null,null,null,null,null,null,null,null,null,null,null,null,null,3.319425011282811E-2,7.2212773646385259E-3,0.68103840534857996,0.87655222790357867,25.854352778436937,14.592221072806035,0.56440094238120897,9.8492510741557529E-2,-121.38747533803785,-1.9067500037989595E-2,350.64933374609507,7.9315010703567917E-2,500,0,2.8074668863439171E-2,1.1000000000001287E-4,1.0000000000000001E-5,2.9671557696522428,0.22558367307834482,-7.9315010703567917E-2,0,-1.1E-4,8.1210122308204118E-3,0,0,5.6599200966085741E-3,-108.83094014636458,350.64933374609507,500]
[null,null,null,null,null,null,null,null,null,null,null,null,null,null,null,null,null,null,null,null,null,null,null,null,null,null,null,null,null,null,null,null,null,null,null,null,null,null,null,null,null,null,null,null,null,null,null,null,null,null,null,null,null,null,null,null,null,null,null,3.3271346633523248E-2,7.4164470231422698E-3,0.66311634204993308,0.83102493074792205,25.776924752593665,14.42936651437792,0.55977843179008546,9.8425619926258798E-2,-120.96163518194798,-1.9000609222690822E-2,350.64933374609507,7.9315010703567917E-2,500,0,2.8054784969530174E-2,1.100000000000545E-4,1.0000000000000001E-5,2.9582697992478604,0.23168052910748924,-7.9315010703567917E-2,0,-1.1E-4,8.3404990478696123E-3,0,0,5.6599200966085741E-3,-108.83094014636458,350.64933374609507,500]
[null,null,null,null,null,null,null,null,null,null,null,null,null,null,null,null,null,null,null,null,null,null,null,null,null,null,null,null,null,null,null,null,null,null,null,null,null,null,null,null,null,null,null,null,null,null,null,null,null,null,null,null,null,null,null,null,null,null,null,3.3351751539661287E-2,7.6116166816460138E-3,0.64611335892044763,0.78895463510848074,25.683368975213597,14.259041719866323,0.55518579878003471,9.8305386246742482E-2,-120.19620380510227,-1.8880375543174541E-2,350.64933374609507,7.9315010703567917E-2,500,0,2.8033680309033426E-2,1.1000000000002674E-4,1.0000000000000001E-5,2.9475329393072363,0.23777738513663371,-7.9315010703567917E-2,0,-1.1E-4,8.5599858649188128E-3,0,0,5.6599200966085741E-3,-108.83094014636458,350.64933374609507,500]
[null,null,null,null,null,null,null,null,null,null,null,null,null,null,null,null,null,null,null,null,null,null,null,null,null,null,null,null,null,null,null,null,null,null,null,null,null,null,null,null,null,null,null,null,null,null,null,null,null,null,null,null,null,null,null,null,null,null,null,3.343474420819887E-2,7.8067863401497578E-3,0.62996052494743637,0.74999999999999956,25.575493609630467,14.082575387817089,0.55062770645858761,9.8136079815566948E-2,-119.11836558834885,-1.8711069111998997E-2,350.64933374609507,7.9315010703567917E-2,500,0,2.8011518365899376E-2,1.1000000000002674E-4,1.0000000000000001E-5,2.935152702364686,0.24387424116577816,-7.9315010703567917E-2,0,-1.1E-4,8.779472681968015E-3,0,0,5.6599200966085741E-3,-108.83094014636458,350.64933374609507,500]
[null,null,null,null,null,null,null,null,null,null,null,null,null,null,null,null,null,null,null,null,null,null,null,null,null,null,null,null,null,null,null,null,null,null,null,null,null,null,null,null,null,null,null,null,null,null,null,null,null,null,null,null,null,null,null,null,null,null,null,null,null,null,null,null,null,null,null,{"$f":"CH53","v":-108.83094014636458},-1.7095124102354472E-2,{"$f":"CI53","v":350.64933374609507},7.9315010703567917E-2,{"$f":"CJ53","v":500},0]
[null,null,null,null,null,null,null,null,null,null,null,null,null,null,null,null,null,null,null,null,null,null,null,null,null,null,null,null,null,null,null,null,null,null,null,null,null,null,null,null,null,null,null,null,null,null,null,null,null,null,null,null,null,null,null,null,null,null,null,3.2825653528115999E-2,{"$f":"CG53","v":5.6599200966085741E-3},{"$f":"IF($CF$11=1,BI55/($CE$11*$CD$11),2^(1/3)*$CD$11/BI55)","v":0.86891106889301573},{"$f":"IF($CF$11=1,-($CE$11-2)*BI55/$CD$11,3*($CD$11/BI55)^2)","v":1.4268727705112954},{"$f":"IF(CF$11=1,0.5*(CE$11*BI55*BL$11/CD$11)*(1-CG54^2+(BJ55-BK55)*(BK55^2*(1-CG54^2)+2*BK55*(1-CG54)+2*LN((1-BK55)/(1-BK55*CG54)))/(BK55^3)),BL$11*BK55*(LN((1-BJ55+BJ55^2)/(1+BJ55)^2)/(6*BJ55)+ATAN((2-BJ55)/(BJ55*3^0.5))/(BJ55*3^0.5)-LN((CG54^2-BJ55*CG54+BJ55^2)/(CG54+BJ55)^2)/(6*BJ55)-ATAN((2*CG54-BJ55)/(BJ55*3^0.5))/(BJ55*3^0.5)))","v":25.621864280386241},{"$f":"IF(CF$11=1,(CE$11*BI55*BL$11/CD$11)*(1-CG54^3-(BJ55-BK55)*(-2*BK55^3*(1-CG54^3)-3*BK55^2*(1-CG54^2)-6*BK55*(1-CG54)-6*LN((1-BK55)/(1-BK55*CG54)))/(2*BK55^4))/3,BL$11*BK55*(LN((1+BJ55^3)/(BJ55^3+CG54^3)))/3)","v":15.41446192384776},{"$f":"BM55/BL55","v":0.60161359669864711},{"$f":"BL55*BH55*BJ$11","v":9.6522993805855717E-2},{"$f":"MAX(MIN(BQ$11,CA$11*BP$11*BI55*(BH55-BO$11)/BH55),-BQ$11)","v":-108.84914110523228},-1.7097983102287825E-2,{"$f":"MIN(BU$11,CA$11*BT$11*BI55*(BI$11-BH55-BS$11)/BH55)","v":350.64933374609507},7.9315010703567917E-2,{"$f":"MIN($BY$11,CA$11*$BX$11*BI55*(BI$11-BH55-$BW$11)/BH55)","v":500},0,{"$f":"(0.5*BI$11-BH55+BN55*BH55)*BO55+(0.5*BI$11-BO$11)*BQ55+(0.5*BI$11-BS$11)*BS55+(0.5*BI$11-BW$11)*BU55","v":2.8165647722228619E-2},{"$f":"BO55+BQ55-BS55-BU55","v":1.0999999999997123E-4},{"$f":"$CG$11+0.00001","v":1.0000000000000001E-5},{"$f":"BL55*BJ$11","v":2.9404743982684565},{"$f":"IF(BP54<BQ$11,CA$11*BI55*BN$11*BP$11,BN$11*BQ$11)","v":0.17680882484518917},{"$f":"IF(BR54<BU$11,CA$11*BI55*BR$11*BT$11,-BR$11*BU$11)","v":-7.9315010703567917E-2},{"$f":"IF(BT54<BY$11,CA$11*BI55*$BV$11*$BX$11,-$BV$11*BY$11)","v":0},{"$f":"-(BX55+0.0001)","v":-1.1E-4},{"$f":"IF(BP54<BQ$11,BO$11*CA$11*BI55*BN$11*BP$11,0)","v":6.3651176944268095E-3},{"$f":"IF(BR54<BU$11,(BI$11-BS$11)*CA$11*BI55*BR$11*BT$11,0)","v":0},{"$f":"IF(BT54<BY$11,(BI$11-$BW$11)*CA$11*BI55*$BV$11*$BX$11,0)","v":0}]
[null,null,null,null,null,null,null,null,null,null,null,null,null,null,null,null,null,null,null,null,null,null,null,null,null,null,null,null,null,null,null,null,null,null,null,null,null,null,null,null,null,null,null,null,null,null,null,null,null,null,null,null,null,null,null,null,null,null,null,3.2825653528115999E-2,{"$f":"BI55","v":5.6599200966085741E-3},{"$f":"IF($CF$11=1,BI56/($CE$11*$CD$11),2^(1/3)*$CD$11/BI56)","v":0.86891106889301573},{"$f":"IF($CF$11=1,-($CE$11-2)*BI56/$CD$11,3*($CD$11/BI56)^2)","v":1.4268727705112954},{"$f":"IF(CF$11=1,0.5*(CE$11*BI56*BL$11/CD$11)*(1-CG55^2+(BJ56-BK56)*(BK56^2*(1-CG55^2)+2*BK56*(1-CG55)+2*LN((1-BK56)/(1-BK56*CG55)))/(BK56^3)),BL$11*BK56*(LN((1-BJ56+BJ56^2)/(1+BJ56)^2)/(6*BJ56)+ATAN((2-BJ56)/(BJ56*3^0.5))/(BJ56*3^0.5)-LN((CG55^2-BJ56*CG55+BJ56^2)/(CG55+BJ56)^2)/(6*BJ56)-ATAN((2*CG55-BJ56)/(BJ56*3^0.5))/(BJ56*3^0.5)))","v":25.621864280386241},{"$f":"IF(CF$11=1,(CE$11*BI56*BL$11/CD$11)*(1-CG55^3-(BJ56-BK56)*(-2*BK56^3*(1-CG55^3)-3*BK56^2*(1-CG55^2)-6*BK56*(1-CG55)-6*LN((1-BK56)/(1-BK56*CG55)))/(2*BK56^4))/3,BL$11*BK56*(LN((1+BJ56^3)/(BJ56^3+CG55^3)))/3)","v":15.41446192384776},{"$f":"BM56/BL56","v":0.60161359669864711},{"$f":"BL56*BH56*BJ$11","v":9.6522993805855717E-2},{"$f":"MAX(MIN(BQ$11,CA$11*BP$11*BI56*(BH56-BO$11)/BH56),-BQ$11)","v":-108.84914110523228},-1.7097983102287825E-2,{"$f":"MIN(BU$11,CA$11*BT$11*BI56*(BI$11-BH56-BS$11)/BH56)","v":350.64933374609507},7.9315010703567917E-2,{"$f":"MIN($BY$11,CA$11*$BX$11*BI56*(BI$11-BH56-$BW$11)/BH56)","v":500},0,{"$f":"(0.5*BI$11-BH56+BN56*BH56)*BO56+(0.5*BI$11-BO$11)*BQ56+(0.5*BI$11-BS$11)*BS56+(0.5*BI$11-BW$11)*BU56","v":2.8165647722228619E-2},{"$f":"BO56+BQ56-BS56-BU56","v":1.0999999999997123E-4},{"$f":"$CG$11+0.00001","v":1.0000000000000001E-5},{"$f":"BL56*BJ$11","v":2.9404743982684565},{"$f":"IF(BP55<BQ$11,CA$11*BI56*BN$11*BP$11,BN$11*BQ$11)","v":0.17680882484518917},{"$f":"IF(BR55<BU$11,CA$11*BI56*BR$11*BT$11,-BR$11*BU$11)","v":-7.9315010703567917E-2},{"$f":"IF(BT55<BY$11,CA$11*BI56*$BV$11*$BX$11,-$BV$11*BY$11)","v":0},{"$f":"-(BX56+0.0001)","v":-1.1E-4},{"$f":"IF(BP55<BQ$11,BO$11*CA$11*BI56*BN$11*BP$11,0)","v":6.3651176944268095E-3},{"$f":"IF(BR55<BU$11,(BI$11-BS$11)*CA$11*BI56*BR$11*BT$11,0)","v":0},{"$f":"IF(BT55<BY$11,(BI$11-$BW$11)*CA$11*BI56*$BV$11*$BX$11,0)","v":0}]
[null,null,null,null,null,null,null,null,null,null,null,null,null,null,null,null,null,null,null,null,null,null,null,null,null,null,null,null,null,null,null,null,null,null,null,null,null,null,null,null,null,null,null,null,null,null,null,null,null,null,null,null,null,null,null,null,null,null,null,"hc","e0","a'","b'","N'","tN'","t'","Nc","sac","Nac","sat","Nat","sat","Nat","Mtot","N","N","A","B1","B2'","B2","B3","C1","C2","C2'"]
[]
[]
[]
[null,null,null,null,null,null,null,null,null,null,null,null,null,null,null,null,null,null,null,null,null,null,null,null,null,null,null,null,null,null,null,null,null,null,null,null,null,null,null,null,null,null,null,null,null,null,null,null,null,null,null,null,null,null,null,null,null,null,null,"FORSKYDNING"]
[]
[null,null,null,null,null,null,null,null,null,null,null,null,null,null,null,null,null,null,null,null,null,null,null,null,null,null,null,null,null,null,null,null,null,null,null,null,null,null,null,null,null,null,null,null,null,null,null,null,null,null,null,null,null,null,null,null,null,null,null,null,null,"V","v","f_cd","b","h","h_int","c","b","cot0","w","a","d","A","f_yd"]
[null,null,null,null,null,null,null,null,null,null,null,null,null,null,null,null,null,null,null,null,null,null,null,null,null,null,null,null,null,null,null,null,null,null,null,null,null,null,null,null,null,null,null,null,null,null,null,null,null,null,null,null,null,null,null,null,null,null,null," Betontrykbrud",null,{"$f":"1000*(BK64*BL64*BR64)/((1+BR64^2)*(1/(BM64*BO64)+BS64/((1.4*BQ64)*(BM64-BQ64*BM64)*(BN64-BQ64*BM64))))","v":254.45333659962088},{"$f":"0.7-$L$21/200","v":0.52499999999999991},{"$f":"AT29*$L$22","v":35},{"$f":"BJ11","v":0.11476426407111269},{"$f":"BI11","v":0.38238213203555638},{"$f":"$J$34/1000","v":0.34992270595491748},{"$f":"($N$13-AT40*L27)/1000","v":1.9382132035556346E-2},{"$f":"MIN(BN64/(2*(BM64+BN64)),0.5)","v":0.38457699284368485},{"$f":"$O$15","v":2.5},{"$f":"$O$33/(1000*BM64)","v":0}]
[null,null,null,null,null,null,null,null,null,null,null,null,null,null,null,null,null,null,null,null,null,null,null,null,null,null,null,null,null,null,null,null,null,null,null,null,null,null,null,null,null,null,null,null,null,null,null,null,null,null,null,null,null,null,null,null,null,null,null," Bøjler, type 1",null,{"$f":"MIN($BJ$64,1000*BV65*BW65*BR65/(BT65*(1/BO65+BS65*BM65/((BM65-BQ65*BM65)*(BN65-BQ65*BM65)))))","v":125.25179361120101},null,null,{"$f":"BM64","v":0.11476426407111269},{"$f":"BN64","v":0.38238213203555638},{"$f":"BO64","v":0.34992270595491748},{"$f":"BP64","v":1.9382132035556346E-2},{"$f":"MIN(BN65/(2*(BM65+BN65)),0.5)","v":0.38457699284368485},{"$f":"$O$15","v":2.5},{"$f":"BS64","v":0},{"$f":"$N$15/1000","v":0.15},{"$f":"M15","v":6},{"$f":"2*PI()*(BU65/1000)^2/4","v":5.6548667764616275E-5},{"$f":"AT27*O22","v":379.78753107677795}]
[null,null,null,null,null,null,null,null,null,null,null,null,null,null,null,null,null,null,null,null,null,null,null,null,null,null,null,null,null,null,null,null,null,null,null,null,null,null,null,null,null,null,null,null,null,null,null,null,null,null,null,null,null,null,null,null,null,null,null," Bøjler, type 2",null,{"$f":"MIN($BJ$64,1000*BV66*BW66*BR66/(BT66*(1/BO66+BS66*BM66/((BM66-BQ66*BM66)*(BN66-BQ66*BM66)))))","v":125.25179361120101},null,null,{"$f":"BM64","v":0.11476426407111269},{"$f":"BN65","v":0.38238213203555638},{"$f":"$J$34/1000","v":0.34992270595491748},{"$f":"BP64","v":1.9382132035556346E-2},0.38457699284368485,{"$f":"$O$15","v":2.5},{"$f":"BS64","v":0},{"$f":"$N$16/1000","v":0.15},{"$f":"M16","v":6},{"$f":"2*PI()*(BU66/1000)^2/4","v":5.6548667764616275E-5},{"$f":"BW65","v":379.78753107677795},null,null,null,null,"Vederlagsforankring",null,{"$f":"0.5*BS64*BM64*$AS$22*BR64/(MIN(BN64,BM64)*(1-BQ64))+0.5*$AS$22*BR64","v":137.01691176470587},"KN"]

{"sheet":"Brand2","index":3,"n_rows":101,"n_cols":66,"rows_kept":101,"cut":false,"hidden":false,"merged":[[84,2,84,5],[84,6,84,9]]}
[]
[]
[null,"Nedbøjninger",null,null,null,null,null,null,null,null,"p/P","x1","x2","R1","R2",0,1,2,3,4,5,6,7,8,9,10,11,12,13,14,15,16,17,18,19,20,21,22,23,24,25,26,27,28,29,30,31,32,33,34,35,36,37,38,39,40]
[null,"L","(m)",{"$f":"Brand!L8","v":1.7},null,null,null,null,null,null,null,null,null,null,null,0,{"$f":"Q3*($BD$4-$P$4)/40","v":4.2499999999999996E-2},8.4999999999999992E-2,0.1275,0.16999999999999998,0.21249999999999999,0.255,0.29749999999999999,0.33999999999999997,0.38249999999999995,0.42499999999999999,0.46749999999999997,0.51,0.55249999999999999,0.59499999999999997,0.63749999999999996,0.67999999999999994,0.72249999999999992,0.7649999999999999,0.80749999999999988,0.85,0.89249999999999985,0.93499999999999994,0.97750000000000004,1.02,1.0625,1.105,1.1475,1.19,1.2324999999999999,1.2749999999999999,1.3174999999999999,1.3599999999999999,1.4025000000000001,1.4449999999999998,1.4875,1.5299999999999998,1.5725,1.6149999999999998,1.6575,{"$f":"$D$4","v":1.7},{"$f":"L18","v":0.26},{"$f":"L22","v":0},{"$f":"L26","v":0}]
[]
[null,null,null,null,null,null,null,null,"p1","L",{"$f":"D12","v":0},{"$f":"D16","v":0},{"$f":"D17","v":1.7},{"$f":"(M6-L6)*K6-O6","v":0},{"$f":"0.5*K6*(M6^2-L6^2)/$D$4","v":0},{"$f":"$N6*P$4-IF(P$4>$L6,0.5*($L6-P$4)^2*$K6)+IF(P$4>$M6,0.5*(P$4-$M6)^2*$K6)","v":0},0,0,0,0,0,0,0,0,0,{"$f":"$N6*Z$4-IF(Z$4>$L6,0.5*($L6-Z$4)^2*$K6)+IF(Z$4>$M6,0.5*(Z$4-$M6)^2*$K6)","v":0},0,0,0,0,0,0,0,0,0,{"$f":"$N6*AJ$4-IF(AJ$4>$L6,0.5*($L6-AJ$4)^2*$K6)+IF(AJ$4>$M6,0.5*(AJ$4-$M6)^2*$K6)","v":0},0,0,0,0,0,0,0,0,0,{"$f":"$N6*AT$4-IF(AT$4>$L6,0.5*($L6-AT$4)^2*$K6)+IF(AT$4>$M6,0.5*(AT$4-$M6)^2*$K6)","v":0},0,0,0,0,0,0,0,0,0,0,0,0,0]
[null,null,null,null,null,null,null,null,"p1","K",{"$f":"D13","v":1.4},{"$f":"D16","v":0},{"$f":"D17","v":1.7},{"$f":"(M7-L7)*K7-O7","v":1.19},{"$f":"0.5*K7*(M7^2-L7^2)/$D$4","v":1.19},0,4.9310624999999997E-2,9.6092499999999997E-2,0.140345625,0.18206999999999998,0.22126562499999997,0.25793250000000001,0.29207062499999997,0.32367999999999997,0.35276062499999994,0.37931249999999994,0.40333562499999998,0.42483000000000004,0.44379562499999992,0.46023249999999999,0.47414062499999993,0.48552000000000001,0.49437062499999995,0.50069249999999998,0.50448562500000005,0.50574999999999992,0.50448562500000005,0.50069249999999998,0.49437062499999995,0.48552000000000006,0.47414062500000009,0.46023249999999982,0.44379562500000003,0.42483000000000004,0.4033356250000002,0.37931249999999994,0.35276062499999994,0.32368000000000019,0.29207062500000003,0.25793250000000012,0.2212656249999998,0.18207000000000018,0.14034562499999992,9.6092500000000358E-2,4.9310625000000163E-2,0,0.26207999999999998,0,0]
[null,null,null,null,null,null,null,null,"p1","d",{"$f":"D14","v":1.4},{"$f":"D16","v":0},{"$f":"D17","v":1.7},{"$f":"(M8-L8)*K8-O8","v":1.19},{"$f":"0.5*K8*(M8^2-L8^2)/$D$4","v":1.19},0,4.9310624999999997E-2,9.6092499999999997E-2,0.140345625,0.18206999999999998,0.22126562499999997,0.25793250000000001,0.29207062499999997,0.32367999999999997,0.35276062499999994,0.37931249999999994,0.40333562499999998,0.42483000000000004,0.44379562499999992,0.46023249999999999,0.47414062499999993,0.48552000000000001,0.49437062499999995,0.50069249999999998,0.50448562500000005,0.50574999999999992,0.50448562500000005,0.50069249999999998,0.49437062499999995,0.48552000000000006,0.47414062500000009,0.46023249999999982,0.44379562500000003,0.42483000000000004,0.4033356250000002,0.37931249999999994,0.35276062499999994,0.32368000000000019,0.29207062500000003,0.25793250000000012,0.2212656249999998,0.18207000000000018,0.14034562499999992,9.6092500000000358E-2,4.9310625000000163E-2,0,0.26207999999999998,0,0]
[]
[null,null,null,null,null,null,null,null,"p2","L",{"$f":"E12","v":0},{"$f":"E16","v":0},{"$f":"E17","v":0},{"$f":"(M10-L10)*K10-O10","v":0},{"$f":"0.5*K10*(M10^2-L10^2)/$D$4","v":0},{"$f":"$N10*P$4-IF(P$4>$L10,0.5*($L10-P$4)^2*$K10)+IF(P$4>$M10,0.5*(P$4-$M10)^2*$K10)+IF(P$4>$D$4,(P$4-$D$4)*$O10)","v":0},{"$f":"$N10*Q$4-IF(Q$4>$L10,0.5*($L10-Q$4)^2*$K10)+IF(Q$4>$M10,0.5*(Q$4-$M10)^2*$K10)","v":0},0,0,0,0,0,0,0,0,0,{"$f":"$N10*AA$4-IF(AA$4>$L10,0.5*($L10-AA$4)^2*$K10)+IF(AA$4>$M10,0.5*(AA$4-$M10)^2*$K10)","v":0},0,0,0,0,0,0,0,0,0,{"$f":"$N10*AK$4-IF(AK$4>$L10,0.5*($L10-AK$4)^2*$K10)+IF(AK$4>$M10,0.5*(AK$4-$M10)^2*$K10)","v":0},0,0,0,0,0,0,0,0,0,{"$f":"$N10*AU$4-IF(AU$4>$L10,0.5*($L10-AU$4)^2*$K10)+IF(AU$4>$M10,0.5*(AU$4-$M10)^2*$K10)","v":0},0,0,0,0,0,0,0,0,0,0,0,0]
[null,"Jævnt fordelte laste",null,"p1","p2","p3",null,null,"p2","K",{"$f":"E13","v":0},{"$f":"E16","v":0},{"$f":"E17","v":0},{"$f":"(M11-L11)*K11-O11","v":0},{"$f":"0.5*K11*(M11^2-L11^2)/$D$4","v":0},{"$f":"$N11*P$4-IF(P$4>$L11,0.5*($L11-P$4)^2*$K11)+IF(P$4>$M11,0.5*(P$4-$M11)^2*$K11)+IF(P$4>$D$4,(P$4-$D$4)*$O11)","v":0},0,0,0,0,0,0,0,0,0,0,0,0,0,0,0,0,0,0,0,0,0,0,0,0,0,0,0,0,0,0,0,0,0,0,0,0,0,0,0,0,0,0,0]
[null,null,null,null,null,null,null,null,"p2","d",{"$f":"E14","v":0},{"$f":"E16","v":0},{"$f":"E17","v":0},{"$f":"(M12-L12)*K12-O12","v":0},{"$f":"0.5*K12*(M12^2-L12^2)/$D$4","v":0},{"$f":"$N12*P$4-IF(P$4>$L12,0.5*($L12-P$4)^2*$K12)+IF(P$4>$M12,0.5*(P$4-$M12)^2*$K12)+IF(P$4>$D$4,(P$4-$D$4)*$O12)","v":0},0,0,0,0,0,0,0,0,0,0,0,0,0,0,0,0,0,0,0,0,0,0,0,0,0,0,0,0,0,0,0,0,0,0,0,0,0,0,0,0,0,0,0]
[null,"Kar. værdi","(kN/m)",{"$f":"Brand2!D88*D26","v":1.4},{"$f":"Brand2!E88*D26","v":0},{"$f":"Brand2!F88*D26","v":0}]
[null,"Regnm. værdi","(kN/m)",{"$f":"Brand2!D89*D26","v":1.4},{"$f":"Brand2!E89*D26","v":0},{"$f":"Brand2!F89*D26","v":0},null,null,"p3","L",{"$f":"F12","v":0},{"$f":"F16","v":0},{"$f":"F17","v":0},{"$f":"(M14-L14)*K14-O14","v":0},{"$f":"0.5*K14*(M14^2-L14^2)/$D$4","v":0},{"$f":"$N14*P$4-IF(P$4>$L14,0.5*($L14-P$4)^2*$K14)+IF(P$4>$M14,0.5*(P$4-$M14)^2*$K14)+IF(P$4>$D$4,(P$4-$D$4)*$O14)","v":0},{"$f":"$N14*Q$4-IF(Q$4>$L14,0.5*($L14-Q$4)^2*$K14)+IF(Q$4>$M14,0.5*(Q$4-$M14)^2*$K14)","v":0},0,0,0,0,0,0,0,0,0,{"$f":"$N14*AA$4-IF(AA$4>$L14,0.5*($L14-AA$4)^2*$K14)+IF(AA$4>$M14,0.5*(AA$4-$M14)^2*$K14)","v":0},0,0,0,0,0,0,0,0,0,{"$f":"$N14*AK$4-IF(AK$4>$L14,0.5*($L14-AK$4)^2*$K14)+IF(AK$4>$M14,0.5*(AK$4-$M14)^2*$K14)","v":0},0,0,0,0,0,0,0,0,0,{"$f":"$N14*AU$4-IF(AU$4>$L14,0.5*($L14-AU$4)^2*$K14)+IF(AU$4>$M14,0.5*(AU$4-$M14)^2*$K14)","v":0},0,0,0,0,0,0,0,0,0,0,0,0]
[null,"exc","(m)",{"$f":"Brand2!D90","v":0},{"$f":"Brand2!E90","v":0},{"$f":"Brand2!F90","v":0},null,null,"p3","K",{"$f":"F13","v":0},{"$f":"F16","v":0},{"$f":"F17","v":0},{"$f":"(M15-L15)*K15-O15","v":0},{"$f":"0.5*K15*(M15^2-L15^2)/$D$4","v":0},{"$f":"$N15*P$4-IF(P$4>$L15,0.5*($L15-P$4)^2*$K15)+IF(P$4>$M15,0.5*(P$4-$M15)^2*$K15)+IF(P$4>$D$4,(P$4-$D$4)*$O15)","v":0},0,0,0,0,0,0,0,0,0,0,0,0,0,0,0,0,0,0,0,0,0,0,0,0,0,0,0,0,0,0,0,0,0,0,0,0,0,0,0,0,0,0,0]
[null,"x1","(m)",{"$f":"Brand2!D91","v":0},{"$f":"Brand2!E91","v":0},{"$f":"Brand2!F91","v":0},null,null,"p3","d",{"$f":"F14","v":0},{"$f":"F16","v":0},{"$f":"F17","v":0},{"$f":"(M16-L16)*K16-O16","v":0},{"$f":"0.5*K16*(M16^2-L16^2)/$D$4","v":0},{"$f":"$N16*P$4-IF(P$4>$L16,0.5*($L16-P$4)^2*$K16)+IF(P$4>$M16,0.5*(P$4-$M16)^2*$K16)+IF(P$4>$D$4,(P$4-$D$4)*$O16)","v":0},0,0,0,0,0,0,0,0,0,0,0,0,0,0,0,0,0,0,0,0,0,0,0,0,0,0,0,0,0,0,0,0,0,0,0,0,0,0,0,0,0,0,0]
[null,"x2","(m)",{"$f":"Brand2!D92","v":1.7},{"$f":"Brand2!E92","v":0},{"$f":"Brand2!F92","v":0}]
[null,null,null,null,null,null,null,null,"P1","L",{"$f":"D20","v":0},{"$f":"D24","v":0.26},null,{"$f":"K18-O18","v":0},{"$f":"K18*L18/$D$4","v":0},{"$f":"$N18*P$4-IF(P$4>$L18,(P$4-$L18)*$K18)","v":0},0,0,0,0,0,0,0,0,0,{"$f":"$N18*Z$4-IF(Z$4>$L18,(Z$4-$L18)*$K18)","v":0},0,0,0,0,0,0,0,0,0,{"$f":"$N18*AJ$4-IF(AJ$4>$L18,(AJ$4-$L18)*$K18)","v":0},0,0,0,0,0,0,0,0,0,{"$f":"$N18*AT$4-IF(AT$4>$L18,(AT$4-$L18)*$K18)","v":0},0,0,0,0,0,0,0,0,0,0,0,0,0]
[null,"Punktlaste",null,"P1","P2","P3",null,null,"P1","K",{"$f":"D21","v":128},{"$f":"D24","v":0.26},null,{"$f":"K19-O19","v":108.4235294117647},{"$f":"K19*L19/$D$4","v":19.576470588235296},0,4.6079999999999997,9.2159999999999993,13.824,18.431999999999999,23.04,27.648,27.456000000000003,26.624000000000002,25.792000000000002,24.96,24.128,23.295999999999999,22.463999999999999,21.632000000000005,20.799999999999997,19.968000000000004,19.135999999999996,18.304000000000002,17.472000000000008,16.64,15.808000000000007,14.975999999999999,14.144000000000005,13.311999999999998,12.480000000000004,11.647999999999996,10.816000000000003,9.9840000000000089,9.1519999999999868,8.3199999999999932,7.4879999999999995,6.6560000000000059,5.8239999999999839,4.9919999999999902,4.1599999999999966,3.328000000000003,2.4960000000000093,1.6640000000000157,0.83199999999999363,0,28.190117647058823,0,0]
[null,null,null,null,null,null,null,null,"P1","d",{"$f":"D22","v":128},{"$f":"D24","v":0.26},null,{"$f":"K20-O20","v":108.4235294117647},{"$f":"K20*L20/$D$4","v":19.576470588235296},0,4.6079999999999997,9.2159999999999993,13.824,18.431999999999999,23.04,27.648,27.456000000000003,26.624000000000002,25.792000000000002,24.96,24.128,23.295999999999999,22.463999999999999,21.632000000000005,20.799999999999997,19.968000000000004,19.135999999999996,18.304000000000002,17.472000000000008,16.64,15.808000000000007,14.975999999999999,14.144000000000005,13.311999999999998,12.480000000000004,11.647999999999996,10.816000000000003,9.9840000000000089,9.1519999999999868,8.3199999999999932,7.4879999999999995,6.6560000000000059,5.8239999999999839,4.9919999999999902,4.1599999999999966,3.328000000000003,2.4960000000000093,1.6640000000000157,0.83199999999999363,0,28.190117647058823,0,0]
[null,"Kar. værdi","(kN)",{"$f":"Brand2!H88*D26","v":128},{"$f":"Brand2!I88*D26","v":0},{"$f":"Brand2!J88*D26","v":0}]
[null,"Regnm. værdi","(kN)",{"$f":"Brand2!H89*D26","v":128},{"$f":"Brand2!I89*D26","v":0},{"$f":"Brand2!J89*D26","v":0},null,null,"P2","L",{"$f":"E20","v":0},{"$f":"E24","v":0},null,{"$f":"K22-O22","v":0},{"$f":"K22*L22/$D$4","v":0},{"$f":"$N22*P$4-IF(P$4>$L22,(P$4-$L22)*$K22)","v":0},0,0,0,0,0,0,0,0,0,{"$f":"$N22*Z$4-IF(Z$4>$L22,(Z$4-$L22)*$K22)","v":0},0,0,0,0,0,0,0,0,0,{"$f":"$N22*AJ$4-IF(AJ$4>$L22,(AJ$4-$L22)*$K22)","v":0},0,0,0,0,0,0,0,0,0,{"$f":"$N22*AT$4-IF(AT$4>$L22,(AT$4-$L22)*$K22)","v":0},0,0,0,0,0,0,0,0,0,0,0,0,0]
[null,"exc","(m)",{"$f":"Brand2!H90","v":0},{"$f":"Brand2!I90","v":0},{"$f":"Brand2!J90","v":0},null,null,"P2","K",{"$f":"E21","v":0},{"$f":"E24","v":0},null,{"$f":"K23-O23","v":0},{"$f":"K23*L23/$D$4","v":0},0,0,0,0,0,0,0,0,0,0,0,0,0,0,0,0,0,0,0,0,0,0,0,0,0,0,0,0,0,0,0,0,0,0,0,0,0,0,0,0,0,0,0,0]
[null,"x","(m)",{"$f":"Brand2!H91","v":0.26},{"$f":"Brand2!I91","v":0},{"$f":"Brand2!J91","v":0},null,null,"P2","d",{"$f":"E22","v":0},{"$f":"E24","v":0},null,{"$f":"K24-O24","v":0},{"$f":"K24*L24/$D$4","v":0},0,0,0,0,0,0,0,0,0,0,0,0,0,0,0,0,0,0,0,0,0,0,0,0,0,0,0,0,0,0,0,0,0,0,0,0,0,0,0,0,0,0,0,0]
[]
[null,"Inddatatest",{"$f":"MAX(Brand!BC16:BC45)","v":0},{"$f":"IF(C26=1,0,1)","v":1},null,null,null,null,"P3","L",{"$f":"F20","v":0},{"$f":"F24","v":0},null,{"$f":"K26-O26","v":0},{"$f":"K26*L26/$D$4","v":0},{"$f":"$N26*P$4-IF(P$4>$L26,(P$4-$L26)*$K26)","v":0},0,0,0,0,0,0,0,0,0,{"$f":"$N26*Z$4-IF(Z$4>$L26,(Z$4-$L26)*$K26)","v":0},0,0,0,0,0,0,0,0,0,{"$f":"$N26*AJ$4-IF(AJ$4>$L26,(AJ$4-$L26)*$K26)","v":0},0,0,0,0,0,0,0,0,0,{"$f":"$N26*AT$4-IF(AT$4>$L26,(AT$4-$L26)*$K26)","v":0},0,0,0,0,0,0,0,0,0,0,0,0,0]
[null,null,null,null,null,null,null,null,"P3","K",{"$f":"F21","v":0},{"$f":"F24","v":0},null,{"$f":"K27-O27","v":0},{"$f":"K27*L27/$D$4","v":0},0,0,0,0,0,0,0,0,0,0,0,0,0,0,0,0,0,0,0,0,0,0,0,0,0,0,0,0,0,0,0,0,0,0,0,0,0,0,0,0,0,0,0,0]
[null,null,null,null,null,null,null,null,"P3","d",{"$f":"F22","v":0},{"$f":"F24","v":0},null,{"$f":"K28-O28","v":0},{"$f":"K28*L28/$D$4","v":0},0,0,0,0,0,0,0,0,0,0,0,0,0,0,0,0,0,0,0,0,0,0,0,0,0,0,0,0,0,0,0,0,0,0,0,0,0,0,0,0,0,0,0,0]
[]
[null,null,null,null,null,null,null,null,"MOMENTER",null,null,null,null,null,"punkt",{"$f":"P3","v":0},1,2,3,4,5,6,7,8,9,10,11,12,13,14,15,16,17,18,19,20,21,22,23,24,25,26,27,28,29,30,31,32,33,34,35,36,37,38,39,40,{"$f":"BE4*40/$D$4","v":6.1176470588235299},{"$f":"BF4*40/$D$4","v":0},{"$f":"BG4*40/$D$4","v":0}]
[null,null,null,null,null,null,null,null,null,null,null,null,null,null," :    ",{"$f":"P7+P11+P15+P19+P23+P27","v":0},4.657310625,9.3120924999999986,13.964345625,18.614069999999998,23.261265625,27.905932499999999,27.748070625000004,26.947680000000002,26.144760625,25.339312500000002,24.531335625000001,23.720829999999999,22.907795624999999,22.092232500000005,21.274140624999998,20.453520000000005,19.630370624999994,18.804692500000002,17.976485625000009,17.14575,16.312485625000008,15.476692499999999,14.638370625000006,13.797519999999997,12.954140625000004,12.108232499999996,11.259795625000002,10.408830000000009,9.5553356249999872,8.6993124999999925,7.8407606249999997,6.9796800000000063,6.1160706249999839,5.2499324999999901,4.3812656249999966,3.5100700000000034,2.6363456250000095,1.760092500000016,0.8813106249999938,0,28.452197647058824,0,0]
[null,null,null,null,null,null,null,null,null,null,null,null,null,null," :    ",{"$f":"P8+P12+P16+P20+P24+P28","v":0},4.657310625,9.3120924999999986,13.964345625,18.614069999999998,23.261265625,27.905932499999999,27.748070625000004,26.947680000000002,26.144760625,25.339312500000002,24.531335625000001,23.720829999999999,22.907795624999999,22.092232500000005,21.274140624999998,20.453520000000005,19.630370624999994,18.804692500000002,17.976485625000009,17.14575,16.312485625000008,15.476692499999999,14.638370625000006,13.797519999999997,12.954140625000004,12.108232499999996,11.259795625000002,10.408830000000009,9.5553356249999872,8.6993124999999925,7.8407606249999997,6.9796800000000063,6.1160706249999839,5.2499324999999901,4.3812656249999966,3.5100700000000034,2.6363456250000095,1.760092500000016,0.8813106249999938,0,28.452197647058824,0,0]
[]
[null,null,null,null,null,null,null,null,null,null,"p/P","x1","x2",null,null,0,1,2,3,4,5,6,7,8,9,10,11,12,13,14,15,16,17,18,19,20,21,22,23,24,25,26,27,28,29,30,31,32,33,34,35,36,37,38,39,40,null,null,null,null,null,"hi cot 0","L-hi cot 0",null,"½hi cot 0","L-½hi cot 0"]
[null,null,null,null,null,null,null,null,null,null,null,null,null,null,null,0,{"$f":"Q34*($BD$4-$P$4)/40","v":4.2499999999999996E-2},8.4999999999999992E-2,0.1275,0.16999999999999998,0.21249999999999999,0.255,0.29749999999999999,0.33999999999999997,0.38249999999999995,0.42499999999999999,0.46749999999999997,0.51,0.55249999999999999,0.59499999999999997,0.63749999999999996,0.67999999999999994,0.72249999999999992,0.7649999999999999,0.80749999999999988,0.85,0.89249999999999985,0.93499999999999994,0.97750000000000004,1.02,1.0625,1.105,1.1475,1.19,1.2324999999999999,1.2749999999999999,1.3174999999999999,1.3599999999999999,1.4025000000000001,1.4449999999999998,1.4875,1.5299999999999998,1.5725,1.6149999999999998,1.6575,{"$f":"$D$4","v":1.7},0,{"$f":"Brand!AS16*Brand!O15/1000","v":0.8748067648872937},{"$f":"BH35-Brand!AS16*Brand!O15/1000","v":0.82519323511270626},{"$f":"Brand!L8","v":1.7},null,{"$f":"BF35","v":0.8748067648872937},{"$f":"BG35","v":0.82519323511270626},null,{"$f":"0.5*BJ35","v":0.43740338244364685},{"$f":"BH35-BM35","v":1.262596617556353}]
[null,null,null,null,null,null,null,null,"Venstresidig forskydning"]
[null,"Excentriciteter",null,null,null,null,null,null,{"$f":"I8","v":"p1"},{"$f":"J8","v":"d"},{"$f":"K8","v":1.4},{"$f":"L8","v":0},{"$f":"M8","v":1.7},null,null,{"$f":"IF(P$35<=$L37,$K37*($M37-$L37)*($D$4-0.5*($L37+$M37))/$D$4,IF(P$35<=$M37,$K37*($M37-P$35)*($D$4-0.5*(P$35+$M37))/$D$4,0))","v":1.19},1.1312437499999999,1.0739749999999999,1.01819375,0.96390000000000009,0.91109375000000015,0.85977499999999973,0.80994374999999985,0.76159999999999983,0.7147437499999999,{"$f":"IF(Z$35<=$L37,$K37*($M37-$L37)*($D$4-0.5*($L37+$M37))/$D$4,IF(Z$35<=$M37,$K37*($M37-Z$35)*($D$4-0.5*(Z$35+$M37))/$D$4,0))","v":0.66937499999999994},0.62549374999999985,0.58309999999999995,0.54219374999999992,0.50277499999999997,0.46484375,0.42839999999999995,0.39344375000000004,0.35997500000000004,0.32799375000000003,{"$f":"IF(AJ$35<=$L37,$K37*($M37-$L37)*($D$4-0.5*($L37+$M37))/$D$4,IF(AJ$35<=$M37,$K37*($M37-AJ$35)*($D$4-0.5*(AJ$35+$M37))/$D$4,0))","v":0.29750000000000004},0.26849375000000009,0.24097500000000005,0.21494374999999988,0.19040000000000001,0.1673437499999999,0.14577500000000004,0.12569374999999994,0.10710000000000004,8.9993749999999956E-2,{"$f":"IF(AT$35<=$L37,$K37*($M37-$L37)*($D$4-0.5*($L37+$M37))/$D$4,IF(AT$35<=$M37,$K37*($M37-AT$35)*($D$4-0.5*(AT$35+$M37))/$D$4,0))","v":7.4375000000000038E-2},6.0243749999999985E-2,4.7600000000000052E-2,3.6443749999999969E-2,2.6775000000000045E-2,1.8593749999999985E-2,1.1900000000000036E-2,6.693749999999994E-3,2.9750000000000206E-3,7.4374999999999929E-4,0,null,null,null,null,null,{"$f":"IF(BJ$35<=$L37,$K37*($M37-$L37)*($D$4-0.5*($L37+$M37))/$D$4,IF(BJ$35<=$M37,$K37*($M37-BJ$35)*($D$4-0.5*(BJ$35+$M37))/$D$4,0))","v":0.28038865452531875},0.31511812536753009,null,{"$f":"IF(BM$35<=$L37,$K37*($M37-$L37)*($D$4-0.5*($L37+$M37))/$D$4,IF(BM$35<=$M37,$K37*($M37-BM$35)*($D$4-0.5*(BM$35+$M37))/$D$4,0))","v":0.65641479592077667},7.8779531341882481E-2]
[null,"exc. p_1","(mm)",{"$f":"D15","v":0},null,null,null,null,{"$f":"I12","v":"p2"},{"$f":"J12","v":"d"},{"$f":"K12","v":0},{"$f":"L12","v":0},{"$f":"M12","v":0},null,null,0,0,0,0,0,0,0,0,0,0,0,0,0,0,0,0,0,0,0,0,0,0,0,0,0,0,0,0,0,0,0,0,0,0,0,0,0,0,0,0,0,null,null,null,null,null,0,0,null,0,0]
[null,"exc. p_2","(mm)",{"$f":"E15","v":0},null,null,null,null,{"$f":"I16","v":"p3"},{"$f":"J16","v":"d"},{"$f":"K16","v":0},{"$f":"L16","v":0},{"$f":"M16","v":0},null,null,0,0,0,0,0,0,0,0,0,0,0,0,0,0,0,0,0,0,0,0,0,0,0,0,0,0,0,0,0,0,0,0,0,0,0,0,0,0,0,0,0,null,null,null,null,null,0,0,null,0,0]
[null,"exc. p_3","(mm)",{"$f":"F15","v":0},null,null,null,null,{"$f":"I20","v":"P1"},{"$f":"J20","v":"d"},{"$f":"K20","v":128},{"$f":"L20","v":0.26},{"$f":"M20","v":0},null,null,{"$f":"IF(P$35<=$L40,$K40*($D$4-$L40)/$D$4,0)","v":108.4235294117647},108.4235294117647,108.4235294117647,108.4235294117647,108.4235294117647,108.4235294117647,108.4235294117647,0,0,0,{"$f":"IF(Z$35<=$L40,$K40*($D$4-$L40)/$D$4,0)","v":0},0,0,0,0,0,0,0,0,0,{"$f":"IF(AJ$35<=$L40,$K40*($D$4-$L40)/$D$4,0)","v":0},0,0,0,0,0,0,0,0,0,{"$f":"IF(AT$35<=$L40,$K40*($D$4-$L40)/$D$4,0)","v":0},0,0,0,0,0,0,0,0,0,0,null,null,null,null,null,{"$f":"IF(BJ$35<=$L40,$K40*($D$4-$L40)/$D$4,0)","v":0},0,null,{"$f":"IF(BM$35<=$L40,$K40*($D$4-$L40)/$D$4,0)","v":0},0]
[null,"exc. P_1","(mm)",{"$f":"D23","v":0},null,null,null,null,{"$f":"I24","v":"P2"},{"$f":"J24","v":"d"},{"$f":"K24","v":0},{"$f":"L24","v":0},{"$f":"M24","v":0},null,null,0,0,0,0,0,0,0,0,0,0,0,0,0,0,0,0,0,0,0,0,0,0,0,0,0,0,0,0,0,0,0,0,0,0,0,0,0,0,0,0,0,null,null,null,null,null,0,0,null,0,0]
[null,"exc. P_2","(mm)",{"$f":"E23","v":0},null,null,null,null,{"$f":"I28","v":"P3"},{"$f":"J28","v":"d"},{"$f":"K28","v":0},{"$f":"L28","v":0},{"$f":"M28","v":0},null,null,0,0,0,0,0,0,0,0,0,0,0,0,0,0,0,0,0,0,0,0,0,0,0,0,0,0,0,0,0,0,0,0,0,0,0,0,0,0,0,0,0,null,null,null,null,null,0,0,null,0,0]
[null,"exc. P_3","(mm)",{"$f":"F23","v":0},null,null,null,null,"Højresidig forskydning"]
[null,null,null,null,null,null,null,null,{"$f":"I37","v":"p1"},"d",1.4,0,1.7,null,null,{"$f":"IF(P$35<$L44,0,IF(P$35<$M44,$K44*(P$35-$L44)*0.5*($L44+P$35)/$D$4,$K44*($M44-$L44)*0.5*($L44+$M44)/$D$4))","v":0},7.4374999999999984E-4,2.9749999999999993E-3,6.6937499999999992E-3,1.1899999999999997E-2,1.8593749999999999E-2,2.6774999999999997E-2,3.6443749999999997E-2,4.759999999999999E-2,6.0243749999999978E-2,{"$f":"IF(Z$35<$L44,0,IF(Z$35<$M44,$K44*(Z$35-$L44)*0.5*($L44+Z$35)/$D$4,$K44*($M44-$L44)*0.5*($L44+$M44)/$D$4))","v":7.4374999999999997E-2},8.9993749999999997E-2,0.10709999999999999,0.12569374999999999,0.14577499999999999,0.16734374999999999,0.19039999999999996,0.21494374999999993,0.24097499999999991,0.26849374999999992,{"$f":"IF(AJ$35<$L44,0,IF(AJ$35<$M44,$K44*(AJ$35-$L44)*0.5*($L44+AJ$35)/$D$4,$K44*($M44-$L44)*0.5*($L44+$M44)/$D$4))","v":0.29749999999999999},0.32799374999999986,0.35997499999999999,0.39344375000000004,0.42839999999999995,0.46484375,0.50277499999999997,0.54219374999999992,0.58309999999999995,0.62549374999999985,{"$f":"IF(AT$35<$L44,0,IF(AT$35<$M44,$K44*(AT$35-$L44)*0.5*($L44+AT$35)/$D$4,$K44*($M44-$L44)*0.5*($L44+$M44)/$D$4))","v":0.66937499999999994},0.7147437499999999,0.76159999999999983,0.80994375000000007,0.85977499999999973,0.91109375000000015,0.96389999999999965,1.01819375,1.0739749999999997,1.1312437499999999,1.19,null,null,null,null,null,{"$f":"IF(BJ$35<$L44,0,IF(BJ$35<$M44,$K44*(BJ$35-$L44)*0.5*($L44+BJ$35)/$D$4,$K44*($M44-$L44)*0.5*($L44+$M44)/$D$4))","v":0.31511812536752992},0.28038865452531875,null,{"$f":"IF(BM$35<$L44,0,IF(BM$35<$M44,$K44*(BM$35-$L44)*0.5*($L44+BM$35)/$D$4,$K44*($M44-$L44)*0.5*($L44+$M44)/$D$4))","v":7.8779531341882481E-2},0.65641479592077667]
[null,null,null,null,null,null,null,null,"p2","d",0,0,0,null,null,0,0,0,0,0,0,0,0,0,0,0,0,0,0,0,0,0,0,0,0,0,0,0,0,0,0,0,0,0,0,0,0,0,0,0,0,0,0,0,0,0,null,null,null,null,null,0,0,null,0,0]
[null,null,null,null,null,null,null,null,"p3","d",0,0,0,null,null,0,0,0,0,0,0,0,0,0,0,0,0,0,0,0,0,0,0,0,0,0,0,0,0,0,0,0,0,0,0,0,0,0,0,0,0,0,0,0,0,0,null,null,null,null,null,0,0,null,0,0]
[null,null,null,null,null,null,null,null,"P1","d",128,0.26,0,null,null,{"$f":"IF(P$35<$L47,0,$K47*$L47/$D$4)","v":0},0,0,0,0,0,0,19.576470588235296,19.576470588235296,19.576470588235296,{"$f":"IF(Z$35<$L47,0,$K47*$L47/$D$4)","v":19.576470588235296},19.576470588235296,19.576470588235296,19.576470588235296,19.576470588235296,19.576470588235296,19.576470588235296,19.576470588235296,19.576470588235296,19.576470588235296,{"$f":"IF(AJ$35<$L47,0,$K47*$L47/$D$4)","v":19.576470588235296},19.576470588235296,19.576470588235296,19.576470588235296,19.576470588235296,19.576470588235296,19.576470588235296,19.576470588235296,19.576470588235296,19.576470588235296,{"$f":"IF(AT$35<$L47,0,$K47*$L47/$D$4)","v":19.576470588235296},19.576470588235296,19.576470588235296,19.576470588235296,19.576470588235296,19.576470588235296,19.576470588235296,19.576470588235296,19.576470588235296,19.576470588235296,19.576470588235296,null,null,null,null,null,{"$f":"IF(BJ$35<$L47,0,$K47*$L47/$D$4)","v":19.576470588235296},19.576470588235296,null,{"$f":"IF(BM$35<$L47,0,$K47*$L47/$D$4)","v":19.576470588235296},19.576470588235296]
[null,null,null,null,null,null,null,null,"P2","d",0,0,0,null,null,0,0,0,0,0,0,0,0,0,0,0,0,0,0,0,0,0,0,0,0,0,0,0,0,0,0,0,0,0,0,0,0,0,0,0,0,0,0,0,0,0,null,null,null,null,null,0,0,null,0,0]
[null,null,null,null,null,null,null,null,"P3","d",0,0,0,null,null,0,0,0,0,0,0,0,0,0,0,0,0,0,0,0,0,0,0,0,0,0,0,0,0,0,0,0,0,0,0,0,0,0,0,0,0,0,0,0,0,0,null,null,null,null,null,0,0,null,0,0]
[]
[null,null,null,null,null,null,null,null,"V_d - venstre",null,null,null,null,null,null,{"$f":"SUM(P37:P42)","v":109.6135294117647},109.5547731617647,109.49750441176471,109.4417231617647,109.3874294117647,109.33462316176471,109.2833044117647,0.80994374999999985,0.76159999999999983,0.7147437499999999,0.66937499999999994,0.62549374999999985,0.58309999999999995,0.54219374999999992,0.50277499999999997,0.46484375,0.42839999999999995,0.39344375000000004,0.35997500000000004,0.32799375000000003,0.29750000000000004,0.26849375000000009,0.24097500000000005,0.21494374999999988,0.19040000000000001,0.1673437499999999,0.14577500000000004,0.12569374999999994,0.10710000000000004,8.9993749999999956E-2,7.4375000000000038E-2,6.0243749999999985E-2,4.7600000000000052E-2,3.6443749999999969E-2,2.6775000000000045E-2,1.8593749999999985E-2,1.1900000000000036E-2,6.693749999999994E-3,2.9750000000000206E-3,7.4374999999999929E-4,0,null,null,null,null,null,{"$f":"SUM(BJ37:BJ42)","v":0.28038865452531875},{"$f":"SUM(BK37:BK42)","v":0.31511812536753009},null,{"$f":"SUM(BM37:BM42)","v":0.65641479592077667},{"$f":"SUM(BN37:BN42)","v":7.8779531341882481E-2}]
[null,null,null,null,null,null,null,null,"V_d - højre",null,null,null,null,null,null,{"$f":"SUM(P44:P49)","v":0},7.4374999999999984E-4,2.9749999999999993E-3,6.6937499999999992E-3,1.1899999999999997E-2,1.8593749999999999E-2,2.6774999999999997E-2,19.612914338235296,19.624070588235295,19.636714338235297,19.650845588235295,19.666464338235297,19.683570588235295,19.702164338235296,19.722245588235296,19.743814338235296,19.766870588235296,19.791414338235295,19.817445588235294,19.844964338235297,19.873970588235295,19.904464338235297,19.936445588235294,19.969914338235295,20.004870588235296,20.041314338235296,20.079245588235295,20.118664338235295,20.159570588235297,20.201964338235296,20.245845588235294,20.291214338235296,20.338070588235297,20.386414338235294,20.436245588235295,20.487564338235295,20.540370588235294,20.594664338235297,20.650445588235296,20.707714338235295,20.766470588235297,null,null,null,null,null,{"$f":"SUM(BJ44:BJ49)","v":19.891588713602825},{"$f":"SUM(BK44:BK49)","v":19.856859242760613},null,{"$f":"SUM(BM44:BM49)","v":19.655250119577179},{"$f":"SUM(BN44:BN49)","v":20.232885384156074}]
[]
[null,null,null,null,null,null,null,null,"FORSKYDNING",null,null,null,null,null,null,{"$f":"P34","v":0},1,2,3,4,5,6,7,8,9,10,11,12,13,14,15,16,17,18,19,20,21,22,23,24,25,26,27,28,29,30,31,32,33,34,35,36,37,38,39,40,{"$f":"BF54","v":20.583688585583381},{"$f":"40*BF35/Brand!$L$8","v":20.583688585583381},{"$f":"40*BG35/Brand!$L$8","v":19.416311414416619},{"$f":"BG54","v":19.416311414416619}]
[null,null,null,null,null,null,null,null,null,null,null,null,null,null," :",{"$f":"MAX(P52,P51)","v":109.6135294117647},109.5547731617647,109.49750441176471,109.4417231617647,109.3874294117647,109.33462316176471,109.2833044117647,19.612914338235296,19.624070588235295,19.636714338235297,19.650845588235295,19.666464338235297,19.683570588235295,19.702164338235296,19.722245588235296,19.743814338235296,19.766870588235296,19.791414338235295,19.817445588235294,19.844964338235297,19.873970588235295,19.904464338235297,19.936445588235294,19.969914338235295,20.004870588235296,20.041314338235296,20.079245588235295,20.118664338235295,20.159570588235297,20.201964338235296,20.245845588235294,20.291214338235296,20.338070588235297,20.386414338235294,20.436245588235295,20.487564338235295,20.540370588235294,20.594664338235297,20.650445588235296,20.707714338235295,20.766470588235297]
[null,null,null,null,null,null,null,null,null,null,null,null,null,null," :",{"$f":"Brand!$O$31","v":125.25179361120101},{"$f":"Brand!$O$31","v":125.25179361120101},{"$f":"Brand!$O$31","v":125.25179361120101},{"$f":"Brand!$O$31","v":125.25179361120101},{"$f":"Brand!$O$31","v":125.25179361120101},{"$f":"Brand!$O$31","v":125.25179361120101},{"$f":"Brand!$O$31","v":125.25179361120101},{"$f":"Brand!$O$31","v":125.25179361120101},{"$f":"Brand!$O$31","v":125.25179361120101},{"$f":"Brand!$O$31","v":125.25179361120101},{"$f":"Brand!$O$31","v":125.25179361120101},{"$f":"Brand!$O$31","v":125.25179361120101},{"$f":"Brand!$O$31","v":125.25179361120101},{"$f":"Brand!$O$31","v":125.25179361120101},{"$f":"Brand!$O$31","v":125.25179361120101},{"$f":"Brand!$O$31","v":125.25179361120101},{"$f":"Brand!$O$31","v":125.25179361120101},{"$f":"Brand!$O$31","v":125.25179361120101},{"$f":"Brand!$O$31","v":125.25179361120101},{"$f":"Brand!$O$31","v":125.25179361120101},{"$f":"Brand!$O$31","v":125.25179361120101},{"$f":"Brand!$O$31","v":125.25179361120101},{"$f":"Brand!$O$31","v":125.25179361120101},{"$f":"Brand!$O$31","v":125.25179361120101},{"$f":"Brand!$O$31","v":125.25179361120101},{"$f":"Brand!$O$31","v":125.25179361120101},{"$f":"Brand!$O$31","v":125.25179361120101},{"$f":"Brand!$O$31","v":125.25179361120101},{"$f":"Brand!$O$31","v":125.25179361120101},{"$f":"Brand!$O$31","v":125.25179361120101},{"$f":"Brand!$O$31","v":125.25179361120101},{"$f":"Brand!$O$31","v":125.25179361120101},{"$f":"Brand!$O$31","v":125.25179361120101},{"$f":"Brand!$O$31","v":125.25179361120101},{"$f":"Brand!$O$31","v":125.25179361120101},{"$f":"Brand!$O$31","v":125.25179361120101},{"$f":"Brand!$O$31","v":125.25179361120101},{"$f":"Brand!$O$31","v":125.25179361120101},{"$f":"Brand!$O$31","v":125.25179361120101},{"$f":"Brand!$O$31","v":125.25179361120101},{"$f":"Brand!$O$31","v":125.25179361120101}]
[null,null,null,null,null,null,null,null,null,null,null,null,null,null," :",{"$f":"Brand!$O$32","v":125.25179361120101},{"$f":"Brand!$O$32","v":125.25179361120101},{"$f":"Brand!$O$32","v":125.25179361120101},{"$f":"Brand!$O$32","v":125.25179361120101},{"$f":"Brand!$O$32","v":125.25179361120101},{"$f":"Brand!$O$32","v":125.25179361120101},{"$f":"Brand!$O$32","v":125.25179361120101},{"$f":"Brand!$O$32","v":125.25179361120101},{"$f":"Brand!$O$32","v":125.25179361120101},{"$f":"Brand!$O$32","v":125.25179361120101},{"$f":"Brand!$O$32","v":125.25179361120101},{"$f":"Brand!$O$32","v":125.25179361120101},{"$f":"Brand!$O$32","v":125.25179361120101},{"$f":"Brand!$O$32","v":125.25179361120101},{"$f":"Brand!$O$32","v":125.25179361120101},{"$f":"Brand!$O$32","v":125.25179361120101},{"$f":"Brand!$O$32","v":125.25179361120101},{"$f":"Brand!$O$32","v":125.25179361120101},{"$f":"Brand!$O$32","v":125.25179361120101},{"$f":"Brand!$O$32","v":125.25179361120101},{"$f":"Brand!$O$32","v":125.25179361120101},{"$f":"Brand!$O$32","v":125.25179361120101},{"$f":"Brand!$O$32","v":125.25179361120101},{"$f":"Brand!$O$32","v":125.25179361120101},{"$f":"Brand!$O$32","v":125.25179361120101},{"$f":"Brand!$O$32","v":125.25179361120101},{"$f":"Brand!$O$32","v":125.25179361120101},{"$f":"Brand!$O$32","v":125.25179361120101},{"$f":"Brand!$O$32","v":125.25179361120101},{"$f":"Brand!$O$32","v":125.25179361120101},{"$f":"Brand!$O$32","v":125.25179361120101},{"$f":"Brand!$O$32","v":125.25179361120101},{"$f":"Brand!$O$32","v":125.25179361120101},{"$f":"Brand!$O$32","v":125.25179361120101},{"$f":"Brand!$O$32","v":125.25179361120101},{"$f":"Brand!$O$32","v":125.25179361120101},{"$f":"Brand!$O$32","v":125.25179361120101},{"$f":"Brand!$O$32","v":125.25179361120101},{"$f":"Brand!$O$32","v":125.25179361120101},{"$f":"Brand!$O$32","v":125.25179361120101},{"$f":"Brand!$O$32","v":125.25179361120101}]
[null,null,null,null,null,null,null,null,null,null,null,null,null,null," :",null,null,null,null,null,null,null,null,null,null,null,null,null,null,null,null,null,null,null,null,null,null,null,null,null,null,null,null,null,null,null,null,null,null,null,null,null,null,null,null,null,{"$f":"1.1*MAX(P55:BD55)","v":120.57488235294119},0,0,{"$f":"1.1*MAX(P55:BD55)","v":120.57488235294119}]
[null,null,null,null,null,null,null,null,null,null,null,null,null,null,null,null,null,null,null,0,null,null,null,0,null,null,null,0,null,null,null,0,null,null,null,null,0,null,null,0,null,null,null,0,null,null,null,0,null,null,null,0]
[null,null,null,null,null,null,null,null,"EXCENTRICITET",null,null,null,null,null,null,{"$f":"IF(P51>=P52,IF(P51=0,0,SUMPRODUCT($D$38:$D$43,P37:P42)/P51),IF(P52=0,0,SUMPRODUCT($D$38:$D$43,P44:P49)/P52))","v":0},0,0,0,0,0,0,0,0,0,0,0,0,0,0,0,0,0,0,0,0,0,0,0,0,0,0,0,0,0,0,0,0,0,0,0,0,0,0,0,0]
[]
[]
[]
[]
[null,null,null,null,null,null,null,null,"Bøjlekapacitet"]
[null,null,null,null,null,null,null,null,null,null,{"$f":"IF(Brand2!D4-Brand!J34*Brand!O15/1000>0,2*MAX(Brand!O31,Brand!O32)*Brand2!D4/(Brand2!D4-Brand!J34*Brand!O15/1000)^2,2*Brand!O30/Brand!L8)","v":625.39089305358209},0,{"$f":"Brand!L8","v":1.7},null,null,{"$f":"IF(P$35<=$L66,$K66*($M66-$L66)*($D$4-0.5*($L66+$M66))/$D$4,IF(P$35<=$M66,$K66*($M66-P$35)*($D$4-0.5*(P$35+$M66))/$D$4,0))","v":531.58225909554471},505.33538505270218,479.7529888337292,454.83507043862551,430.58162986739131,406.99266712002651,384.06818219653098,361.80817509690507,340.21264582114861,319.28159436926154,299.01502074124386,279.41292493709568,260.47530695681689,242.20216680040758,224.59350446786763,207.64931995919719,191.36961327439613,175.75438441346452,160.8036333764023,146.51736016320953,132.89556477388621,119.93824720843233,107.64540746684784,96.017045549132717,85.053161455287167,74.753755185310951,65.118826739204252,56.148376116966894,47.842403318599054,40.200908344100554,33.223891193471573,26.911351866711946,21.263290363821813,16.279706684801045,11.960600829649778,8.3059727983678808,5.3158225909554639,2.9901502074124373,1.3289556477388713,0.33223891193471522,0]
[null,null,null,null,null,null,null,null,null,null,{"$f":"IF(Brand2!D4-Brand!J34*Brand!O15/1000>0,2*MAX(Brand!O31,Brand!O32)*Brand2!D4/(Brand2!D4-Brand!J34*Brand!O15/1000)^2,2*Brand!O30/Brand!L8)","v":625.39089305358209},0,{"$f":"Brand!L8","v":1.7},null,null,{"$f":"IF(P$35<$L67,0,IF(P$35<$M67,$K67*(P$35-$L67)*0.5*($L67+P$35)/$D$4,$K67*($M67-$L67)*0.5*($L67+$M67)/$D$4))","v":0},0.33223891193471544,1.3289556477388618,2.9901502074124395,5.3158225909554471,8.3059727983678862,11.960600829649758,16.279706684801056,21.263290363821788,26.911351866711946,33.223891193471545,40.200908344100576,47.842403318599033,56.148376116966908,65.118826739204223,74.753755185310965,85.053161455287153,96.017045549132746,107.64540746684779,119.93824720843226,132.89556477388618,146.51736016320947,160.8036333764023,175.75438441346452,191.36961327439613,207.64931995919719,224.59350446786763,242.20216680040758,260.47530695681689,279.41292493709568,299.01502074124386,319.28159436926154,340.21264582114861,361.80817509690525,384.06818219653098,406.99266712002651,430.58162986739114,454.83507043862551,479.75298883372903,505.33538505270218,531.58225909554471]
[null,null,null,null,null,null,null,null,{"$f":"MAX(Q68:BC68)","v":0},null,null,null,null,null,null,null,{"$f":"IF(Q55>MAX(Q66:Q67,Brand!$O$32,Brand!$O$31),1,0)","v":0},{"$f":"IF(R55>MAX(R66:R67,Brand!$O$32,Brand!$O$31),1,0)","v":0},{"$f":"IF(S55>MAX(S66:S67,Brand!$O$32,Brand!$O$31),1,0)","v":0},{"$f":"IF(T55>MAX(T66:T67,Brand!$O$32,Brand!$O$31),1,0)","v":0},{"$f":"IF(U55>MAX(U66:U67,Brand!$O$32,Brand!$O$31),1,0)","v":0},{"$f":"IF(V55>MAX(V66:V67,Brand!$O$32,Brand!$O$31),1,0)","v":0},{"$f":"IF(W55>MAX(W66:W67,Brand!$O$32,Brand!$O$31),1,0)","v":0},{"$f":"IF(X55>MAX(X66:X67,Brand!$O$32,Brand!$O$31),1,0)","v":0},{"$f":"IF(Y55>MAX(Y66:Y67,Brand!$O$32,Brand!$O$31),1,0)","v":0},{"$f":"IF(Z55>MAX(Z66:Z67,Brand!$O$32,Brand!$O$31),1,0)","v":0},{"$f":"IF(AA55>MAX(AA66:AA67,Brand!$O$32,Brand!$O$31),1,0)","v":0},{"$f":"IF(AB55>MAX(AB66:AB67,Brand!$O$32,Brand!$O$31),1,0)","v":0},{"$f":"IF(AC55>MAX(AC66:AC67,Brand!$O$32,Brand!$O$31),1,0)","v":0},{"$f":"IF(AD55>MAX(AD66:AD67,Brand!$O$32,Brand!$O$31),1,0)","v":0},{"$f":"IF(AE55>MAX(AE66:AE67,Brand!$O$32,Brand!$O$31),1,0)","v":0},{"$f":"IF(AF55>MAX(AF66:AF67,Brand!$O$32,Brand!$O$31),1,0)","v":0},{"$f":"IF(AG55>MAX(AG66:AG67,Brand!$O$32,Brand!$O$31),1,0)","v":0},{"$f":"IF(AH55>MAX(AH66:AH67,Brand!$O$32,Brand!$O$31),1,0)","v":0},{"$f":"IF(AI55>MAX(AI66:AI67,Brand!$O$32,Brand!$O$31),1,0)","v":0},{"$f":"IF(AJ55>MAX(AJ66:AJ67,Brand!$O$32,Brand!$O$31),1,0)","v":0},{"$f":"IF(AK55>MAX(AK66:AK67,Brand!$O$32,Brand!$O$31),1,0)","v":0},{"$f":"IF(AL55>MAX(AL66:AL67,Brand!$O$32,Brand!$O$31),1,0)","v":0},{"$f":"IF(AM55>MAX(AM66:AM67,Brand!$O$32,Brand!$O$31),1,0)","v":0},{"$f":"IF(AN55>MAX(AN66:AN67,Brand!$O$32,Brand!$O$31),1,0)","v":0},{"$f":"IF(AO55>MAX(AO66:AO67,Brand!$O$32,Brand!$O$31),1,0)","v":0},{"$f":"IF(AP55>MAX(AP66:AP67,Brand!$O$32,Brand!$O$31),1,0)","v":0},{"$f":"IF(AQ55>MAX(AQ66:AQ67,Brand!$O$32,Brand!$O$31),1,0)","v":0},{"$f":"IF(AR55>MAX(AR66:AR67,Brand!$O$32,Brand!$O$31),1,0)","v":0},{"$f":"IF(AS55>MAX(AS66:AS67,Brand!$O$32,Brand!$O$31),1,0)","v":0},{"$f":"IF(AT55>MAX(AT66:AT67,Brand!$O$32,Brand!$O$31),1,0)","v":0},{"$f":"IF(AU55>MAX(AU66:AU67,Brand!$O$32,Brand!$O$31),1,0)","v":0},{"$f":"IF(AV55>MAX(AV66:AV67,Brand!$O$32,Brand!$O$31),1,0)","v":0},{"$f":"IF(AW55>MAX(AW66:AW67,Brand!$O$32,Brand!$O$31),1,0)","v":0},{"$f":"IF(AX55>MAX(AX66:AX67,Brand!$O$32,Brand!$O$31),1,0)","v":0},{"$f":"IF(AY55>MAX(AY66:AY67,Brand!$O$32,Brand!$O$31),1,0)","v":0},{"$f":"IF(AZ55>MAX(AZ66:AZ67,Brand!$O$32,Brand!$O$31),1,0)","v":0},{"$f":"IF(BA55>MAX(BA66:BA67,Brand!$O$32,Brand!$O$31),1,0)","v":0},{"$f":"IF(BB55>MAX(BB66:BB67,Brand!$O$32,Brand!$O$31),1,0)","v":0},{"$f":"IF(BC55>MAX(BC66:BC67,Brand!$O$32,Brand!$O$31),1,0)","v":0}]
[]
[]
[]
[]
[]
[]
[]
[]
[]
[]
[]
[]
[]
[]
[]
[]
[null,null,"Jævnt fordelte laste",null,null,null,"Punktlaste"]
[null,null,null,"p1","p2","p3",null,"P1","P2","P3"]
[]
[null,"Kar. værdi","(kN/m)",{"$f":"Kold2!D88","v":1.4},{"$f":"Kold2!E88","v":0},{"$f":"Kold2!F88","v":0},"(kN)",{"$f":"Kold2!H88","v":128},{"$f":"Kold2!I88","v":0},{"$f":"Kold2!J88","v":0}]
[null,"Regnm. værdi","(kN/m)",{"$f":"B95+C95*I95","v":1.4},{"$f":"B96+C96*I96","v":0},{"$f":"B97+C97*I97","v":0},"(kN)",{"$f":"B99+C99*I99","v":128},{"$f":"B100+C100*I100","v":0},{"$f":"B101+C101*I101","v":0}]
[null,"Excentricitet, exc.","(mm)",{"$f":"Kold2!D90","v":0},{"$f":"Kold2!E90","v":0},{"$f":"Kold2!F90","v":0},"(mm)",{"$f":"Kold2!H90","v":0},{"$f":"Kold2!I90","v":0},{"$f":"Kold2!J90","v":0}]
[null,"x1","(m)",{"$f":"Kold2!D91","v":0},{"$f":"Kold2!E91","v":0},{"$f":"Kold2!F91","v":0},"(m)",{"$f":"Kold2!H91","v":0.26},{"$f":"Kold2!I91","v":0},{"$f":"Kold2!J91","v":0}]
[null,"x2","(m)",{"$f":"Kold2!D92","v":1.7},{"$f":"Kold2!E92","v":0},{"$f":"Kold2!F92","v":0}]
[]
[{"$f":"Kold!B21","v":"Lastparametre:"},{"$f":"Kold!C21","v":"gk [kN/m]"},{"$f":"Kold!D21","v":"qk [kN/m]"},{"$f":"Kold!E21","v":"e [mm]"},{"$f":"Kold!F21","v":"x1 [m]"},{"$f":"Kold!G21","v":"x2 [m]"},{"$f":"Kold!H21","v":"ϒg"},{"$f":"Kold!I21","v":"ϒq"},{"$f":"Kold!J21","v":"ψ1"},{"$f":"Kold!K21","v":"ψ2"}]
[{"$f":"Kold!B22","v":"p1"},{"$f":"Kold!C22","v":1.4},{"$f":"Kold!D22","v":0},{"$f":"Kold!E22","v":0},{"$f":"Kold!F22","v":0},{"$f":"Kold!G22","v":1.7},{"$f":"Kold!H22","v":1},{"$f":"Kold!I22","v":0},{"$f":"Kold!J22","v":0},{"$f":"Kold!K22","v":0}]
[{"$f":"Kold!B23","v":"p2"},{"$f":"Kold!C23","v":0},{"$f":"Kold!D23","v":0},{"$f":"Kold!E23","v":0},{"$f":"Kold!F23","v":0},{"$f":"Kold!G23","v":0},{"$f":"Kold!H23","v":1},{"$f":"Kold!I23","v":1.5},{"$f":"Kold!J23","v":0.6},{"$f":"Kold!K23","v":0.5}]
[{"$f":"Kold!B24","v":"p3"},{"$f":"Kold!C24","v":0},{"$f":"Kold!D24","v":0},{"$f":"Kold!E24","v":0},{"$f":"Kold!F24","v":0},{"$f":"Kold!G24","v":0},{"$f":"Kold!H24","v":1},{"$f":"Kold!I24","v":1.5},{"$f":"Kold!J24","v":0.6},{"$f":"Kold!K24","v":0.5}]
[{"$f":"Kold!B25","v":0},{"$f":"Kold!C25","v":"Gk [kN]"},{"$f":"Kold!D25","v":"Qk [kN]"},{"$f":"Kold!E25","v":"e [mm]"},{"$f":"Kold!F25","v":"x1 [m]"},{"$f":"Kold!G25","v":0}]
[{"$f":"Kold!B26","v":"P1"},{"$f":"Kold!C26","v":128},{"$f":"Kold!D26","v":0},{"$f":"Kold!E26","v":0},{"$f":"Kold!F26","v":0.26},{"$f":"Kold!G26","v":0},{"$f":"Kold!H26","v":1},{"$f":"Kold!I26","v":1.5},{"$f":"Kold!J26","v":0.6},{"$f":"Kold!K26","v":0.5}]
[{"$f":"Kold!B27","v":"P2"},{"$f":"Kold!C27","v":0},{"$f":"Kold!D27","v":0},{"$f":"Kold!E27","v":0},{"$f":"Kold!F27","v":0},{"$f":"Kold!G27","v":0},{"$f":"Kold!H27","v":1},{"$f":"Kold!I27","v":1.5},{"$f":"Kold!J27","v":0.6},{"$f":"Kold!K27","v":0.5}]
[{"$f":"Kold!B28","v":"P3"},{"$f":"Kold!C28","v":0},{"$f":"Kold!D28","v":0},{"$f":"Kold!E28","v":0},{"$f":"Kold!F28","v":0},{"$f":"Kold!G28","v":0},{"$f":"Kold!H28","v":1},{"$f":"Kold!I28","v":1.5},{"$f":"Kold!J28","v":0.6},{"$f":"Kold!K28","v":0.5}]

{"sheet":"Firsidig","index":4,"n_rows":136,"n_cols":38,"rows_kept":136,"cut":false,"hidden":false,"merged":[[121,6,121,7],[102,2,102,3],[102,4,102,5],[102,6,102,7],[42,11,42,12],[42,22,42,23],[41,10,41,16],[41,17,41,23],[42,13,42,14],[42,15,42,16],[42,18,42,19],[42,20,42,21],[41,24,41,30],[42,25,42,26],[42,27,42,28],[42,29,42,30],[41,31,41,37],[42,32,42,33],[42,34,42,35],[42,36,42,37]]}
[]
[null,null,null,0,null,null,null,null,null,null,"Q",null,"y","Q-3",null,null,null,null,null,null,null,"Q-4",null,null,null,"Temp i bøjler",null,"y","Q-3",null,null,null,null,null,null,null,"Q-4"]
[null,null,null,null,null,null,null,null,null,null,null,"Punkt",null,null,1,2,3,"Midte",4,5,6,null,null,null,null,null,"Punkt",null,null,1,2,3,"Midte",4,5,6]
[null,null,null,null,null,null,null,null,null,null,"x",null,null,null,{"$f":"$E$16/(4*$E$19)+(O3-1)*$E$16/(2*$E$19)","v":1.2499999999999999E-2},{"$f":"$E$16/(4*$E$19)+(P3-1)*$E$16/(2*$E$19)","v":3.7499999999999999E-2},{"$f":"$E$16/(4*$E$19)+(Q3-1)*$E$16/(2*$E$19)","v":6.2499999999999993E-2},{"$f":"0.5*E16","v":7.4999999999999997E-2},{"$f":"$E$16/(4*$E$19)+(S3-1)*$E$16/(2*$E$19)","v":8.7499999999999994E-2},{"$f":"$E$16/(4*$E$19)+(T3-1)*$E$16/(2*$E$19)","v":0.11249999999999999},{"$f":"$E$16/(4*$E$19)+(U3-1)*$E$16/(2*$E$19)","v":0.13750000000000001},null,null,null,null,"x",null,null,null,{"$f":"E29-0.5*(MAX(Brand!M11:M13)+MAX(Brand!M15:M16))/1000","v":2.7999999999999997E-2},{"$f":"AD4+0.4*($AG$4-$AD$4)","v":4.6799999999999994E-2},{"$f":"AE4+0.4*($AG$4-$AD$4)","v":6.5599999999999992E-2},{"$f":"0.5*E16","v":7.4999999999999997E-2},{"$f":"AG4+0.2*($AJ$4-$AG$4)","v":8.4400000000000003E-2},{"$f":"AH4+0.4*($AJ$4-$AG$4)","v":0.1032},{"$f":"E16-AD4","v":0.122}]
[null,null,null,null,null,null,null,null,null,null,"Q-1",null,null,null,{"$f":"MAX(312*LOG10(8*$E$17+1)*EXP(-1.9*O4*$E$18/SQRT($E$17))*SIN(PI()/2-O4*$E$18/SQRT($E$17)),0)*$B$6","v":581.31446966729789},{"$f":"MAX(312*LOG10(8*$E$17+1)*EXP(-1.9*P4*$E$18/SQRT($E$17))*SIN(PI()/2-P4*$E$18/SQRT($E$17)),0)*$B$6","v":251.7255808765762},{"$f":"MAX(312*LOG10(8*$E$17+1)*EXP(-1.9*Q4*$E$18/SQRT($E$17))*SIN(PI()/2-Q4*$E$18/SQRT($E$17)),0)*$B$6","v":89.84574257638296},47.423817868663399,21.048174154060561,0,0,{"$f":"MAX(312*LOG10(8*$E$17+1)*EXP(-1.9*($E$16)*$E$18/SQRT($E$17))*SIN(PI()/2-($E$16)*$E$18/SQRT($E$17)),0)","v":0},null,null,null,"Q-1",null,null,null,{"$f":"MAX(312*LOG10(8*$E$17+1)*EXP(-1.9*AD4*$E$18/SQRT($E$17))*SIN(PI()/2-AD4*$E$18/SQRT($E$17)),0)*$B$6","v":352.41820355924739},{"$f":"MAX(312*LOG10(8*$E$17+1)*EXP(-1.9*AE4*$E$18/SQRT($E$17))*SIN(PI()/2-AE4*$E$18/SQRT($E$17)),0)*$B$6","v":176.45949214735185},77.489450472718545,47.423817868663399,26.398729912668234,2.8849305777132401,0]
[null,{"$f":"Brand!AT40","v":1},null,null,null,{"$f":"Brand!AT40","v":1},null,null,null,null,null,1,{"$f":"$E$15/(4*$E$19)+(L6-1)*$E$15/(2*$E$19)","v":3.3333333333333333E-2},{"$f":"MAX(312*LOG10(8*$E$17+1)*EXP(-1.9*M6*$E$18/SQRT($E$17))*SIN(PI()/2-M6*$E$18/SQRT($E$17)),0)*$D$2","v":0},{"$f":"MAX(((O$5+O$13)*$E$20/($E$20+$V$5))*(1-($N6+$V6)/$E$20)+$N6+$V6,20)","v":581.32027466299382},{"$f":"MAX(((P$5+P$13)*$E$20/($E$20+$V$5))*(1-($N6+$V6)/$E$20)+$N6+$V6,20)","v":251.73887373769958},110.91040911856824,94.864492677767359,110.91040911856821,251.73887373769952,581.32027466299405,{"$f":"MAX(312*LOG10(8*$E$17+1)*EXP(-1.9*($E$15-M6)*$E$18/SQRT($E$17))*SIN(PI()/2-($E$15-M6)*$E$18/SQRT($E$17)),0)*$D$11","v":1.9011765304683809E-2}]
[null,null,null,null,null,null,null,null,null,null,null,2,{"$f":"$E$15/(4*$E$19)+(L7-1)*$E$15/(2*$E$19)","v":0.1},{"$f":"MAX(312*LOG10(8*$E$17+1)*EXP(-1.9*M7*$E$18/SQRT($E$17))*SIN(PI()/2-M7*$E$18/SQRT($E$17)),0)*$D$2","v":0},{"$f":"MAX(((O$5+O$13)*$E$20/($E$20+$V$5))*(1-($N7+$V7)/$E$20)+$N7+$V7,20)","v":581.31446966729789},251.7255808765762,110.89391673044352,94.847635737326797,110.89391673044349,251.72558087657615,581.31446966729811,{"$f":"MAX(312*LOG10(8*$E$17+1)*EXP(-1.9*($E$15-M7)*$E$18/SQRT($E$17))*SIN(PI()/2-($E$15-M7)*$E$18/SQRT($E$17)),0)*$D$11","v":0}]
[null,null,null,null,null,null,null,null,null,null,null,3,{"$f":"$E$15/(4*$E$19)+(L8-1)*$E$15/(2*$E$19)","v":0.16666666666666666},0,{"$f":"MAX(((O$5+O$13)*$E$20/($E$20+$V$5))*(1-($N8+$V8)/$E$20)+$N8+$V8,20)","v":581.31446966729789},251.7255808765762,110.89391673044352,94.847635737326797,110.89391673044349,251.72558087657615,581.31446966729811,0]
[null,null,null,null,null,null,null,null,null,null,null,"Midte",{"$f":"0.5*E15","v":0.2},0,581.31446966729789,251.7255808765762,110.89391673044352,94.847635737326797,110.89391673044349,251.72558087657615,581.31446966729811,0,null,null,null,null,"Midte",{"$f":"0.5*E15","v":0.2},{"$f":"MAX(312*LOG10(8*$E$17+1)*EXP(-1.9*AB9*$E$18/SQRT($E$17))*SIN(PI()/2-AB9*$E$18/SQRT($E$17)),0)*$D$2","v":0}]
[null,null,null,null,null,null,null,null,null,null,null,4,{"$f":"$E$15/(4*$E$19)+(L10-1)*$E$15/(2*$E$19)","v":0.23333333333333336},0,581.31446966729789,251.7255808765762,110.89391673044352,94.847635737326797,110.89391673044349,251.72558087657615,581.31446966729811,0,null,null,null,null,4,{"$f":"AB9+0.2*($AB$12-$AB$9)","v":0.23440000000000003},{"$f":"MAX(312*LOG10(8*$E$17+1)*EXP(-1.9*AB10*$E$18/SQRT($E$17))*SIN(PI()/2-AB10*$E$18/SQRT($E$17)),0)*$D$2","v":0},{"$f":"MAX((($AC10+$AK10)*$E$20/($E$20+$V$5))*(1-(AD$5+AD$13)/$E$20)+AD$5+AD$13,20)","v":352.41820355924739},null,null,null,null,null,{"$f":"MAX((($AC10+$AK10)*$E$20/($E$20+$V$5))*(1-(AJ$5+AJ$13)/$E$20)+AJ$5+AJ$13,20)","v":352.41820355924739},{"$f":"MAX(312*LOG10(8*$E$17+1)*EXP(-1.9*($E$15-AB10)*$E$18/SQRT($E$17))*SIN(PI()/2-($E$15-AB10)*$E$18/SQRT($E$17)),0)*$D$11","v":0}]
[null,null,null,{"$f":"Brand!AT39","v":1},null,null,null,null,null,null,null,5,{"$f":"$E$15/(4*$E$19)+(L11-1)*$E$15/(2*$E$19)","v":0.3},0,583.01677038332707,255.62367971996088,115.73026900081433,99.790892078053204,115.7302690008143,255.62367971996085,583.0167703833273,5.5751534344065394,null,null,null,null,5,{"$f":"AB10+0.4*($AB$12-$AB$9)","v":0.30320000000000003},{"$f":"MAX(312*LOG10(8*$E$17+1)*EXP(-1.9*AB11*$E$18/SQRT($E$17))*SIN(PI()/2-AB11*$E$18/SQRT($E$17)),0)*$D$2","v":0},357.4703280977393,null,null,null,null,null,357.4703280977393,{"$f":"MAX(312*LOG10(8*$E$17+1)*EXP(-1.9*($E$15-AB11)*$E$18/SQRT($E$17))*SIN(PI()/2-($E$15-AB11)*$E$18/SQRT($E$17)),0)*$D$11","v":8.7276389346665439}]
[null,null,null,null,null,null,null,null,null,null,null,6,{"$f":"$E$15/(4*$E$19)+(L12-1)*$E$15/(2*$E$19)","v":0.36666666666666664},0,670.66912772282808,456.33883512567286,364.75658581461948,354.32175558423916,364.75658581461943,456.33883512567274,670.66912772282819,292.64272995228669,null,null,null,null,6,{"$f":"E15-E29+0.5*(MAX(Brand!M11:M13)+MAX(Brand!M15:M16))/1000","v":0.37200000000000005},{"$f":"MAX(312*LOG10(8*$E$17+1)*EXP(-1.9*AB12*$E$18/SQRT($E$17))*SIN(PI()/2-AB12*$E$18/SQRT($E$17)),0)*$D$2","v":0},556.42075995979314,456.23440925630246,412.55543303370905,407.32217833565124,412.55543303370905,456.23440925630246,556.42075995979314,{"$f":"MAX(312*LOG10(8*$E$17+1)*EXP(-1.9*($E$15-AB12)*$E$18/SQRT($E$17))*SIN(PI()/2-($E$15-AB12)*$E$18/SQRT($E$17)),0)*$D$11","v":352.41820355924767}]
[null,"Betontværsnit",null,null,null,null,null,null,null,null,"Q-2",null,{"$f":"E15-E27","v":0.38238213203555638},null,{"$f":"MAX(312*LOG10(8*$E$17+1)*EXP(-1.9*($E$16-O4)*$E$18/SQRT($E$17))*SIN(PI()/2-($E$16-O4)*$E$18/SQRT($E$17)),0)*$F$6","v":0},{"$f":"MAX(312*LOG10(8*$E$17+1)*EXP(-1.9*($E$16-P4)*$E$18/SQRT($E$17))*SIN(PI()/2-($E$16-P4)*$E$18/SQRT($E$17)),0)*$F$6","v":0},21.048174154060561,47.423817868663399,89.845742576382932,251.72558087657615,581.31446966729811,{"$f":"MAX(312*LOG10(8*$E$17+1)*EXP(-1.9*($E$15-M13)*$E$18/SQRT($E$17))*SIN(PI()/2-($E$15-M13)*$E$18/SQRT($E$17)),20)*$D$11","v":495.82898327097104},null,null,null,"Q-2",null,{"$f":"E15-E25","v":0.4},{"$f":"MAX(312*LOG10(8*$E$17+1)*EXP(-1.9*AB13*$E$18/SQRT($E$17))*SIN(PI()/2-AB13*$E$18/SQRT($E$17)),0)*$D$2","v":0},{"$f":"MAX(312*LOG10(8*$E$17+1)*EXP(-1.9*($E$16-AD4)*$E$18/SQRT($E$17))*SIN(PI()/2-($E$16-AD4)*$E$18/SQRT($E$17)),0)*$F$6","v":0},{"$f":"MAX(312*LOG10(8*$E$17+1)*EXP(-1.9*($E$16-AE4)*$E$18/SQRT($E$17))*SIN(PI()/2-($E$16-AE4)*$E$18/SQRT($E$17)),0)*$F$6","v":2.8849305777132401},26.398729912668234,47.423817868663399,77.489450472718545,176.45949214735185,352.41820355924739,{"$f":"MAX(312*LOG10(8*$E$17+1)*EXP(-1.9*($E$15-AB13)*$E$18/SQRT($E$17))*SIN(PI()/2-($E$15-AB13)*$E$18/SQRT($E$17)),0)*$D$11","v":836.82948919207115}]
[null,null,null,null,null,null,null,null,null,null,"z-1",null,null,null,null,null,null,null,null,null,null,null,null,null,null,"Middeltemperatur i bøjler:",null,null,{"$f":"(0.4*(AB12-AB9)*((AD10+AJ10)+(AD11+AJ11)+0.5*(AD12+AJ12))+0.4*(AG4-AD4)*(0.5*(AD12+AJ12)+(AE12+AI12)+(AF12+AH12)))/(2*(AB12-AB9)+(AJ4-AD4))","v":408.88040775932353},null,"(integreret over den nederste halvdel af bjælken)"]
[null,null,null,"h",{"$f":"Brand!O7/1000","v":0.4},"m",null,null,null,null,null,"Punkt",null,null,1,2,3,"Midte",4,5,6]
[null,null,null,"b",{"$f":"Brand!O8/1000","v":0.15},"m"]
[null,"Brandtid",null,"t",{"$f":"IF(D2+F6+D11+B6=0,0.0001,Brand!L23+0.0001)","v":60.000100000000003},"min"]
[null,"Svækket tværsnit",null,"k",{"$f":"SQRT(PI()*2300*1000/(750*0.75))","v":113.33853402386262},null,null,null,null,null,null,1,null,null,{"$f":"INDEX(Bet,VLOOKUP(O6,Bet,5),2)+(INDEX(Bet,VLOOKUP(O6,Bet,5)+1,2)-INDEX(Bet,VLOOKUP(O6,Bet,5),2))*(O6-INDEX(Bet,VLOOKUP(O6,Bet,5),1))/(INDEX(Bet,VLOOKUP(O6,Bet,5)+1,1)-INDEX(Bet,VLOOKUP(O6,Bet,5),1))","v":0.63735945067401245},0.96550740026190907,1,null,{"$f":"INDEX(Bet,VLOOKUP(S6,Bet,5),2)+(INDEX(Bet,VLOOKUP(S6,Bet,5)+1,2)-INDEX(Bet,VLOOKUP(S6,Bet,5),2))*(S6-INDEX(Bet,VLOOKUP(S6,Bet,5),1))/(INDEX(Bet,VLOOKUP(S6,Bet,5)+1,1)-INDEX(Bet,VLOOKUP(S6,Bet,5),1))","v":1},0.96550740026190907,0.63735945067401201]
[null,null,null,"n",3,null,null,null,null,null,null,2,null,null,0.63737106066540428,0.96551626217375563,1,null,1,0.96551626217375563,0.63737106066540383]
[null,null,null,"Q-maks",{"$f":"MAX(312*LOG10(8*$E$17+1)*EXP(-1.9*0*$E$18/SQRT($E$17))*SIN(PI()/2-0*$E$18/SQRT($E$17)),0)","v":836.82948919207115},null,"ecu",null,null,null,null,3,null,null,0.63737106066540428,0.96551626217375563,1,null,1,0.96551626217375563,0.63737106066540383]
[null,null,null,"z-M / e1",{"$f":"R21","v":1},{"$f":"INDEX(Bet,VLOOKUP(R9,Bet,5),3)+(INDEX(Bet,VLOOKUP(R9,Bet,5)+1,3)-INDEX(Bet,VLOOKUP(R9,Bet,5),3))*(R9-INDEX(Bet,VLOOKUP(R9,Bet,5),1))/(INDEX(Bet,VLOOKUP(R9,Bet,5)+1,1)-INDEX(Bet,VLOOKUP(R9,Bet,5),1))","v":3.9033931700748776E-3},{"$f":"INDEX(Bet,VLOOKUP(R9,Bet,5),4)+(INDEX(Bet,VLOOKUP(R9,Bet,5)+1,4)-INDEX(Bet,VLOOKUP(R9,Bet,5),4))*(R9-INDEX(Bet,VLOOKUP(R9,Bet,5),1))/(INDEX(Bet,VLOOKUP(R9,Bet,5)+1,1)-INDEX(Bet,VLOOKUP(R9,Bet,5),1))","v":2.2338988616791462E-2},null,null,null,null,"Midte",null,null,null,null,null,{"$f":"INDEX(Bet,VLOOKUP(R9,Bet,5),2)+(INDEX(Bet,VLOOKUP(R9,Bet,5)+1,2)-INDEX(Bet,VLOOKUP(R9,Bet,5),2))*(R9-INDEX(Bet,VLOOKUP(R9,Bet,5),1))/(INDEX(Bet,VLOOKUP(R9,Bet,5)+1,1)-INDEX(Bet,VLOOKUP(R9,Bet,5),1))","v":1}]
[null,null,null,"z-middel",{"$f":"((1-0.2/E19)/(2*E19)^2)*IF(AND(D2=1,D11=0),2*SUM(O18:U20),IF(AND(D11=1,D2=0),2*SUM(O22:U24),SUM(O18:U20)+SUM(O22:U24)))","v":0.76509509380741791},null,null,null,null,null,null,4,null,null,{"$f":"INDEX(Bet,VLOOKUP(O10,Bet,5),2)+(INDEX(Bet,VLOOKUP(O10,Bet,5)+1,2)-INDEX(Bet,VLOOKUP(O10,Bet,5),2))*(O10-INDEX(Bet,VLOOKUP(O10,Bet,5),1))/(INDEX(Bet,VLOOKUP(O10,Bet,5)+1,1)-INDEX(Bet,VLOOKUP(O10,Bet,5),1))","v":0.63737106066540428},0.96551626217375563,1,null,{"$f":"INDEX(Bet,VLOOKUP(S10,Bet,5),2)+(INDEX(Bet,VLOOKUP(S10,Bet,5)+1,2)-INDEX(Bet,VLOOKUP(S10,Bet,5),2))*(S10-INDEX(Bet,VLOOKUP(S10,Bet,5),1))/(INDEX(Bet,VLOOKUP(S10,Bet,5)+1,1)-INDEX(Bet,VLOOKUP(S10,Bet,5),1))","v":1},0.96551626217375563,0.63737106066540383]
[null,null,null,"a (bjælke)",{"$f":"IF(OR((D11+B6+D2+F6)*E17=0,E17<0.1),0,0.5*IF(B6=0,E15,MIN(E15,E16))*(1-E22/E21))","v":1.7617867964443656E-2},"m",null,null,null,null,null,5,null,null,0.63396645923334594,0.96291752831213284,1,null,1,0.96291752831213284,0.63396645923334549]
[null,null,null,"a (instabilitet)",{"$f":"IF(OR((D11+B6+D2+F6)*E17=0,E17<0.1),0,0.5*IF(B6=0,E15,MIN(E15,E16))*(1-(E22/E21)^1.3))","v":2.2046910273995041E-2},"m",null,null,null,null,null,6,null,null,0.45866174455434394,0.8291074141421082,0.8901622212047251,null,0.8901622212047251,0.82910741414210831,0.45866174455434372]
[null,"Randzoner",null,"atop",{"$f":"E23*D2","v":0},"m"]
[null,null,null,"aside",{"$f":"E23*MAX(B6,F6)","v":1.7617867964443656E-2},"m"]
[null,null,null,"abund",{"$f":"E23*D11","v":1.7617867964443656E-2},"m"]
[null,"Stål-gen","type",{"$f":"IF($E$28=\"Q\",1,IF($E$28=\"AC\",3,5))","v":3},{"$f":"Brand!AR36","v":"AC"},null,null,null,null,null,"Træklag 1",null,{"$f":"M95","v":3.6999999999999998E-2},3.6999999999999998E-2,3.6999999999999998E-2,3.6999999999999998E-2,3.6999999999999998E-2,3.6999999999999998E-2,3.6999999999999998E-2,3.6999999999999998E-2,3.6999999999999998E-2,3.6999999999999998E-2]
[null,null,"side-\"dæklag\"",null,{"$f":"Brand!M9/1000","v":3.6999999999999998E-2},"m",null,null,null,null,null,null,{"$f":"MAX(312*LOG10(8*$E$17+1)*EXP(-1.9*M28*$E$18/SQRT($E$17))*SIN(PI()/2-M28*$E$18/SQRT($E$17)),0)*$B$6","v":256.38380577307561},{"$f":"IF(N28=M28,0,MAX(312*LOG10(8*$E$17+1)*EXP(-1.9*N28*$E$18/SQRT($E$17))*SIN(PI()/2-N28*$E$18/SQRT($E$17)),0))*$B$6","v":0},{"$f":"IF(O28=N28,0,MAX(312*LOG10(8*$E$17+1)*EXP(-1.9*O28*$E$18/SQRT($E$17))*SIN(PI()/2-O28*$E$18/SQRT($E$17)),0))*$B$6","v":0},0,0,0,0,0,0,0]
[null,"Træklag 1",null,"nc",{"$f":"Brand!O12","v":0},null,null,null,null,null,{"$f":"-M98","v":0.4},{"$f":"MAX(312*LOG10(8*$E$17+1)*EXP(-1.9*K30*$E$18/SQRT($E$17))*SIN(PI()/2-K30*$E$18/SQRT($E$17)),0)*$D$2","v":0},{"$f":"MAX(((M$29+M$31)*$E$20/($E$20+$V$5))*(1-($L30+$W30)/$E$20)+$L30+$W30,20)","v":836.82948919207115},{"$f":"IF(N28=M28,0,MAX(((N$29+N$31)*$E$20/($E$20+$V$5))*(1-($L30+$W30)/$E$20)+$L30+$W30,20))","v":0},{"$f":"IF(O28=N28,0,MAX(((O$29+O$31)*$E$20/($E$20+$V$5))*(1-($L30+$W30)/$E$20)+$L30+$W30,20))","v":0},0,0,0,0,0,0,0,{"$f":"MAX(312*LOG10(8*$E$17+1)*EXP(-1.9*($E$15-K30)*$E$18/SQRT($E$17))*SIN(PI()/2-($E$15-K30)*$E$18/SQRT($E$17)),0)*$D$11","v":836.82948919207115}]
[null,null,null,"reduc nc",{"$f":"MIN(FLOOR(E30,1),10)","v":0},null,null,null,null,null,null,null,{"$f":"MAX(312*LOG10(8*$E$17+1)*EXP(-1.9*($E$16-M28)*$E$18/SQRT($E$17))*SIN(PI()/2-($E$16-M28)*$E$18/SQRT($E$17)),0)*$F$6","v":0},{"$f":"IF(N28=M28,0,MAX(312*LOG10(8*$E$17+1)*EXP(-1.9*($E$16-N28)*$E$18/SQRT($E$17))*SIN(PI()/2-($E$16-N28)*$E$18/SQRT($E$17)),0))*$F$6","v":0},{"$f":"IF(O28=N28,0,MAX(312*LOG10(8*$E$17+1)*EXP(-1.9*($E$16-O28)*$E$18/SQRT($E$17))*SIN(PI()/2-($E$16-O28)*$E$18/SQRT($E$17)),0))*$F$6","v":0},0,0,0,0,0,0,0]
[null,null,null,"ac",{"$f":"Brand!N12/1000","v":0},"m",null,null,null,null,"Træklag 2",null,{"$f":"W95","v":3.6999999999999998E-2},0.11299999999999999,0.11299999999999999,0.11299999999999999,0.11299999999999999,0.11299999999999999,0.11299999999999999,0.11299999999999999,0.11299999999999999,0.11299999999999999]
[null,null,null,"dc",{"$f":"IF(E30<2,0,(E16-2*E29)/(E31-1))","v":0},"m",null,null,null,null,null,null,{"$f":"MAX(312*LOG10(8*$E$17+1)*EXP(-1.9*M32*$E$18/SQRT($E$17))*SIN(PI()/2-M32*$E$18/SQRT($E$17)),0)*$B$6","v":256.38380577307561},{"$f":"IF(N32=M32,0,MAX(312*LOG10(8*$E$17+1)*EXP(-1.9*N32*$E$18/SQRT($E$17))*SIN(PI()/2-N32*$E$18/SQRT($E$17)),0))*$B$6","v":0},{"$f":"IF(O32=N32,0,MAX(312*LOG10(8*$E$17+1)*EXP(-1.9*O32*$E$18/SQRT($E$17))*SIN(PI()/2-O32*$E$18/SQRT($E$17)),0))*$B$6","v":0},0,0,0,0,0,0,0]
[null,null,null,"E/Ek",{"$f":"IF(E30=0,1,(SUM(E53:E62)+0.5*(E30-E31)*(E57+E58))/E30)","v":1},null,null,null,null,null,{"$f":"-W99","v":0.36300000000000004},{"$f":"MAX(312*LOG10(8*$E$17+1)*EXP(-1.9*K34*$E$18/SQRT($E$17))*SIN(PI()/2-K34*$E$18/SQRT($E$17)),0)*$D$2","v":0},{"$f":"MAX(((M$33+M$35)*$E$20/($E$20+$V$5))*(1-($L34+$W34)/$E$20)+$L34+$W34,20)","v":434.21797065556956},{"$f":"IF(N32=M32,0,MAX(((N$33+N$35)*$E$20/($E$20+$V$5))*(1-($L34+$W34)/$E$20)+$L34+$W34,20))","v":434.2179706555695},{"$f":"IF(O32=N32,0,MAX(((O$33+O$35)*$E$20/($E$20+$V$5))*(1-($L34+$W34)/$E$20)+$L34+$W34,20))","v":0},0,0,0,0,0,0,0,{"$f":"MAX(312*LOG10(8*$E$17+1)*EXP(-1.9*($E$15-K34)*$E$18/SQRT($E$17))*SIN(PI()/2-($E$15-K34)*$E$18/SQRT($E$17)),0)*$D$11","v":256.38380577307578},{"$f":"(SUM(D54:D63)+0.5*(E36-E37)*(D58+D59))/E36","v":217.10898532778478}]
[null,null,null,"fy/fyk",{"$f":"IF(E30=0,1,(SUM(F53:F62)+0.5*(E30-E31)*(F57+F58))/E30)","v":1},null,null,null,null,null,null,null,{"$f":"MAX(312*LOG10(8*$E$17+1)*EXP(-1.9*($E$16-M32)*$E$18/SQRT($E$17))*SIN(PI()/2-($E$16-M32)*$E$18/SQRT($E$17)),0)*$F$6","v":0},{"$f":"IF(N32=M32,0,MAX(312*LOG10(8*$E$17+1)*EXP(-1.9*($E$16-N32)*$E$18/SQRT($E$17))*SIN(PI()/2-($E$16-N32)*$E$18/SQRT($E$17)),0))*$F$6","v":256.38380577307549},{"$f":"IF(O32=N32,0,MAX(312*LOG10(8*$E$17+1)*EXP(-1.9*($E$16-O32)*$E$18/SQRT($E$17))*SIN(PI()/2-($E$16-O32)*$E$18/SQRT($E$17)),0))*$F$6","v":0},0,0,0,0,0,0,0]
[null,"Træklag 2",null,"nt",{"$f":"Brand!O13","v":2},null,null,null,null,null,"Tryklag",null,{"$f":"E29","v":3.6999999999999998E-2},{"$f":"IF(N40<=$E$43,M36+$E$45,M36)","v":0.11299999999999999},{"$f":"IF(O40<=$E$43,N36+$E$45,N36)","v":0.11299999999999999},0.11299999999999999,0.11299999999999999,0.11299999999999999,0.11299999999999999,0.11299999999999999,0.11299999999999999,0.11299999999999999]
[null,null,null,"reduc nt",{"$f":"MIN(FLOOR(E36,1),10)","v":2},null,null,null,null,null,null,null,{"$f":"MAX(312*LOG10(8*$E$17+1)*EXP(-1.9*M36*$E$18/SQRT($E$17))*SIN(PI()/2-M36*$E$18/SQRT($E$17)),0)*$B$6","v":256.38380577307561},{"$f":"IF(N36=M36,0,MAX(312*LOG10(8*$E$17+1)*EXP(-1.9*N36*$E$18/SQRT($E$17))*SIN(PI()/2-N36*$E$18/SQRT($E$17)),0))*$B$6","v":0},{"$f":"IF(O36=N36,0,MAX(312*LOG10(8*$E$17+1)*EXP(-1.9*O36*$E$18/SQRT($E$17))*SIN(PI()/2-O36*$E$18/SQRT($E$17)),0))*$B$6","v":0},0,0,0,0,0,0,0]
[null,null,null,"at",{"$f":"Brand!N13/1000","v":3.6999999999999998E-2},"m",null,null,null,null,{"$f":"E44","v":3.5999999999999997E-2},{"$f":"MAX(312*LOG10(8*$E$17+1)*EXP(-1.9*K38*$E$18/SQRT($E$17))*SIN(PI()/2-K38*$E$18/SQRT($E$17)),0)*$D$2","v":0},{"$f":"MAX(((M$37+M$39)*$E$20/($E$20+$V$5))*(1-($L38+$W38)/$E$20)+$L38+$W38,20)","v":256.39727202422227},{"$f":"IF(N36=M36,0,MAX(((N$37+N$39)*$E$20/($E$20+$V$5))*(1-($L38+$W38)/$E$20)+$L38+$W38,20))","v":256.39727202422216},{"$f":"IF(O36=N36,0,MAX(((O$37+O$39)*$E$20/($E$20+$V$5))*(1-($L38+$W38)/$E$20)+$L38+$W38,20))","v":0},0,0,0,0,0,0,0,{"$f":"MAX(312*LOG10(8*$E$17+1)*EXP(-1.9*($E$15-K38)*$E$18/SQRT($E$17))*SIN(PI()/2-($E$15-K38)*$E$18/SQRT($E$17)),0)*$D$11","v":1.9414316257827146E-2},{"$f":"(SUM(D67:D76)+0.5*(E40-E41)*(D71+D72))/E40","v":568.61587755149594}]
[null,null,null,"dt",{"$f":"IF(E36<2,0,(E16-2*E29)/(E37-1))","v":7.5999999999999998E-2},"m",null,null,null,null,null,null,{"$f":"MAX(312*LOG10(8*$E$17+1)*EXP(-1.9*($E$16-M36)*$E$18/SQRT($E$17))*SIN(PI()/2-($E$16-M36)*$E$18/SQRT($E$17)),0)*$F$6","v":0},{"$f":"IF(N36=M36,0,MAX(312*LOG10(8*$E$17+1)*EXP(-1.9*($E$16-N36)*$E$18/SQRT($E$17))*SIN(PI()/2-($E$16-N36)*$E$18/SQRT($E$17)),0))*$F$6","v":256.38380577307549},{"$f":"IF(O36=N36,0,MAX(312*LOG10(8*$E$17+1)*EXP(-1.9*($E$16-O36)*$E$18/SQRT($E$17))*SIN(PI()/2-($E$16-O36)*$E$18/SQRT($E$17)),0))*$F$6","v":0},0,0,0,0,0,0,0]
[null,null,null,"E/Ek",{"$f":"IF(E36=0,1,(SUM(E63:E72)+0.5*(E36-E37)*(E67+E68))/E36)","v":0.90182944988553171},null,null,null,null,null,null,null,1,2,3,4,5,6,7,8,9,10]
[null,null,null,"fy/fyk",{"$f":"IF(E36=0,1,(SUM(F63:F72)+0.5*(E36-E37)*(F67+F68))/E36)","v":0.70129866749219016}]
[null,"Tryklag",null,"nt",{"$f":"Brand!O11","v":2},null,null,null,null,null,"Træklag 1",null,null,null,null,null,null,"Træklag 2",null,null,null,null,null,null,"Tryklag",null,null,null,null,null,null,"Bøjler"]
[null,null,null,"reduc nt",{"$f":"MIN(FLOOR(E42,1),10)","v":2},null,null,null,null,null,"Tabel","type (+Q)",null,"type (+AC)",null,"type (+C)",null,"Tabel","type (+Q)",null,"type (+AC)",null,"type (+C)",null,"Tabel","type (+Q)",null,"type (+AC)",null,"type (+C)",null,"Tabel","type (+Q)",null,"type (+AC)",null,"type (+C)"]
[null,null,null,"atr",{"$f":"Brand!N11/1000","v":3.5999999999999997E-2},"m",null,null,null,null,"Q-stål","E/Ek","fy/fyk","E/Ek","fy/fyk","E/Ek","fy/fyk","Q-stål","E/Ek","fy/fyk","E/Ek","fy/fyk","E/Ek","fy/fyk","Q-stål","E/Ek","fy/fyk","E/Ek","fy/fyk","E/Ek","fy/fyk","Q-stål","E/Ek","fy/fyk","E/Ek","fy/fyk","E/Ek","fy/fyk"]
[null,null,null,"dt",{"$f":"IF(E42<2,0,(E16-2*E29)/(E43-1))","v":7.5999999999999998E-2},"m",null,null,null,null,"Temp-1",null,null,null,null,null,null,"Temp-11",null,null,null,null,null,null,"Temp-21",null,null,null,null,null,null,"Temp-31"]
[null,null,null,"E/Ek",{"$f":"IF(E42=0,1,(SUM(E73:E82)+0.5*(E42-E43)*(E77+E78))/E42)","v":0.99436027279757777},null,null,null,null,null,{"$f":"D53","v":836.82948919207115},{"$f":"IF(K46=K48,L48,L48+(L47-L48)*(K46-K48)/(K47-K48))","v":8.2634102161585773E-2},{"$f":"IF(K46=K48,M48,M48+(M47-M48)*(K46-K48)/(K47-K48))","v":3.8951153242378654E-2},{"$f":"IF(K46=K48,N48,N48+(N47-N48)*(K46-K48)/(K47-K48))","v":6.1585255403964423E-2},{"$f":"IF(K46=K48,O48,O48+(O47-O48)*(K46-K48)/(K47-K48))","v":0},{"$f":"IF(K46=K48,P48,P48+(P47-P48)*(K46-K48)/(K47-K48))","v":5.6317051080792886E-2},{"$f":"IF(K46=K48,Q48,Q48+(Q47-Q48)*(K46-K48)/(K47-K48))","v":3.8951153242378654E-2},{"$f":"D63","v":434.21797065556956},{"$f":"IF(R46=R48,S48,S48+(S47-S48)*(R46-R48)/(R47-R48))","v":0.66578202934443043},{"$f":"IF(R46=R48,T48,T48+(T47-T48)*(R46-R48)/(R47-R48))","v":0.58840765281997476},{"$f":"IF(R46=R48,U48,U48+(U47-U48)*(R46-R48)/(R47-R48))","v":0.90182944988553171},{"$f":"IF(R46=R48,V48,V48+(V47-V48)*(R46-R48)/(R47-R48))","v":0.70129866749219005},{"$f":"IF(R46=R48,W48,W48+(W47-W48)*(R46-R48)/(R47-R48))","v":0.50525124695108881},{"$f":"IF(R46=R48,X48,X48+(X47-X48)*(R46-R48)/(R47-R48))","v":0.70814226162330396},{"$f":"D73","v":256.39727202422227},{"$f":"IF(Y46=Y48,Z48,Z48+(Z47-Z48)*(Y46-Y48)/(Y47-Y48))","v":0.84360272797577773},{"$f":"IF(Y46=Y48,AA48,AA48+(AA47-AA48)*(Y46-Y48)/(Y47-Y48))","v":0.81796300077335549},{"$f":"IF(Y46=Y48,AB48,AB48+(AB47-AB48)*(Y46-Y48)/(Y47-Y48))","v":0.99436027279757777},{"$f":"IF(Y46=Y48,AC48,AC48+(AC47-AC48)*(Y46-Y48)/(Y47-Y48))","v":0.9118013639878888},{"$f":"IF(Y46=Y48,AD48,AD48+(AD47-AD48)*(Y46-Y48)/(Y47-Y48))","v":0.78540409196366656},{"$f":"IF(Y46=Y48,AE48,AE48+(AE47-AE48)*(Y46-Y48)/(Y47-Y48))","v":0.91616163678546658},{"$f":"AC14","v":408.88040775932353},{"$f":"IF(AF46=AF48,AG48,AG48+(AG47-AG48)*(AF46-AF48)/(AF47-AF48))","v":0.69111959224067643},{"$f":"IF(AF46=AF48,AH48,AH48+(AH47-AH48)*(AF46-AF48)/(AF47-AF48))","v":0.63401526603321767},{"$f":"IF(AF46=AF48,AI48,AI48+(AI47-AI48)*(AF46-AF48)/(AF47-AF48))","v":0.94490330680914991},{"$f":"IF(AF46=AF48,AJ48,AJ48+(AJ47-AJ48)*(AF46-AF48)/(AF47-AF48))","v":0.75957506215355586},{"$f":"IF(AF46=AF48,AK48,AK48+(AK47-AK48)*(AF46-AF48)/(AF47-AF48))","v":0.54579134758508241},{"$f":"IF(AF46=AF48,AL48,AL48+(AL47-AL48)*(AF46-AF48)/(AF47-AF48))","v":0.76135114370542056}]
[null,null,null,"fy/fyk",{"$f":"IF(E42=0,1,(SUM(F73:F82)+0.5*(E42-E43)*(F77+F78))/E42)","v":0.9118013639878888},null,null,null,null,null,{"$f":"CEILING(K46,100)","v":900},{"$f":"VLOOKUP(K47,$B$105:$H$117,2,TRUE)","v":7.0000000000000007E-2},{"$f":"VLOOKUP(K47,$B$105:$H$117,3,TRUE)","v":0.02},{"$f":"VLOOKUP(K47,$B$105:$H$117,4,TRUE)","v":0.03},{"$f":"VLOOKUP(K47,$B$105:$H$117,5,TRUE)","v":0},{"$f":"VLOOKUP(K47,$B$105:$H$117,6,TRUE)","v":0.05},{"$f":"VLOOKUP(K47,$B$105:$H$117,7,TRUE)","v":0.02},{"$f":"CEILING(R46,100)","v":500},{"$f":"VLOOKUP(R47,$B$105:$H$117,2,TRUE)","v":0.6},{"$f":"VLOOKUP(R47,$B$105:$H$117,3,TRUE)","v":0.47},{"$f":"VLOOKUP(R47,$B$105:$H$117,4,TRUE)","v":0.79},{"$f":"VLOOKUP(R47,$B$105:$H$117,5,TRUE)","v":0.55000000000000004},{"$f":"VLOOKUP(R47,$B$105:$H$117,6,TRUE)","v":0.4},{"$f":"VLOOKUP(R47,$B$105:$H$117,7,TRUE)","v":0.56999999999999995},{"$f":"CEILING(Y46,100)","v":300},{"$f":"VLOOKUP(Y47,$B$105:$H$117,2,TRUE)","v":0.8},{"$f":"VLOOKUP(Y47,$B$105:$H$117,3,TRUE)","v":0.77},{"$f":"VLOOKUP(Y47,$B$105:$H$117,4,TRUE)","v":0.99},{"$f":"VLOOKUP(Y47,$B$105:$H$117,5,TRUE)","v":0.89},{"$f":"VLOOKUP(Y47,$B$105:$H$117,6,TRUE)","v":0.72},{"$f":"VLOOKUP(Y47,$B$105:$H$117,7,TRUE)","v":0.89},{"$f":"CEILING(AF46,100)","v":500},{"$f":"VLOOKUP(AF47,$B$105:$H$117,2,TRUE)","v":0.6},{"$f":"VLOOKUP(AF47,$B$105:$H$117,3,TRUE)","v":0.47},{"$f":"VLOOKUP(AF47,$B$105:$H$117,4,TRUE)","v":0.79},{"$f":"VLOOKUP(AF47,$B$105:$H$117,5,TRUE)","v":0.55000000000000004},{"$f":"VLOOKUP(AF47,$B$105:$H$117,6,TRUE)","v":0.4},{"$f":"VLOOKUP(AF47,$B$105:$H$117,7,TRUE)","v":0.56999999999999995}]
[null,"Bøjler",null,"E/Ek",{"$f":"E83","v":0.94490330680914991},null,null,null,null,null,{"$f":"MAX(FLOOR(K46,100),20)","v":800},{"$f":"VLOOKUP(K48,$B$105:$H$117,2,TRUE)","v":0.09},{"$f":"VLOOKUP(K48,$B$105:$H$117,3,TRUE)","v":0.05},{"$f":"VLOOKUP(K48,$B$105:$H$117,4,TRUE)","v":0.08},{"$f":"VLOOKUP(K48,$B$105:$H$117,5,TRUE)","v":0},{"$f":"VLOOKUP(K48,$B$105:$H$117,6,TRUE)","v":0.06},{"$f":"VLOOKUP(K48,$B$105:$H$117,7,TRUE)","v":0.05},{"$f":"MAX(FLOOR(R46,100),20)","v":400},{"$f":"VLOOKUP(R48,$B$105:$H$117,2,TRUE)","v":0.7},{"$f":"VLOOKUP(R48,$B$105:$H$117,3,TRUE)","v":0.65},{"$f":"VLOOKUP(R48,$B$105:$H$117,4,TRUE)","v":0.96},{"$f":"VLOOKUP(R48,$B$105:$H$117,5,TRUE)","v":0.78},{"$f":"VLOOKUP(R48,$B$105:$H$117,6,TRUE)","v":0.56000000000000005},{"$f":"VLOOKUP(R48,$B$105:$H$117,7,TRUE)","v":0.78},{"$f":"MAX(FLOOR(Y46,100),20)","v":200},{"$f":"VLOOKUP(Y48,$B$105:$H$117,2,TRUE)","v":0.9},{"$f":"VLOOKUP(Y48,$B$105:$H$117,3,TRUE)","v":0.88},{"$f":"VLOOKUP(Y48,$B$105:$H$117,4,TRUE)","v":1},{"$f":"VLOOKUP(Y48,$B$105:$H$117,5,TRUE)","v":0.94},{"$f":"VLOOKUP(Y48,$B$105:$H$117,6,TRUE)","v":0.87},{"$f":"VLOOKUP(Y48,$B$105:$H$117,7,TRUE)","v":0.95},{"$f":"MAX(FLOOR(AF46,100),20)","v":400},{"$f":"VLOOKUP(AF48,$B$105:$H$117,2,TRUE)","v":0.7},{"$f":"VLOOKUP(AF48,$B$105:$H$117,3,TRUE)","v":0.65},{"$f":"VLOOKUP(AF48,$B$105:$H$117,4,TRUE)","v":0.96},{"$f":"VLOOKUP(AF48,$B$105:$H$117,5,TRUE)","v":0.78},{"$f":"VLOOKUP(AF48,$B$105:$H$117,6,TRUE)","v":0.56000000000000005},{"$f":"VLOOKUP(AF48,$B$105:$H$117,7,TRUE)","v":0.78}]
[null,null,null,"fy/fyk",{"$f":"F83","v":0.75957506215355586},null,null,null,null,null,"Temp-2",null,null,null,null,null,null,"Temp-12",null,null,null,null,null,null,"Temp-22"]
[null,null,null,null,null,null,null,null,null,null,{"$f":"D54","v":0},{"$f":"IF(K50=K52,L52,L52+(L51-L52)*(K50-K52)/(K51-K52))","v":{"$error":"#N/A"}},{"$f":"IF(K50=K52,M52,M52+(M51-M52)*(K50-K52)/(K51-K52))","v":{"$error":"#N/A"}},{"$f":"IF(K50=K52,N52,N52+(N51-N52)*(K50-K52)/(K51-K52))","v":{"$error":"#N/A"}},{"$f":"IF(K50=K52,O52,O52+(O51-O52)*(K50-K52)/(K51-K52))","v":{"$error":"#N/A"}},{"$f":"IF(K50=K52,P52,P52+(P51-P52)*(K50-K52)/(K51-K52))","v":{"$error":"#N/A"}},{"$f":"IF(K50=K52,Q52,Q52+(Q51-Q52)*(K50-K52)/(K51-K52))","v":{"$error":"#N/A"}},{"$f":"D64","v":434.2179706555695},{"$f":"IF(R50=R52,S52,S52+(S51-S52)*(R50-R52)/(R51-R52))","v":0.66578202934443043},{"$f":"IF(R50=R52,T52,T52+(T51-T52)*(R50-R52)/(R51-R52))","v":0.58840765281997487},{"$f":"IF(R50=R52,U52,U52+(U51-U52)*(R50-R52)/(R51-R52))","v":0.90182944988553182},{"$f":"IF(R50=R52,V52,V52+(V51-V52)*(R50-R52)/(R51-R52))","v":0.70129866749219016},{"$f":"IF(R50=R52,W52,W52+(W51-W52)*(R50-R52)/(R51-R52))","v":0.50525124695108881},{"$f":"IF(R50=R52,X52,X52+(X51-X52)*(R50-R52)/(R51-R52))","v":0.70814226162330407},{"$f":"D74","v":256.39727202422216},{"$f":"IF(Y50=Y52,Z52,Z52+(Z51-Z52)*(Y50-Y52)/(Y51-Y52))","v":0.84360272797577784},{"$f":"IF(Y50=Y52,AA52,AA52+(AA51-AA52)*(Y50-Y52)/(Y51-Y52))","v":0.8179630007733556},{"$f":"IF(Y50=Y52,AB52,AB52+(AB51-AB52)*(Y50-Y52)/(Y51-Y52))","v":0.99436027279757777},{"$f":"IF(Y50=Y52,AC52,AC52+(AC51-AC52)*(Y50-Y52)/(Y51-Y52))","v":0.91180136398788891},{"$f":"IF(Y50=Y52,AD52,AD52+(AD51-AD52)*(Y50-Y52)/(Y51-Y52))","v":0.78540409196366678},{"$f":"IF(Y50=Y52,AE52,AE52+(AE51-AE52)*(Y50-Y52)/(Y51-Y52))","v":0.91616163678546669}]
[null,null,null,null,null,null,null,null,null,null,{"$f":"CEILING(K50,100)","v":0},{"$f":"VLOOKUP(K51,$B$105:$H$117,2,TRUE)","v":{"$error":"#N/A"}},{"$f":"VLOOKUP(K51,$B$105:$H$117,3,TRUE)","v":{"$error":"#N/A"}},{"$f":"VLOOKUP(K51,$B$105:$H$117,4,TRUE)","v":{"$error":"#N/A"}},{"$f":"VLOOKUP(K51,$B$105:$H$117,5,TRUE)","v":{"$error":"#N/A"}},{"$f":"VLOOKUP(K51,$B$105:$H$117,6,TRUE)","v":{"$error":"#N/A"}},{"$f":"VLOOKUP(K51,$B$105:$H$117,7,TRUE)","v":{"$error":"#N/A"}},{"$f":"CEILING(R50,100)","v":500},{"$f":"VLOOKUP(R51,$B$105:$H$117,2,TRUE)","v":0.6},{"$f":"VLOOKUP(R51,$B$105:$H$117,3,TRUE)","v":0.47},{"$f":"VLOOKUP(R51,$B$105:$H$117,4,TRUE)","v":0.79},{"$f":"VLOOKUP(R51,$B$105:$H$117,5,TRUE)","v":0.55000000000000004},{"$f":"VLOOKUP(R51,$B$105:$H$117,6,TRUE)","v":0.4},{"$f":"VLOOKUP(R51,$B$105:$H$117,7,TRUE)","v":0.56999999999999995},{"$f":"CEILING(Y50,100)","v":300},{"$f":"VLOOKUP(Y51,$B$105:$H$117,2,TRUE)","v":0.8},{"$f":"VLOOKUP(Y51,$B$105:$H$117,3,TRUE)","v":0.77},{"$f":"VLOOKUP(Y51,$B$105:$H$117,4,TRUE)","v":0.99},{"$f":"VLOOKUP(Y51,$B$105:$H$117,5,TRUE)","v":0.89},{"$f":"VLOOKUP(Y51,$B$105:$H$117,6,TRUE)","v":0.72},{"$f":"VLOOKUP(Y51,$B$105:$H$117,7,TRUE)","v":0.89}]
[null,null,null,"Temp","E/Ek","fy/fyk",null,null,null,null,{"$f":"MAX(FLOOR(K50,100),20)","v":20},{"$f":"VLOOKUP(K52,$B$105:$H$117,2,TRUE)","v":1},{"$f":"VLOOKUP(K52,$B$105:$H$117,3,TRUE)","v":1},{"$f":"VLOOKUP(K52,$B$105:$H$117,4,TRUE)","v":1},{"$f":"VLOOKUP(K52,$B$105:$H$117,5,TRUE)","v":1},{"$f":"VLOOKUP(K52,$B$105:$H$117,6,TRUE)","v":1},{"$f":"VLOOKUP(K52,$B$105:$H$117,7,TRUE)","v":1},{"$f":"MAX(FLOOR(R50,100),20)","v":400},{"$f":"VLOOKUP(R52,$B$105:$H$117,2,TRUE)","v":0.7},{"$f":"VLOOKUP(R52,$B$105:$H$117,3,TRUE)","v":0.65},{"$f":"VLOOKUP(R52,$B$105:$H$117,4,TRUE)","v":0.96},{"$f":"VLOOKUP(R52,$B$105:$H$117,5,TRUE)","v":0.78},{"$f":"VLOOKUP(R52,$B$105:$H$117,6,TRUE)","v":0.56000000000000005},{"$f":"VLOOKUP(R52,$B$105:$H$117,7,TRUE)","v":0.78},{"$f":"MAX(FLOOR(Y50,100),20)","v":200},{"$f":"VLOOKUP(Y52,$B$105:$H$117,2,TRUE)","v":0.9},{"$f":"VLOOKUP(Y52,$B$105:$H$117,3,TRUE)","v":0.88},{"$f":"VLOOKUP(Y52,$B$105:$H$117,4,TRUE)","v":1},{"$f":"VLOOKUP(Y52,$B$105:$H$117,5,TRUE)","v":0.94},{"$f":"VLOOKUP(Y52,$B$105:$H$117,6,TRUE)","v":0.87},{"$f":"VLOOKUP(Y52,$B$105:$H$117,7,TRUE)","v":0.95}]
[null,"Træklag 1",1,{"$f":"M30","v":836.82948919207115},{"$f":"IF(D53=0,0,INDEX($L$45:$Q$84,2+(C53-1)*4,$D$28))","v":6.1585255403964423E-2},{"$f":"IF(D53=0,0,INDEX($L$45:$Q$84,2+(C53-1)*4,$D$28+1))","v":0},null,null,null,null,"Temp-3",null,null,null,null,null,null,"Temp-13",null,null,null,null,null,null,"Temp-23"]
[null,null,2,{"$f":"N30","v":0},0,0,null,null,null,null,{"$f":"D55","v":0},{"$f":"IF(K54=K56,L56,L56+(L55-L56)*(K54-K56)/(K55-K56))","v":{"$error":"#N/A"}},{"$f":"IF(K54=K56,M56,M56+(M55-M56)*(K54-K56)/(K55-K56))","v":{"$error":"#N/A"}},{"$f":"IF(K54=K56,N56,N56+(N55-N56)*(K54-K56)/(K55-K56))","v":{"$error":"#N/A"}},{"$f":"IF(K54=K56,O56,O56+(O55-O56)*(K54-K56)/(K55-K56))","v":{"$error":"#N/A"}},{"$f":"IF(K54=K56,P56,P56+(P55-P56)*(K54-K56)/(K55-K56))","v":{"$error":"#N/A"}},{"$f":"IF(K54=K56,Q56,Q56+(Q55-Q56)*(K54-K56)/(K55-K56))","v":{"$error":"#N/A"}},{"$f":"D65","v":0},{"$f":"IF(R54=R56,S56,S56+(S55-S56)*(R54-R56)/(R55-R56))","v":{"$error":"#N/A"}},{"$f":"IF(R54=R56,T56,T56+(T55-T56)*(R54-R56)/(R55-R56))","v":{"$error":"#N/A"}},{"$f":"IF(R54=R56,U56,U56+(U55-U56)*(R54-R56)/(R55-R56))","v":{"$error":"#N/A"}},{"$f":"IF(R54=R56,V56,V56+(V55-V56)*(R54-R56)/(R55-R56))","v":{"$error":"#N/A"}},{"$f":"IF(R54=R56,W56,W56+(W55-W56)*(R54-R56)/(R55-R56))","v":{"$error":"#N/A"}},{"$f":"IF(R54=R56,X56,X56+(X55-X56)*(R54-R56)/(R55-R56))","v":{"$error":"#N/A"}},{"$f":"D75","v":0},{"$f":"IF(Y54=Y56,Z56,Z56+(Z55-Z56)*(Y54-Y56)/(Y55-Y56))","v":{"$error":"#N/A"}},{"$f":"IF(Y54=Y56,AA56,AA56+(AA55-AA56)*(Y54-Y56)/(Y55-Y56))","v":{"$error":"#N/A"}},{"$f":"IF(Y54=Y56,AB56,AB56+(AB55-AB56)*(Y54-Y56)/(Y55-Y56))","v":{"$error":"#N/A"}},{"$f":"IF(Y54=Y56,AC56,AC56+(AC55-AC56)*(Y54-Y56)/(Y55-Y56))","v":{"$error":"#N/A"}},{"$f":"IF(Y54=Y56,AD56,AD56+(AD55-AD56)*(Y54-Y56)/(Y55-Y56))","v":{"$error":"#N/A"}},{"$f":"IF(Y54=Y56,AE56,AE56+(AE55-AE56)*(Y54-Y56)/(Y55-Y56))","v":{"$error":"#N/A"}}]
[null,null,3,{"$f":"O30","v":0},0,0,null,null,null,null,{"$f":"CEILING(K54,100)","v":0},{"$f":"VLOOKUP(K55,$B$105:$H$117,2,TRUE)","v":{"$error":"#N/A"}},{"$f":"VLOOKUP(K55,$B$105:$H$117,3,TRUE)","v":{"$error":"#N/A"}},{"$f":"VLOOKUP(K55,$B$105:$H$117,4,TRUE)","v":{"$error":"#N/A"}},{"$f":"VLOOKUP(K55,$B$105:$H$117,5,TRUE)","v":{"$error":"#N/A"}},{"$f":"VLOOKUP(K55,$B$105:$H$117,6,TRUE)","v":{"$error":"#N/A"}},{"$f":"VLOOKUP(K55,$B$105:$H$117,7,TRUE)","v":{"$error":"#N/A"}},{"$f":"CEILING(R54,100)","v":0},{"$f":"VLOOKUP(R55,$B$105:$H$117,2,TRUE)","v":{"$error":"#N/A"}},{"$f":"VLOOKUP(R55,$B$105:$H$117,3,TRUE)","v":{"$error":"#N/A"}},{"$f":"VLOOKUP(R55,$B$105:$H$117,4,TRUE)","v":{"$error":"#N/A"}},{"$f":"VLOOKUP(R55,$B$105:$H$117,5,TRUE)","v":{"$error":"#N/A"}},{"$f":"VLOOKUP(R55,$B$105:$H$117,6,TRUE)","v":{"$error":"#N/A"}},{"$f":"VLOOKUP(R55,$B$105:$H$117,7,TRUE)","v":{"$error":"#N/A"}},{"$f":"CEILING(Y54,100)","v":0},{"$f":"VLOOKUP(Y55,$B$105:$H$117,2,TRUE)","v":{"$error":"#N/A"}},{"$f":"VLOOKUP(Y55,$B$105:$H$117,3,TRUE)","v":{"$error":"#N/A"}},{"$f":"VLOOKUP(Y55,$B$105:$H$117,4,TRUE)","v":{"$error":"#N/A"}},{"$f":"VLOOKUP(Y55,$B$105:$H$117,5,TRUE)","v":{"$error":"#N/A"}},{"$f":"VLOOKUP(Y55,$B$105:$H$117,6,TRUE)","v":{"$error":"#N/A"}},{"$f":"VLOOKUP(Y55,$B$105:$H$117,7,TRUE)","v":{"$error":"#N/A"}}]
[null,null,4,{"$f":"P30","v":0},0,0,null,null,null,null,{"$f":"MAX(FLOOR(K54,100),20)","v":20},{"$f":"VLOOKUP(K56,$B$105:$H$117,2,TRUE)","v":1},{"$f":"VLOOKUP(K56,$B$105:$H$117,3,TRUE)","v":1},{"$f":"VLOOKUP(K56,$B$105:$H$117,4,TRUE)","v":1},{"$f":"VLOOKUP(K56,$B$105:$H$117,5,TRUE)","v":1},{"$f":"VLOOKUP(K56,$B$105:$H$117,6,TRUE)","v":1},{"$f":"VLOOKUP(K56,$B$105:$H$117,7,TRUE)","v":1},{"$f":"MAX(FLOOR(R54,100),20)","v":20},{"$f":"VLOOKUP(R56,$B$105:$H$117,2,TRUE)","v":1},{"$f":"VLOOKUP(R56,$B$105:$H$117,3,TRUE)","v":1},{"$f":"VLOOKUP(R56,$B$105:$H$117,4,TRUE)","v":1},{"$f":"VLOOKUP(R56,$B$105:$H$117,5,TRUE)","v":1},{"$f":"VLOOKUP(R56,$B$105:$H$117,6,TRUE)","v":1},{"$f":"VLOOKUP(R56,$B$105:$H$117,7,TRUE)","v":1},{"$f":"MAX(FLOOR(Y54,100),20)","v":20},{"$f":"VLOOKUP(Y56,$B$105:$H$117,2,TRUE)","v":1},{"$f":"VLOOKUP(Y56,$B$105:$H$117,3,TRUE)","v":1},{"$f":"VLOOKUP(Y56,$B$105:$H$117,4,TRUE)","v":1},{"$f":"VLOOKUP(Y56,$B$105:$H$117,5,TRUE)","v":1},{"$f":"VLOOKUP(Y56,$B$105:$H$117,6,TRUE)","v":1},{"$f":"VLOOKUP(Y56,$B$105:$H$117,7,TRUE)","v":1}]
[null,null,5,{"$f":"Q30","v":0},0,0,null,null,null,null,"Temp-4",null,null,null,null,null,null,"Temp-14",null,null,null,null,null,null,"Temp-24"]
[null,null,6,{"$f":"R30","v":0},0,0,null,null,null,null,{"$f":"D56","v":0},{"$f":"IF(K58=K60,L60,L60+(L59-L60)*(K58-K60)/(K59-K60))","v":{"$error":"#N/A"}},{"$f":"IF(K58=K60,M60,M60+(M59-M60)*(K58-K60)/(K59-K60))","v":{"$error":"#N/A"}},{"$f":"IF(K58=K60,N60,N60+(N59-N60)*(K58-K60)/(K59-K60))","v":{"$error":"#N/A"}},{"$f":"IF(K58=K60,O60,O60+(O59-O60)*(K58-K60)/(K59-K60))","v":{"$error":"#N/A"}},{"$f":"IF(K58=K60,P60,P60+(P59-P60)*(K58-K60)/(K59-K60))","v":{"$error":"#N/A"}},{"$f":"IF(K58=K60,Q60,Q60+(Q59-Q60)*(K58-K60)/(K59-K60))","v":{"$error":"#N/A"}},{"$f":"D66","v":0},{"$f":"IF(R58=R60,S60,S60+(S59-S60)*(R58-R60)/(R59-R60))","v":{"$error":"#N/A"}},{"$f":"IF(R58=R60,T60,T60+(T59-T60)*(R58-R60)/(R59-R60))","v":{"$error":"#N/A"}},{"$f":"IF(R58=R60,U60,U60+(U59-U60)*(R58-R60)/(R59-R60))","v":{"$error":"#N/A"}},{"$f":"IF(R58=R60,V60,V60+(V59-V60)*(R58-R60)/(R59-R60))","v":{"$error":"#N/A"}},{"$f":"IF(R58=R60,W60,W60+(W59-W60)*(R58-R60)/(R59-R60))","v":{"$error":"#N/A"}},{"$f":"IF(R58=R60,X60,X60+(X59-X60)*(R58-R60)/(R59-R60))","v":{"$error":"#N/A"}},{"$f":"D76","v":0},{"$f":"IF(Y58=Y60,Z60,Z60+(Z59-Z60)*(Y58-Y60)/(Y59-Y60))","v":{"$error":"#N/A"}},{"$f":"IF(Y58=Y60,AA60,AA60+(AA59-AA60)*(Y58-Y60)/(Y59-Y60))","v":{"$error":"#N/A"}},{"$f":"IF(Y58=Y60,AB60,AB60+(AB59-AB60)*(Y58-Y60)/(Y59-Y60))","v":{"$error":"#N/A"}},{"$f":"IF(Y58=Y60,AC60,AC60+(AC59-AC60)*(Y58-Y60)/(Y59-Y60))","v":{"$error":"#N/A"}},{"$f":"IF(Y58=Y60,AD60,AD60+(AD59-AD60)*(Y58-Y60)/(Y59-Y60))","v":{"$error":"#N/A"}},{"$f":"IF(Y58=Y60,AE60,AE60+(AE59-AE60)*(Y58-Y60)/(Y59-Y60))","v":{"$error":"#N/A"}}]
[null,null,7,{"$f":"S30","v":0},0,0,null,null,null,null,{"$f":"CEILING(K58,100)","v":0},{"$f":"VLOOKUP(K59,$B$105:$H$117,2,TRUE)","v":{"$error":"#N/A"}},{"$f":"VLOOKUP(K59,$B$105:$H$117,3,TRUE)","v":{"$error":"#N/A"}},{"$f":"VLOOKUP(K59,$B$105:$H$117,4,TRUE)","v":{"$error":"#N/A"}},{"$f":"VLOOKUP(K59,$B$105:$H$117,5,TRUE)","v":{"$error":"#N/A"}},{"$f":"VLOOKUP(K59,$B$105:$H$117,6,TRUE)","v":{"$error":"#N/A"}},{"$f":"VLOOKUP(K59,$B$105:$H$117,7,TRUE)","v":{"$error":"#N/A"}},{"$f":"CEILING(R58,100)","v":0},{"$f":"VLOOKUP(R59,$B$105:$H$117,2,TRUE)","v":{"$error":"#N/A"}},{"$f":"VLOOKUP(R59,$B$105:$H$117,3,TRUE)","v":{"$error":"#N/A"}},{"$f":"VLOOKUP(R59,$B$105:$H$117,4,TRUE)","v":{"$error":"#N/A"}},{"$f":"VLOOKUP(R59,$B$105:$H$117,5,TRUE)","v":{"$error":"#N/A"}},{"$f":"VLOOKUP(R59,$B$105:$H$117,6,TRUE)","v":{"$error":"#N/A"}},{"$f":"VLOOKUP(R59,$B$105:$H$117,7,TRUE)","v":{"$error":"#N/A"}},{"$f":"CEILING(Y58,100)","v":0},{"$f":"VLOOKUP(Y59,$B$105:$H$117,2,TRUE)","v":{"$error":"#N/A"}},{"$f":"VLOOKUP(Y59,$B$105:$H$117,3,TRUE)","v":{"$error":"#N/A"}},{"$f":"VLOOKUP(Y59,$B$105:$H$117,4,TRUE)","v":{"$error":"#N/A"}},{"$f":"VLOOKUP(Y59,$B$105:$H$117,5,TRUE)","v":{"$error":"#N/A"}},{"$f":"VLOOKUP(Y59,$B$105:$H$117,6,TRUE)","v":{"$error":"#N/A"}},{"$f":"VLOOKUP(Y59,$B$105:$H$117,7,TRUE)","v":{"$error":"#N/A"}}]
[null,null,8,{"$f":"T30","v":0},0,0,null,null,null,null,{"$f":"MAX(FLOOR(K58,100),20)","v":20},{"$f":"VLOOKUP(K60,$B$105:$H$117,2,TRUE)","v":1},{"$f":"VLOOKUP(K60,$B$105:$H$117,3,TRUE)","v":1},{"$f":"VLOOKUP(K60,$B$105:$H$117,4,TRUE)","v":1},{"$f":"VLOOKUP(K60,$B$105:$H$117,5,TRUE)","v":1},{"$f":"VLOOKUP(K60,$B$105:$H$117,6,TRUE)","v":1},{"$f":"VLOOKUP(K60,$B$105:$H$117,7,TRUE)","v":1},{"$f":"MAX(FLOOR(R58,100),20)","v":20},{"$f":"VLOOKUP(R60,$B$105:$H$117,2,TRUE)","v":1},{"$f":"VLOOKUP(R60,$B$105:$H$117,3,TRUE)","v":1},{"$f":"VLOOKUP(R60,$B$105:$H$117,4,TRUE)","v":1},{"$f":"VLOOKUP(R60,$B$105:$H$117,5,TRUE)","v":1},{"$f":"VLOOKUP(R60,$B$105:$H$117,6,TRUE)","v":1},{"$f":"VLOOKUP(R60,$B$105:$H$117,7,TRUE)","v":1},{"$f":"MAX(FLOOR(Y58,100),20)","v":20},{"$f":"VLOOKUP(Y60,$B$105:$H$117,2,TRUE)","v":1},{"$f":"VLOOKUP(Y60,$B$105:$H$117,3,TRUE)","v":1},{"$f":"VLOOKUP(Y60,$B$105:$H$117,4,TRUE)","v":1},{"$f":"VLOOKUP(Y60,$B$105:$H$117,5,TRUE)","v":1},{"$f":"VLOOKUP(Y60,$B$105:$H$117,6,TRUE)","v":1},{"$f":"VLOOKUP(Y60,$B$105:$H$117,7,TRUE)","v":1}]
[null,null,9,{"$f":"U30","v":0},0,0,null,null,null,null,"Temp-5",null,null,null,null,null,null,"Temp-15",null,null,null,null,null,null,"Temp-25"]
[null,null,10,{"$f":"V30","v":0},0,0,null,null,null,null,{"$f":"D57","v":0},{"$f":"IF(K62=K64,L64,L64+(L63-L64)*(K62-K64)/(K63-K64))","v":{"$error":"#N/A"}},{"$f":"IF(K62=K64,M64,M64+(M63-M64)*(K62-K64)/(K63-K64))","v":{"$error":"#N/A"}},{"$f":"IF(K62=K64,N64,N64+(N63-N64)*(K62-K64)/(K63-K64))","v":{"$error":"#N/A"}},{"$f":"IF(K62=K64,O64,O64+(O63-O64)*(K62-K64)/(K63-K64))","v":{"$error":"#N/A"}},{"$f":"IF(K62=K64,P64,P64+(P63-P64)*(K62-K64)/(K63-K64))","v":{"$error":"#N/A"}},{"$f":"IF(K62=K64,Q64,Q64+(Q63-Q64)*(K62-K64)/(K63-K64))","v":{"$error":"#N/A"}},{"$f":"D67","v":0},{"$f":"IF(R62=R64,S64,S64+(S63-S64)*(R62-R64)/(R63-R64))","v":{"$error":"#N/A"}},{"$f":"IF(R62=R64,T64,T64+(T63-T64)*(R62-R64)/(R63-R64))","v":{"$error":"#N/A"}},{"$f":"IF(R62=R64,U64,U64+(U63-U64)*(R62-R64)/(R63-R64))","v":{"$error":"#N/A"}},{"$f":"IF(R62=R64,V64,V64+(V63-V64)*(R62-R64)/(R63-R64))","v":{"$error":"#N/A"}},{"$f":"IF(R62=R64,W64,W64+(W63-W64)*(R62-R64)/(R63-R64))","v":{"$error":"#N/A"}},{"$f":"IF(R62=R64,X64,X64+(X63-X64)*(R62-R64)/(R63-R64))","v":{"$error":"#N/A"}},{"$f":"D77","v":0},{"$f":"IF(Y62=Y64,Z64,Z64+(Z63-Z64)*(Y62-Y64)/(Y63-Y64))","v":{"$error":"#N/A"}},{"$f":"IF(Y62=Y64,AA64,AA64+(AA63-AA64)*(Y62-Y64)/(Y63-Y64))","v":{"$error":"#N/A"}},{"$f":"IF(Y62=Y64,AB64,AB64+(AB63-AB64)*(Y62-Y64)/(Y63-Y64))","v":{"$error":"#N/A"}},{"$f":"IF(Y62=Y64,AC64,AC64+(AC63-AC64)*(Y62-Y64)/(Y63-Y64))","v":{"$error":"#N/A"}},{"$f":"IF(Y62=Y64,AD64,AD64+(AD63-AD64)*(Y62-Y64)/(Y63-Y64))","v":{"$error":"#N/A"}},{"$f":"IF(Y62=Y64,AE64,AE64+(AE63-AE64)*(Y62-Y64)/(Y63-Y64))","v":{"$error":"#N/A"}}]
[null,"Træklag 2",11,{"$f":"M34","v":434.21797065556956},{"$f":"IF(D63=0,0,INDEX($S$45:$X$84,2+(C63-11)*4,$D$28))","v":0.90182944988553171},{"$f":"IF(D63=0,0,INDEX($S$45:$X$84,2+(C63-11)*4,$D$28+1))","v":0.70129866749219005},null,null,null,null,{"$f":"CEILING(K62,100)","v":0},{"$f":"VLOOKUP(K63,$B$105:$H$117,2,TRUE)","v":{"$error":"#N/A"}},{"$f":"VLOOKUP(K63,$B$105:$H$117,3,TRUE)","v":{"$error":"#N/A"}},{"$f":"VLOOKUP(K63,$B$105:$H$117,4,TRUE)","v":{"$error":"#N/A"}},{"$f":"VLOOKUP(K63,$B$105:$H$117,5,TRUE)","v":{"$error":"#N/A"}},{"$f":"VLOOKUP(K63,$B$105:$H$117,6,TRUE)","v":{"$error":"#N/A"}},{"$f":"VLOOKUP(K63,$B$105:$H$117,7,TRUE)","v":{"$error":"#N/A"}},{"$f":"CEILING(R62,100)","v":0},{"$f":"VLOOKUP(R63,$B$105:$H$117,2,TRUE)","v":{"$error":"#N/A"}},{"$f":"VLOOKUP(R63,$B$105:$H$117,3,TRUE)","v":{"$error":"#N/A"}},{"$f":"VLOOKUP(R63,$B$105:$H$117,4,TRUE)","v":{"$error":"#N/A"}},{"$f":"VLOOKUP(R63,$B$105:$H$117,5,TRUE)","v":{"$error":"#N/A"}},{"$f":"VLOOKUP(R63,$B$105:$H$117,6,TRUE)","v":{"$error":"#N/A"}},{"$f":"VLOOKUP(R63,$B$105:$H$117,7,TRUE)","v":{"$error":"#N/A"}},{"$f":"CEILING(Y62,100)","v":0},{"$f":"VLOOKUP(Y63,$B$105:$H$117,2,TRUE)","v":{"$error":"#N/A"}},{"$f":"VLOOKUP(Y63,$B$105:$H$117,3,TRUE)","v":{"$error":"#N/A"}},{"$f":"VLOOKUP(Y63,$B$105:$H$117,4,TRUE)","v":{"$error":"#N/A"}},{"$f":"VLOOKUP(Y63,$B$105:$H$117,5,TRUE)","v":{"$error":"#N/A"}},{"$f":"VLOOKUP(Y63,$B$105:$H$117,6,TRUE)","v":{"$error":"#N/A"}},{"$f":"VLOOKUP(Y63,$B$105:$H$117,7,TRUE)","v":{"$error":"#N/A"}}]
[null,null,12,{"$f":"N34","v":434.2179706555695},0.90182944988553182,0.70129866749219016,null,null,null,null,{"$f":"MAX(FLOOR(K62,100),20)","v":20},{"$f":"VLOOKUP(K64,$B$105:$H$117,2,TRUE)","v":1},{"$f":"VLOOKUP(K64,$B$105:$H$117,3,TRUE)","v":1},{"$f":"VLOOKUP(K64,$B$105:$H$117,4,TRUE)","v":1},{"$f":"VLOOKUP(K64,$B$105:$H$117,5,TRUE)","v":1},{"$f":"VLOOKUP(K64,$B$105:$H$117,6,TRUE)","v":1},{"$f":"VLOOKUP(K64,$B$105:$H$117,7,TRUE)","v":1},{"$f":"MAX(FLOOR(R62,100),20)","v":20},{"$f":"VLOOKUP(R64,$B$105:$H$117,2,TRUE)","v":1},{"$f":"VLOOKUP(R64,$B$105:$H$117,3,TRUE)","v":1},{"$f":"VLOOKUP(R64,$B$105:$H$117,4,TRUE)","v":1},{"$f":"VLOOKUP(R64,$B$105:$H$117,5,TRUE)","v":1},{"$f":"VLOOKUP(R64,$B$105:$H$117,6,TRUE)","v":1},{"$f":"VLOOKUP(R64,$B$105:$H$117,7,TRUE)","v":1},{"$f":"MAX(FLOOR(Y62,100),20)","v":20},{"$f":"VLOOKUP(Y64,$B$105:$H$117,2,TRUE)","v":1},{"$f":"VLOOKUP(Y64,$B$105:$H$117,3,TRUE)","v":1},{"$f":"VLOOKUP(Y64,$B$105:$H$117,4,TRUE)","v":1},{"$f":"VLOOKUP(Y64,$B$105:$H$117,5,TRUE)","v":1},{"$f":"VLOOKUP(Y64,$B$105:$H$117,6,TRUE)","v":1},{"$f":"VLOOKUP(Y64,$B$105:$H$117,7,TRUE)","v":1}]
[null,null,13,{"$f":"O34","v":0},0,0,null,null,null,null,"Temp-6",null,null,null,null,null,null,"Temp-16",null,null,null,null,null,null,"Temp-26"]
[null,null,14,{"$f":"P34","v":0},0,0,null,null,null,null,{"$f":"D58","v":0},{"$f":"IF(K66=K68,L68,L68+(L67-L68)*(K66-K68)/(K67-K68))","v":{"$error":"#N/A"}},{"$f":"IF(K66=K68,M68,M68+(M67-M68)*(K66-K68)/(K67-K68))","v":{"$error":"#N/A"}},{"$f":"IF(K66=K68,N68,N68+(N67-N68)*(K66-K68)/(K67-K68))","v":{"$error":"#N/A"}},{"$f":"IF(K66=K68,O68,O68+(O67-O68)*(K66-K68)/(K67-K68))","v":{"$error":"#N/A"}},{"$f":"IF(K66=K68,P68,P68+(P67-P68)*(K66-K68)/(K67-K68))","v":{"$error":"#N/A"}},{"$f":"IF(K66=K68,Q68,Q68+(Q67-Q68)*(K66-K68)/(K67-K68))","v":{"$error":"#N/A"}},{"$f":"D68","v":0},{"$f":"IF(R66=R68,S68,S68+(S67-S68)*(R66-R68)/(R67-R68))","v":{"$error":"#N/A"}},{"$f":"IF(R66=R68,T68,T68+(T67-T68)*(R66-R68)/(R67-R68))","v":{"$error":"#N/A"}},{"$f":"IF(R66=R68,U68,U68+(U67-U68)*(R66-R68)/(R67-R68))","v":{"$error":"#N/A"}},{"$f":"IF(R66=R68,V68,V68+(V67-V68)*(R66-R68)/(R67-R68))","v":{"$error":"#N/A"}},{"$f":"IF(R66=R68,W68,W68+(W67-W68)*(R66-R68)/(R67-R68))","v":{"$error":"#N/A"}},{"$f":"IF(R66=R68,X68,X68+(X67-X68)*(R66-R68)/(R67-R68))","v":{"$error":"#N/A"}},{"$f":"D78","v":0},{"$f":"IF(Y66=Y68,Z68,Z68+(Z67-Z68)*(Y66-Y68)/(Y67-Y68))","v":{"$error":"#N/A"}},{"$f":"IF(Y66=Y68,AA68,AA68+(AA67-AA68)*(Y66-Y68)/(Y67-Y68))","v":{"$error":"#N/A"}},{"$f":"IF(Y66=Y68,AB68,AB68+(AB67-AB68)*(Y66-Y68)/(Y67-Y68))","v":{"$error":"#N/A"}},{"$f":"IF(Y66=Y68,AC68,AC68+(AC67-AC68)*(Y66-Y68)/(Y67-Y68))","v":{"$error":"#N/A"}},{"$f":"IF(Y66=Y68,AD68,AD68+(AD67-AD68)*(Y66-Y68)/(Y67-Y68))","v":{"$error":"#N/A"}},{"$f":"IF(Y66=Y68,AE68,AE68+(AE67-AE68)*(Y66-Y68)/(Y67-Y68))","v":{"$error":"#N/A"}}]
[null,null,15,{"$f":"Q34","v":0},0,0,null,null,null,null,{"$f":"CEILING(K66,100)","v":0},{"$f":"VLOOKUP(K67,$B$105:$H$117,2,TRUE)","v":{"$error":"#N/A"}},{"$f":"VLOOKUP(K67,$B$105:$H$117,3,TRUE)","v":{"$error":"#N/A"}},{"$f":"VLOOKUP(K67,$B$105:$H$117,4,TRUE)","v":{"$error":"#N/A"}},{"$f":"VLOOKUP(K67,$B$105:$H$117,5,TRUE)","v":{"$error":"#N/A"}},{"$f":"VLOOKUP(K67,$B$105:$H$117,6,TRUE)","v":{"$error":"#N/A"}},{"$f":"VLOOKUP(K67,$B$105:$H$117,7,TRUE)","v":{"$error":"#N/A"}},{"$f":"CEILING(R66,100)","v":0},{"$f":"VLOOKUP(R67,$B$105:$H$117,2,TRUE)","v":{"$error":"#N/A"}},{"$f":"VLOOKUP(R67,$B$105:$H$117,3,TRUE)","v":{"$error":"#N/A"}},{"$f":"VLOOKUP(R67,$B$105:$H$117,4,TRUE)","v":{"$error":"#N/A"}},{"$f":"VLOOKUP(R67,$B$105:$H$117,5,TRUE)","v":{"$error":"#N/A"}},{"$f":"VLOOKUP(R67,$B$105:$H$117,6,TRUE)","v":{"$error":"#N/A"}},{"$f":"VLOOKUP(R67,$B$105:$H$117,7,TRUE)","v":{"$error":"#N/A"}},{"$f":"CEILING(Y66,100)","v":0},{"$f":"VLOOKUP(Y67,$B$105:$H$117,2,TRUE)","v":{"$error":"#N/A"}},{"$f":"VLOOKUP(Y67,$B$105:$H$117,3,TRUE)","v":{"$error":"#N/A"}},{"$f":"VLOOKUP(Y67,$B$105:$H$117,4,TRUE)","v":{"$error":"#N/A"}},{"$f":"VLOOKUP(Y67,$B$105:$H$117,5,TRUE)","v":{"$error":"#N/A"}},{"$f":"VLOOKUP(Y67,$B$105:$H$117,6,TRUE)","v":{"$error":"#N/A"}},{"$f":"VLOOKUP(Y67,$B$105:$H$117,7,TRUE)","v":{"$error":"#N/A"}}]
[null,null,16,{"$f":"R34","v":0},0,0,null,null,null,null,{"$f":"MAX(FLOOR(K66,100),20)","v":20},{"$f":"VLOOKUP(K68,$B$105:$H$117,2,TRUE)","v":1},{"$f":"VLOOKUP(K68,$B$105:$H$117,3,TRUE)","v":1},{"$f":"VLOOKUP(K68,$B$105:$H$117,4,TRUE)","v":1},{"$f":"VLOOKUP(K68,$B$105:$H$117,5,TRUE)","v":1},{"$f":"VLOOKUP(K68,$B$105:$H$117,6,TRUE)","v":1},{"$f":"VLOOKUP(K68,$B$105:$H$117,7,TRUE)","v":1},{"$f":"MAX(FLOOR(R66,100),20)","v":20},{"$f":"VLOOKUP(R68,$B$105:$H$117,2,TRUE)","v":1},{"$f":"VLOOKUP(R68,$B$105:$H$117,3,TRUE)","v":1},{"$f":"VLOOKUP(R68,$B$105:$H$117,4,TRUE)","v":1},{"$f":"VLOOKUP(R68,$B$105:$H$117,5,TRUE)","v":1},{"$f":"VLOOKUP(R68,$B$105:$H$117,6,TRUE)","v":1},{"$f":"VLOOKUP(R68,$B$105:$H$117,7,TRUE)","v":1},{"$f":"MAX(FLOOR(Y66,100),20)","v":20},{"$f":"VLOOKUP(Y68,$B$105:$H$117,2,TRUE)","v":1},{"$f":"VLOOKUP(Y68,$B$105:$H$117,3,TRUE)","v":1},{"$f":"VLOOKUP(Y68,$B$105:$H$117,4,TRUE)","v":1},{"$f":"VLOOKUP(Y68,$B$105:$H$117,5,TRUE)","v":1},{"$f":"VLOOKUP(Y68,$B$105:$H$117,6,TRUE)","v":1},{"$f":"VLOOKUP(Y68,$B$105:$H$117,7,TRUE)","v":1}]
[null,null,17,{"$f":"S34","v":0},0,0,null,null,null,null,"Temp-7",null,null,null,null,null,null,"Temp-17",null,null,null,null,null,null,"Temp-27"]
[null,null,18,{"$f":"T34","v":0},0,0,null,null,null,null,{"$f":"D59","v":0},{"$f":"IF(K70=K72,L72,L72+(L71-L72)*(K70-K72)/(K71-K72))","v":{"$error":"#N/A"}},{"$f":"IF(K70=K72,M72,M72+(M71-M72)*(K70-K72)/(K71-K72))","v":{"$error":"#N/A"}},{"$f":"IF(K70=K72,N72,N72+(N71-N72)*(K70-K72)/(K71-K72))","v":{"$error":"#N/A"}},{"$f":"IF(K70=K72,O72,O72+(O71-O72)*(K70-K72)/(K71-K72))","v":{"$error":"#N/A"}},{"$f":"IF(K70=K72,P72,P72+(P71-P72)*(K70-K72)/(K71-K72))","v":{"$error":"#N/A"}},{"$f":"IF(K70=K72,Q72,Q72+(Q71-Q72)*(K70-K72)/(K71-K72))","v":{"$error":"#N/A"}},{"$f":"D69","v":0},{"$f":"IF(R70=R72,S72,S72+(S71-S72)*(R70-R72)/(R71-R72))","v":{"$error":"#N/A"}},{"$f":"IF(R70=R72,T72,T72+(T71-T72)*(R70-R72)/(R71-R72))","v":{"$error":"#N/A"}},{"$f":"IF(R70=R72,U72,U72+(U71-U72)*(R70-R72)/(R71-R72))","v":{"$error":"#N/A"}},{"$f":"IF(R70=R72,V72,V72+(V71-V72)*(R70-R72)/(R71-R72))","v":{"$error":"#N/A"}},{"$f":"IF(R70=R72,W72,W72+(W71-W72)*(R70-R72)/(R71-R72))","v":{"$error":"#N/A"}},{"$f":"IF(R70=R72,X72,X72+(X71-X72)*(R70-R72)/(R71-R72))","v":{"$error":"#N/A"}},{"$f":"D79","v":0},{"$f":"IF(Y70=Y72,Z72,Z72+(Z71-Z72)*(Y70-Y72)/(Y71-Y72))","v":{"$error":"#N/A"}},{"$f":"IF(Y70=Y72,AA72,AA72+(AA71-AA72)*(Y70-Y72)/(Y71-Y72))","v":{"$error":"#N/A"}},{"$f":"IF(Y70=Y72,AB72,AB72+(AB71-AB72)*(Y70-Y72)/(Y71-Y72))","v":{"$error":"#N/A"}},{"$f":"IF(Y70=Y72,AC72,AC72+(AC71-AC72)*(Y70-Y72)/(Y71-Y72))","v":{"$error":"#N/A"}},{"$f":"IF(Y70=Y72,AD72,AD72+(AD71-AD72)*(Y70-Y72)/(Y71-Y72))","v":{"$error":"#N/A"}},{"$f":"IF(Y70=Y72,AE72,AE72+(AE71-AE72)*(Y70-Y72)/(Y71-Y72))","v":{"$error":"#N/A"}}]
[null,null,19,{"$f":"U34","v":0},0,0,null,null,null,null,{"$f":"CEILING(K70,100)","v":0},{"$f":"VLOOKUP(K71,$B$105:$H$117,2,TRUE)","v":{"$error":"#N/A"}},{"$f":"VLOOKUP(K71,$B$105:$H$117,3,TRUE)","v":{"$error":"#N/A"}},{"$f":"VLOOKUP(K71,$B$105:$H$117,4,TRUE)","v":{"$error":"#N/A"}},{"$f":"VLOOKUP(K71,$B$105:$H$117,5,TRUE)","v":{"$error":"#N/A"}},{"$f":"VLOOKUP(K71,$B$105:$H$117,6,TRUE)","v":{"$error":"#N/A"}},{"$f":"VLOOKUP(K71,$B$105:$H$117,7,TRUE)","v":{"$error":"#N/A"}},{"$f":"CEILING(R70,100)","v":0},{"$f":"VLOOKUP(R71,$B$105:$H$117,2,TRUE)","v":{"$error":"#N/A"}},{"$f":"VLOOKUP(R71,$B$105:$H$117,3,TRUE)","v":{"$error":"#N/A"}},{"$f":"VLOOKUP(R71,$B$105:$H$117,4,TRUE)","v":{"$error":"#N/A"}},{"$f":"VLOOKUP(R71,$B$105:$H$117,5,TRUE)","v":{"$error":"#N/A"}},{"$f":"VLOOKUP(R71,$B$105:$H$117,6,TRUE)","v":{"$error":"#N/A"}},{"$f":"VLOOKUP(R71,$B$105:$H$117,7,TRUE)","v":{"$error":"#N/A"}},{"$f":"CEILING(Y70,100)","v":0},{"$f":"VLOOKUP(Y71,$B$105:$H$117,2,TRUE)","v":{"$error":"#N/A"}},{"$f":"VLOOKUP(Y71,$B$105:$H$117,3,TRUE)","v":{"$error":"#N/A"}},{"$f":"VLOOKUP(Y71,$B$105:$H$117,4,TRUE)","v":{"$error":"#N/A"}},{"$f":"VLOOKUP(Y71,$B$105:$H$117,5,TRUE)","v":{"$error":"#N/A"}},{"$f":"VLOOKUP(Y71,$B$105:$H$117,6,TRUE)","v":{"$error":"#N/A"}},{"$f":"VLOOKUP(Y71,$B$105:$H$117,7,TRUE)","v":{"$error":"#N/A"}}]
[null,null,20,{"$f":"V34","v":0},0,0,null,null,null,null,{"$f":"MAX(FLOOR(K70,100),20)","v":20},{"$f":"VLOOKUP(K72,$B$105:$H$117,2,TRUE)","v":1},{"$f":"VLOOKUP(K72,$B$105:$H$117,3,TRUE)","v":1},{"$f":"VLOOKUP(K72,$B$105:$H$117,4,TRUE)","v":1},{"$f":"VLOOKUP(K72,$B$105:$H$117,5,TRUE)","v":1},{"$f":"VLOOKUP(K72,$B$105:$H$117,6,TRUE)","v":1},{"$f":"VLOOKUP(K72,$B$105:$H$117,7,TRUE)","v":1},{"$f":"MAX(FLOOR(R70,100),20)","v":20},{"$f":"VLOOKUP(R72,$B$105:$H$117,2,TRUE)","v":1},{"$f":"VLOOKUP(R72,$B$105:$H$117,3,TRUE)","v":1},{"$f":"VLOOKUP(R72,$B$105:$H$117,4,TRUE)","v":1},{"$f":"VLOOKUP(R72,$B$105:$H$117,5,TRUE)","v":1},{"$f":"VLOOKUP(R72,$B$105:$H$117,6,TRUE)","v":1},{"$f":"VLOOKUP(R72,$B$105:$H$117,7,TRUE)","v":1},{"$f":"MAX(FLOOR(Y70,100),20)","v":20},{"$f":"VLOOKUP(Y72,$B$105:$H$117,2,TRUE)","v":1},{"$f":"VLOOKUP(Y72,$B$105:$H$117,3,TRUE)","v":1},{"$f":"VLOOKUP(Y72,$B$105:$H$117,4,TRUE)","v":1},{"$f":"VLOOKUP(Y72,$B$105:$H$117,5,TRUE)","v":1},{"$f":"VLOOKUP(Y72,$B$105:$H$117,6,TRUE)","v":1},{"$f":"VLOOKUP(Y72,$B$105:$H$117,7,TRUE)","v":1}]
[null,"Tryklag",21,{"$f":"M38","v":256.39727202422227},{"$f":"IF(D73=0,0,INDEX($Z$45:$AE$84,2+(C73-21)*4,$D$28))","v":0.99436027279757777},{"$f":"IF(D73=0,0,INDEX($Z$45:$AE$84,2+(C73-21)*4,$D$28+1))","v":0.9118013639878888},null,null,null,null,"Temp-8",null,null,null,null,null,null,"Temp-18",null,null,null,null,null,null,"Temp-28"]
[null,null,22,{"$f":"N38","v":256.39727202422216},0.99436027279757777,0.91180136398788891,null,null,null,null,{"$f":"D60","v":0},{"$f":"IF(K74=K76,L76,L76+(L75-L76)*(K74-K76)/(K75-K76))","v":{"$error":"#N/A"}},{"$f":"IF(K74=K76,M76,M76+(M75-M76)*(K74-K76)/(K75-K76))","v":{"$error":"#N/A"}},{"$f":"IF(K74=K76,N76,N76+(N75-N76)*(K74-K76)/(K75-K76))","v":{"$error":"#N/A"}},{"$f":"IF(K74=K76,O76,O76+(O75-O76)*(K74-K76)/(K75-K76))","v":{"$error":"#N/A"}},{"$f":"IF(K74=K76,P76,P76+(P75-P76)*(K74-K76)/(K75-K76))","v":{"$error":"#N/A"}},{"$f":"IF(K74=K76,Q76,Q76+(Q75-Q76)*(K74-K76)/(K75-K76))","v":{"$error":"#N/A"}},{"$f":"D70","v":0},{"$f":"IF(R74=R76,S76,S76+(S75-S76)*(R74-R76)/(R75-R76))","v":{"$error":"#N/A"}},{"$f":"IF(R74=R76,T76,T76+(T75-T76)*(R74-R76)/(R75-R76))","v":{"$error":"#N/A"}},{"$f":"IF(R74=R76,U76,U76+(U75-U76)*(R74-R76)/(R75-R76))","v":{"$error":"#N/A"}},{"$f":"IF(R74=R76,V76,V76+(V75-V76)*(R74-R76)/(R75-R76))","v":{"$error":"#N/A"}},{"$f":"IF(R74=R76,W76,W76+(W75-W76)*(R74-R76)/(R75-R76))","v":{"$error":"#N/A"}},{"$f":"IF(R74=R76,X76,X76+(X75-X76)*(R74-R76)/(R75-R76))","v":{"$error":"#N/A"}},{"$f":"D80","v":0},{"$f":"IF(Y74=Y76,Z76,Z76+(Z75-Z76)*(Y74-Y76)/(Y75-Y76))","v":{"$error":"#N/A"}},{"$f":"IF(Y74=Y76,AA76,AA76+(AA75-AA76)*(Y74-Y76)/(Y75-Y76))","v":{"$error":"#N/A"}},{"$f":"IF(Y74=Y76,AB76,AB76+(AB75-AB76)*(Y74-Y76)/(Y75-Y76))","v":{"$error":"#N/A"}},{"$f":"IF(Y74=Y76,AC76,AC76+(AC75-AC76)*(Y74-Y76)/(Y75-Y76))","v":{"$error":"#N/A"}},{"$f":"IF(Y74=Y76,AD76,AD76+(AD75-AD76)*(Y74-Y76)/(Y75-Y76))","v":{"$error":"#N/A"}},{"$f":"IF(Y74=Y76,AE76,AE76+(AE75-AE76)*(Y74-Y76)/(Y75-Y76))","v":{"$error":"#N/A"}}]
[null,null,23,{"$f":"O38","v":0},0,0,null,null,null,null,{"$f":"CEILING(K74,100)","v":0},{"$f":"VLOOKUP(K75,$B$105:$H$117,2,TRUE)","v":{"$error":"#N/A"}},{"$f":"VLOOKUP(K75,$B$105:$H$117,3,TRUE)","v":{"$error":"#N/A"}},{"$f":"VLOOKUP(K75,$B$105:$H$117,4,TRUE)","v":{"$error":"#N/A"}},{"$f":"VLOOKUP(K75,$B$105:$H$117,5,TRUE)","v":{"$error":"#N/A"}},{"$f":"VLOOKUP(K75,$B$105:$H$117,6,TRUE)","v":{"$error":"#N/A"}},{"$f":"VLOOKUP(K75,$B$105:$H$117,7,TRUE)","v":{"$error":"#N/A"}},{"$f":"CEILING(R74,100)","v":0},{"$f":"VLOOKUP(R75,$B$105:$H$117,2,TRUE)","v":{"$error":"#N/A"}},{"$f":"VLOOKUP(R75,$B$105:$H$117,3,TRUE)","v":{"$error":"#N/A"}},{"$f":"VLOOKUP(R75,$B$105:$H$117,4,TRUE)","v":{"$error":"#N/A"}},{"$f":"VLOOKUP(R75,$B$105:$H$117,5,TRUE)","v":{"$error":"#N/A"}},{"$f":"VLOOKUP(R75,$B$105:$H$117,6,TRUE)","v":{"$error":"#N/A"}},{"$f":"VLOOKUP(R75,$B$105:$H$117,7,TRUE)","v":{"$error":"#N/A"}},{"$f":"CEILING(Y74,100)","v":0},{"$f":"VLOOKUP(Y75,$B$105:$H$117,2,TRUE)","v":{"$error":"#N/A"}},{"$f":"VLOOKUP(Y75,$B$105:$H$117,3,TRUE)","v":{"$error":"#N/A"}},{"$f":"VLOOKUP(Y75,$B$105:$H$117,4,TRUE)","v":{"$error":"#N/A"}},{"$f":"VLOOKUP(Y75,$B$105:$H$117,5,TRUE)","v":{"$error":"#N/A"}},{"$f":"VLOOKUP(Y75,$B$105:$H$117,6,TRUE)","v":{"$error":"#N/A"}},{"$f":"VLOOKUP(Y75,$B$105:$H$117,7,TRUE)","v":{"$error":"#N/A"}}]
[null,null,24,{"$f":"P38","v":0},0,0,null,null,null,null,{"$f":"MAX(FLOOR(K74,100),20)","v":20},{"$f":"VLOOKUP(K76,$B$105:$H$117,2,TRUE)","v":1},{"$f":"VLOOKUP(K76,$B$105:$H$117,3,TRUE)","v":1},{"$f":"VLOOKUP(K76,$B$105:$H$117,4,TRUE)","v":1},{"$f":"VLOOKUP(K76,$B$105:$H$117,5,TRUE)","v":1},{"$f":"VLOOKUP(K76,$B$105:$H$117,6,TRUE)","v":1},{"$f":"VLOOKUP(K76,$B$105:$H$117,7,TRUE)","v":1},{"$f":"MAX(FLOOR(R74,100),20)","v":20},{"$f":"VLOOKUP(R76,$B$105:$H$117,2,TRUE)","v":1},{"$f":"VLOOKUP(R76,$B$105:$H$117,3,TRUE)","v":1},{"$f":"VLOOKUP(R76,$B$105:$H$117,4,TRUE)","v":1},{"$f":"VLOOKUP(R76,$B$105:$H$117,5,TRUE)","v":1},{"$f":"VLOOKUP(R76,$B$105:$H$117,6,TRUE)","v":1},{"$f":"VLOOKUP(R76,$B$105:$H$117,7,TRUE)","v":1},{"$f":"MAX(FLOOR(Y74,100),20)","v":20},{"$f":"VLOOKUP(Y76,$B$105:$H$117,2,TRUE)","v":1},{"$f":"VLOOKUP(Y76,$B$105:$H$117,3,TRUE)","v":1},{"$f":"VLOOKUP(Y76,$B$105:$H$117,4,TRUE)","v":1},{"$f":"VLOOKUP(Y76,$B$105:$H$117,5,TRUE)","v":1},{"$f":"VLOOKUP(Y76,$B$105:$H$117,6,TRUE)","v":1},{"$f":"VLOOKUP(Y76,$B$105:$H$117,7,TRUE)","v":1}]
[null,null,25,{"$f":"Q38","v":0},0,0,null,null,null,null,"Temp-9",null,null,null,null,null,null,"Temp-19",null,null,null,null,null,null,"Temp-29"]
[null,null,26,{"$f":"R38","v":0},0,0,null,null,null,null,{"$f":"D61","v":0},{"$f":"IF(K78=K80,L80,L80+(L79-L80)*(K78-K80)/(K79-K80))","v":{"$error":"#N/A"}},{"$f":"IF(K78=K80,M80,M80+(M79-M80)*(K78-K80)/(K79-K80))","v":{"$error":"#N/A"}},{"$f":"IF(K78=K80,N80,N80+(N79-N80)*(K78-K80)/(K79-K80))","v":{"$error":"#N/A"}},{"$f":"IF(K78=K80,O80,O80+(O79-O80)*(K78-K80)/(K79-K80))","v":{"$error":"#N/A"}},{"$f":"IF(K78=K80,P80,P80+(P79-P80)*(K78-K80)/(K79-K80))","v":{"$error":"#N/A"}},{"$f":"IF(K78=K80,Q80,Q80+(Q79-Q80)*(K78-K80)/(K79-K80))","v":{"$error":"#N/A"}},{"$f":"D71","v":0},{"$f":"IF(R78=R80,S80,S80+(S79-S80)*(R78-R80)/(R79-R80))","v":{"$error":"#N/A"}},{"$f":"IF(R78=R80,T80,T80+(T79-T80)*(R78-R80)/(R79-R80))","v":{"$error":"#N/A"}},{"$f":"IF(R78=R80,U80,U80+(U79-U80)*(R78-R80)/(R79-R80))","v":{"$error":"#N/A"}},{"$f":"IF(R78=R80,V80,V80+(V79-V80)*(R78-R80)/(R79-R80))","v":{"$error":"#N/A"}},{"$f":"IF(R78=R80,W80,W80+(W79-W80)*(R78-R80)/(R79-R80))","v":{"$error":"#N/A"}},{"$f":"IF(R78=R80,X80,X80+(X79-X80)*(R78-R80)/(R79-R80))","v":{"$error":"#N/A"}},{"$f":"D81","v":0},{"$f":"IF(Y78=Y80,Z80,Z80+(Z79-Z80)*(Y78-Y80)/(Y79-Y80))","v":{"$error":"#N/A"}},{"$f":"IF(Y78=Y80,AA80,AA80+(AA79-AA80)*(Y78-Y80)/(Y79-Y80))","v":{"$error":"#N/A"}},{"$f":"IF(Y78=Y80,AB80,AB80+(AB79-AB80)*(Y78-Y80)/(Y79-Y80))","v":{"$error":"#N/A"}},{"$f":"IF(Y78=Y80,AC80,AC80+(AC79-AC80)*(Y78-Y80)/(Y79-Y80))","v":{"$error":"#N/A"}},{"$f":"IF(Y78=Y80,AD80,AD80+(AD79-AD80)*(Y78-Y80)/(Y79-Y80))","v":{"$error":"#N/A"}},{"$f":"IF(Y78=Y80,AE80,AE80+(AE79-AE80)*(Y78-Y80)/(Y79-Y80))","v":{"$error":"#N/A"}}]
[null,null,27,{"$f":"S38","v":0},0,0,null,null,null,null,{"$f":"CEILING(K78,100)","v":0},{"$f":"VLOOKUP(K79,$B$105:$H$117,2,TRUE)","v":{"$error":"#N/A"}},{"$f":"VLOOKUP(K79,$B$105:$H$117,3,TRUE)","v":{"$error":"#N/A"}},{"$f":"VLOOKUP(K79,$B$105:$H$117,4,TRUE)","v":{"$error":"#N/A"}},{"$f":"VLOOKUP(K79,$B$105:$H$117,5,TRUE)","v":{"$error":"#N/A"}},{"$f":"VLOOKUP(K79,$B$105:$H$117,6,TRUE)","v":{"$error":"#N/A"}},{"$f":"VLOOKUP(K79,$B$105:$H$117,7,TRUE)","v":{"$error":"#N/A"}},{"$f":"CEILING(R78,100)","v":0},{"$f":"VLOOKUP(R79,$B$105:$H$117,2,TRUE)","v":{"$error":"#N/A"}},{"$f":"VLOOKUP(R79,$B$105:$H$117,3,TRUE)","v":{"$error":"#N/A"}},{"$f":"VLOOKUP(R79,$B$105:$H$117,4,TRUE)","v":{"$error":"#N/A"}},{"$f":"VLOOKUP(R79,$B$105:$H$117,5,TRUE)","v":{"$error":"#N/A"}},{"$f":"VLOOKUP(R79,$B$105:$H$117,6,TRUE)","v":{"$error":"#N/A"}},{"$f":"VLOOKUP(R79,$B$105:$H$117,7,TRUE)","v":{"$error":"#N/A"}},{"$f":"CEILING(Y78,100)","v":0},{"$f":"VLOOKUP(Y79,$B$105:$H$117,2,TRUE)","v":{"$error":"#N/A"}},{"$f":"VLOOKUP(Y79,$B$105:$H$117,3,TRUE)","v":{"$error":"#N/A"}},{"$f":"VLOOKUP(Y79,$B$105:$H$117,4,TRUE)","v":{"$error":"#N/A"}},{"$f":"VLOOKUP(Y79,$B$105:$H$117,5,TRUE)","v":{"$error":"#N/A"}},{"$f":"VLOOKUP(Y79,$B$105:$H$117,6,TRUE)","v":{"$error":"#N/A"}},{"$f":"VLOOKUP(Y79,$B$105:$H$117,7,TRUE)","v":{"$error":"#N/A"}}]
[null,null,28,{"$f":"T38","v":0},0,0,null,null,null,null,{"$f":"MAX(FLOOR(K78,100),20)","v":20},{"$f":"VLOOKUP(K80,$B$105:$H$117,2,TRUE)","v":1},{"$f":"VLOOKUP(K80,$B$105:$H$117,3,TRUE)","v":1},{"$f":"VLOOKUP(K80,$B$105:$H$117,4,TRUE)","v":1},{"$f":"VLOOKUP(K80,$B$105:$H$117,5,TRUE)","v":1},{"$f":"VLOOKUP(K80,$B$105:$H$117,6,TRUE)","v":1},{"$f":"VLOOKUP(K80,$B$105:$H$117,7,TRUE)","v":1},{"$f":"MAX(FLOOR(R78,100),20)","v":20},{"$f":"VLOOKUP(R80,$B$105:$H$117,2,TRUE)","v":1},{"$f":"VLOOKUP(R80,$B$105:$H$117,3,TRUE)","v":1},{"$f":"VLOOKUP(R80,$B$105:$H$117,4,TRUE)","v":1},{"$f":"VLOOKUP(R80,$B$105:$H$117,5,TRUE)","v":1},{"$f":"VLOOKUP(R80,$B$105:$H$117,6,TRUE)","v":1},{"$f":"VLOOKUP(R80,$B$105:$H$117,7,TRUE)","v":1},{"$f":"MAX(FLOOR(Y78,100),20)","v":20},{"$f":"VLOOKUP(Y80,$B$105:$H$117,2,TRUE)","v":1},{"$f":"VLOOKUP(Y80,$B$105:$H$117,3,TRUE)","v":1},{"$f":"VLOOKUP(Y80,$B$105:$H$117,4,TRUE)","v":1},{"$f":"VLOOKUP(Y80,$B$105:$H$117,5,TRUE)","v":1},{"$f":"VLOOKUP(Y80,$B$105:$H$117,6,TRUE)","v":1},{"$f":"VLOOKUP(Y80,$B$105:$H$117,7,TRUE)","v":1}]
[null,null,29,{"$f":"U38","v":0},0,0,null,null,null,null,"Temp-10",null,null,null,null,null,null,"Temp-20",null,null,null,null,null,null,"Temp-300"]
[null,null,30,{"$f":"V38","v":0},0,0,null,null,null,null,{"$f":"D62","v":0},{"$f":"IF(K82=K84,L84,L84+(L83-L84)*(K82-K84)/(K83-K84))","v":{"$error":"#N/A"}},{"$f":"IF(K82=K84,M84,M84+(M83-M84)*(K82-K84)/(K83-K84))","v":{"$error":"#N/A"}},{"$f":"IF(K82=K84,N84,N84+(N83-N84)*(K82-K84)/(K83-K84))","v":{"$error":"#N/A"}},{"$f":"IF(K82=K84,O84,O84+(O83-O84)*(K82-K84)/(K83-K84))","v":{"$error":"#N/A"}},{"$f":"IF(K82=K84,P84,P84+(P83-P84)*(K82-K84)/(K83-K84))","v":{"$error":"#N/A"}},{"$f":"IF(K82=K84,Q84,Q84+(Q83-Q84)*(K82-K84)/(K83-K84))","v":{"$error":"#N/A"}},{"$f":"D72","v":0},{"$f":"IF(R82=R84,S84,S84+(S83-S84)*(R82-R84)/(R83-R84))","v":{"$error":"#N/A"}},{"$f":"IF(R82=R84,T84,T84+(T83-T84)*(R82-R84)/(R83-R84))","v":{"$error":"#N/A"}},{"$f":"IF(R82=R84,U84,U84+(U83-U84)*(R82-R84)/(R83-R84))","v":{"$error":"#N/A"}},{"$f":"IF(R82=R84,V84,V84+(V83-V84)*(R82-R84)/(R83-R84))","v":{"$error":"#N/A"}},{"$f":"IF(R82=R84,W84,W84+(W83-W84)*(R82-R84)/(R83-R84))","v":{"$error":"#N/A"}},{"$f":"IF(R82=R84,X84,X84+(X83-X84)*(R82-R84)/(R83-R84))","v":{"$error":"#N/A"}},{"$f":"D82","v":0},{"$f":"IF(Y82=Y84,Z84,Z84+(Z83-Z84)*(Y82-Y84)/(Y83-Y84))","v":{"$error":"#N/A"}},{"$f":"IF(Y82=Y84,AA84,AA84+(AA83-AA84)*(Y82-Y84)/(Y83-Y84))","v":{"$error":"#N/A"}},{"$f":"IF(Y82=Y84,AB84,AB84+(AB83-AB84)*(Y82-Y84)/(Y83-Y84))","v":{"$error":"#N/A"}},{"$f":"IF(Y82=Y84,AC84,AC84+(AC83-AC84)*(Y82-Y84)/(Y83-Y84))","v":{"$error":"#N/A"}},{"$f":"IF(Y82=Y84,AD84,AD84+(AD83-AD84)*(Y82-Y84)/(Y83-Y84))","v":{"$error":"#N/A"}},{"$f":"IF(Y82=Y84,AE84,AE84+(AE83-AE84)*(Y82-Y84)/(Y83-Y84))","v":{"$error":"#N/A"}}]
[null,"Bøjler",31,{"$f":"AC14","v":408.88040775932353},{"$f":"IF(D83=0,0,INDEX($AG$45:$AL$48,2+(C83-31)*4,$D$28))","v":0.94490330680914991},{"$f":"IF(D83=0,0,INDEX($AG$45:$AL$84,2+(C83-31)*4,$D$28+1))","v":0.75957506215355586},null,null,null,null,{"$f":"CEILING(K82,100)","v":0},{"$f":"VLOOKUP(K83,$B$105:$H$117,2,TRUE)","v":{"$error":"#N/A"}},{"$f":"VLOOKUP(K83,$B$105:$H$117,3,TRUE)","v":{"$error":"#N/A"}},{"$f":"VLOOKUP(K83,$B$105:$H$117,4,TRUE)","v":{"$error":"#N/A"}},{"$f":"VLOOKUP(K83,$B$105:$H$117,5,TRUE)","v":{"$error":"#N/A"}},{"$f":"VLOOKUP(K83,$B$105:$H$117,6,TRUE)","v":{"$error":"#N/A"}},{"$f":"VLOOKUP(K83,$B$105:$H$117,7,TRUE)","v":{"$error":"#N/A"}},{"$f":"CEILING(R82,100)","v":0},{"$f":"VLOOKUP(R83,$B$105:$H$117,2,TRUE)","v":{"$error":"#N/A"}},{"$f":"VLOOKUP(R83,$B$105:$H$117,3,TRUE)","v":{"$error":"#N/A"}},{"$f":"VLOOKUP(R83,$B$105:$H$117,4,TRUE)","v":{"$error":"#N/A"}},{"$f":"VLOOKUP(R83,$B$105:$H$117,5,TRUE)","v":{"$error":"#N/A"}},{"$f":"VLOOKUP(R83,$B$105:$H$117,6,TRUE)","v":{"$error":"#N/A"}},{"$f":"VLOOKUP(R83,$B$105:$H$117,7,TRUE)","v":{"$error":"#N/A"}},{"$f":"CEILING(Y82,100)","v":0},{"$f":"VLOOKUP(Y83,$B$105:$H$117,2,TRUE)","v":{"$error":"#N/A"}},{"$f":"VLOOKUP(Y83,$B$105:$H$117,3,TRUE)","v":{"$error":"#N/A"}},{"$f":"VLOOKUP(Y83,$B$105:$H$117,4,TRUE)","v":{"$error":"#N/A"}},{"$f":"VLOOKUP(Y83,$B$105:$H$117,5,TRUE)","v":{"$error":"#N/A"}},{"$f":"VLOOKUP(Y83,$B$105:$H$117,6,TRUE)","v":{"$error":"#N/A"}},{"$f":"VLOOKUP(Y83,$B$105:$H$117,7,TRUE)","v":{"$error":"#N/A"}}]
[null,null,null,null,null,null,null,null,null,null,{"$f":"MAX(FLOOR(K82,100),20)","v":20},{"$f":"VLOOKUP(K84,$B$105:$H$117,2,TRUE)","v":1},{"$f":"VLOOKUP(K84,$B$105:$H$117,3,TRUE)","v":1},{"$f":"VLOOKUP(K84,$B$105:$H$117,4,TRUE)","v":1},{"$f":"VLOOKUP(K84,$B$105:$H$117,5,TRUE)","v":1},{"$f":"VLOOKUP(K84,$B$105:$H$117,6,TRUE)","v":1},{"$f":"VLOOKUP(K84,$B$105:$H$117,7,TRUE)","v":1},{"$f":"MAX(FLOOR(R82,100),20)","v":20},{"$f":"VLOOKUP(R84,$B$105:$H$117,2,TRUE)","v":1},{"$f":"VLOOKUP(R84,$B$105:$H$117,3,TRUE)","v":1},{"$f":"VLOOKUP(R84,$B$105:$H$117,4,TRUE)","v":1},{"$f":"VLOOKUP(R84,$B$105:$H$117,5,TRUE)","v":1},{"$f":"VLOOKUP(R84,$B$105:$H$117,6,TRUE)","v":1},{"$f":"VLOOKUP(R84,$B$105:$H$117,7,TRUE)","v":1},{"$f":"MAX(FLOOR(Y82,100),20)","v":20},{"$f":"VLOOKUP(Y84,$B$105:$H$117,2,TRUE)","v":1},{"$f":"VLOOKUP(Y84,$B$105:$H$117,3,TRUE)","v":1},{"$f":"VLOOKUP(Y84,$B$105:$H$117,4,TRUE)","v":1},{"$f":"VLOOKUP(Y84,$B$105:$H$117,5,TRUE)","v":1},{"$f":"VLOOKUP(Y84,$B$105:$H$117,6,TRUE)","v":1},{"$f":"VLOOKUP(Y84,$B$105:$H$117,7,TRUE)","v":1}]
[]
[]
[]
[]
[]
[]
[]
[]
[]
[null,"GRAF",null,null,null,null,null,null,null,null,null,null,1,2,3,4,5,6,7,8,9,10,1,2,3,4,5,6,7,8,9,10]
[null,"x",0,{"$f":"E16","v":0.15},{"$f":"E16","v":0.15},0,0,{"$f":"E26","v":1.7617867964443656E-2},{"$f":"D95-E26","v":0.13238213203555635},{"$f":"E95-E26","v":0.13238213203555635},{"$f":"E26","v":1.7617867964443656E-2},{"$f":"E26","v":1.7617867964443656E-2},{"$f":"E29","v":3.6999999999999998E-2},{"$f":"IF(N94>$E$31,M95,M95+$E$33)","v":3.6999999999999998E-2},3.6999999999999998E-2,3.6999999999999998E-2,3.6999999999999998E-2,3.6999999999999998E-2,3.6999999999999998E-2,3.6999999999999998E-2,3.6999999999999998E-2,3.6999999999999998E-2,{"$f":"E29","v":3.6999999999999998E-2},{"$f":"IF(X94>$E$37,W95,W95+$E$39)","v":0.11299999999999999},0.11299999999999999,0.11299999999999999,0.11299999999999999,0.11299999999999999,0.11299999999999999,0.11299999999999999,0.11299999999999999,0.11299999999999999,{"$f":"IF(E15>E16,E15,E16)","v":0.4}]
[null,"Opr rand",0,0,{"$f":"-E15","v":-0.4},{"$f":"-E15","v":-0.4},0]
[null,"Reduc rand",null,null,null,null,null,{"$f":"-E25","v":0},{"$f":"-E25","v":0},{"$f":"E96+E27","v":-0.38238213203555638},{"$f":"F96+E27","v":-0.38238213203555638},{"$f":"-E25","v":0}]
[null,"Træklag 1",null,null,null,null,null,null,null,null,null,null,{"$f":"-$E$15+$E$32","v":-0.4},{"$f":"-$E$15+$E$32","v":-0.4},-0.4,-0.4,-0.4,-0.4,-0.4,-0.4,-0.4,-0.4]
[null,"Træklag 2",null,null,null,null,null,null,null,null,null,null,null,null,null,null,null,null,null,null,null,null,{"$f":"-$E$15+$E$38","v":-0.36300000000000004},-0.36300000000000004,-0.36300000000000004,-0.36300000000000004,-0.36300000000000004,-0.36300000000000004,-0.36300000000000004,-0.36300000000000004,-0.36300000000000004,-0.36300000000000004]
[null,"Skala",null,null,null,null,null,null,null,null,null,null,null,null,null,null,null,null,null,null,null,null,null,null,null,null,null,null,null,null,null,null,{"$f":"IF(E15>E16,-E15,-E16)","v":-0.4}]
[]
[]
[null,"Tabel","type (+Q)",null,"type (+AC)",null,"type (+C)"]
[null,"Q-stål","E/Ek","fy/fyk","E/Ek","fy/fyk","E/Ek","fy/fyk"]
[null,20,1,1,1,1,1,1]
[null,100,1,0.96,1,0.98,1,0.99]
[null,200,0.9,0.88,1,0.94,0.87,0.95]
[null,300,0.8,0.77,0.99,0.89,0.72,0.89]
[null,400,0.7,0.65,0.96,0.78,0.56000000000000005,0.78]
[null,500,0.6,0.47,0.79,0.55000000000000004,0.4,0.56999999999999995]
[null,600,0.31,0.27,0.48,0.27,0.24,0.3]
[null,700,0.13,0.13,0.21,0.1,0.08,0.12]
[null,800,0.09,0.05,0.08,0,0.06,0.05]
[null,900,7.0000000000000007E-2,0.02,0.03,0,0.05,0.02]
[null,1000,0.04,0.01,0,0,0.03,0.01]
[null,1100,0.02,0.01,0,0,0.02,0]
[null,1200,0,0,0,0,0,0]
[]
[]
[]
[null,"Betontype",{"$f":"Makro!A3","v":2}]
[null,"Reduktionsparametre, beton",null,null,null,null,"Betontype,  fc,t/fck"]
[null,"q","fc,t/fck","ec1","ecu1,t","Indeks",1,2]
[null,20,{"$f":"IF($C$121=1,G124,H124)","v":1},2.5000000000000001E-3,0.02,1,1,1]
[null,100,{"$f":"IF($C$121=1,G125,H125)","v":1},4.0000000000000001E-3,2.2499999999999999E-2,2,1,1]
[null,200,1,5.4999999999999997E-3,2.5000000000000001E-2,3,0.95,1]
[null,300,0.93333330000000003,7.0000000000000001E-3,2.75E-2,4,0.85,{"$f":"H126-0.0666667","v":0.93333330000000003}]
[null,400,0.86666660000000006,0.01,0.03,5,0.75,{"$f":"H127-0.0666667","v":0.86666660000000006}]
[null,500,0.8,1.4999999999999999E-2,3.2500000000000001E-2,6,0.6,0.8]
[null,600,0.60000000000000009,2.5000000000000001E-2,3.5000000000000003E-2,7,0.45,{"$f":"H129-0.2","v":0.60000000000000009}]
[null,700,0.40000000000000008,2.5000000000000001E-2,3.7499999999999999E-2,8,0.3,{"$f":"H130-0.2","v":0.40000000000000008}]
[null,800,0.20000000000000007,2.5000000000000001E-2,0.04,9,0.15,{"$f":"H131-0.2","v":0.20000000000000007}]
[null,900,0,2.5000000000000001E-2,4.2500000000000003E-2,10,0.08,0]
[null,1000,0,2.5000000000000001E-2,4.4999999999999998E-2,11,0.04,0]
[null,1100,2.0426489726352815E-3,2.5000000000000001E-2,4.7500000000000001E-2,12,0.01,{"$f":"0+(1-0)/(1+(B135/100000)+(B135/1080)^2+(B135/690)^8+(B135/1000)^64)","v":2.0426489726352815E-3}]
[null,1200,8.5522613031592085E-6,null,null,13,0,{"$f":"0+(1-0)/(1+(B136/100000)+(B136/1080)^2+(B136/690)^8+(B136/1000)^64)","v":8.5522613031592085E-6}]

{"sheet":"Makro","index":5,"n_rows":20,"n_cols":5,"rows_kept":20,"cut":false,"hidden":false,"merged":[]}
[2,"Brand ja/nej"]
[2,"Brand ja/nej"]
[2,"Tilslag"]
[2,"Bratkølet eller"]
[]
[]
[]
[]
[]
[]
[]
[]
[]
[]
[]
[]
[]
[]
[]
[{"$f":"IF(E20=1,0,1000000)","v":1000000},null,null,null,0]