{"text_format":"1","workbook":"xlsx","n_sheets":5,"sheets":["Kold","Brand","610a","Geometri","Makro"],"not_rendered":{"charts":3,"images":5,"macros":1,"external_links":0,"defined_names":12,"comments":0,"pivot_tables":0},"unopened":[],"bounds":{"document_bytes":16777216,"sheet_cells":100000,"rows_first":2000,"rows_last":500,"rows_between":2000,"halvings":0,"cell_chars":16384,"cell_head_chars":4096},"cells_cut":0,"cells_raw":0,"read":"whole","date_system":"1900"}

{"sheet":"Kold","index":0,"n_rows":52,"n_cols":124,"rows_kept":52,"cut":false,"hidden":false,"merged":[[7,58,7,60],[23,83,23,89],[19,13,19,14],[22,18,22,20],[15,13,15,14],[16,13,16,14],[17,13,17,14],[22,15,22,17],[23,115,23,122],[23,91,23,98],[23,99,23,106],[23,107,23,114],[2,3,2,8],[3,3,3,8],[5,15,6,15],[4,12,4,20],[23,58,23,61],[23,62,23,68],[23,69,23,75],[23,76,23,82],[5,16,6,16],[2,10,2,11],[22,2,22,3],[22,8,22,11],[37,22,38,25],[40,22,40,25],[1,3,1,10],[4,10,4,11],[3,10,3,11],[22,4,22,7],[22,12,22,14],[5,12,6,13],[5,14,6,14],[2,12,2,20],[5,20,6,20],[5,17,6,19]]}
[]
[null,"Bruger:",null,{"$f":"Makro!D20","v":0},null,null,null,null,null,null,null,null,"Lastnedføring - 15 etager",null,null,null,null,null,null,null,"Betonelement-Foreningen feb 2019"]
[null,"Sagsnavn:",null,"Test projekt",null,null,null,null,null,"Sag nr.:","23 - 4545",null,{"$f":"BM44","v":"For ny bruger: Klik på knappen 'angiv nyt brugernavn' for ibrugtagning."}]
[null,"Bygningsdel:",null,"Test bygningsdel",null,null,null,null,null,"Dato:","2008-03-01"]
[null,"Emne:",null,"Vedvarende dimensioneringstilstand, 6.10b",null,null,null,null,null,"Init:","JFJ"]
[null,null,null,null,null,null,null,null,null,null,null,null," Egenvægt, gg,sup =",null,1,"gg,inf  =",0.9," Konsekvensklasse:  KFI =",null,null,1.1000000000000001]
[]
[null,null,null,null,null,null,null,null,null,null,null,null," Fladelaste  (kN/m2)",null,null,"gk","gfri,k","qk","gq","y0","Kategori",null,null,null,null,null,null,null,null,null,null,null,null,null,null,null,null,null,null,null,null,null,null,null,null,null,null,null,null,null,null,null,null,null,null,null,null,null,"Lastkategorier",null,null,"y0","y1","y2",null,"y0","y1","y2","Kontrol for E","Kontrol Sne"]
[null,null,null,null,null,null,null,null,null,null,null,null,"F0",null,null,0,0,0,null,null,null,null,null,null,null,null,null,null,null,null,null,null,null,null,null,null,null,null,null,null,null,null,null,null,null,null,null,null,null,null,null,null,null,null,null,null,null,null,"A",null,null,1,2,3,"A",0.5,0.3,0.2,{"$f":"MIN(MAX(BQ10:BQ22),MIN(1,SUM(COUNTIF(BQ27:BQ41,\"=E\"),COUNTIF(BX27:BX41,\"=E\"),COUNTIF(CE27:CE41,\"=E\"),COUNTIF(CL27:CL41,\"=E\"))))","v":0}]
[null,null,null,null,null,null,null,null,null,null,null,null,"F1","Tagflade, sne",null,3.1,1,0.8,1.5,0.3,{"$f":"INDEX($BG$9:$BG$16,BI10,1)","v":"N"},null,null,null,null,null,null,null,null,null,null,null,null,null,null,null,null,null,null,null,null,null,null,null,null,null,null,null,null,null,null,null,null,null,null,null,null,null,"B",{"$f":"M10","v":"F1"},{"$f":"Makro!E2","v":8},{"$f":"INDEX(psi,$BI10,BJ$9)","v":0.3},0.2,0,"B",0.6,0.4,0.2,{"$f":"IF(BI10=5,1,0)","v":0},{"$f":"IF(AND(BI10=8,T10<>BJ10,MIN(1,SUM(COUNTIF(BQ27:BQ41,\"=N\"),COUNTIF(BX27:BX41,\"=N\"),COUNTIF(CE27:CE41,\"=N\"),COUNTIF(CL27:CL41,\"=N\")))=1),1,0)","v":0}]
[null,null,null,null,null,null,null,null,null,null,null,null,"F2","Boligarealer",null,3.65,1.5,1.5,1.5,0.5,"A",null,null,null,null,null,null,null,null,null,null,null,null,null,null,null,null,null,null,null,null,null,null,null,null,null,null,null,null,null,null,null,null,null,null,null,null,null,"C",{"$f":"M11","v":"F2"},{"$f":"Makro!E3","v":1},0.5,0.3,0.2,"C",0.6,0.6,0.5,0]
[null,null,null,null,null,null,null,null,null,null,null,null,"F3","Kontorer",null,3.65,2,2.5,1.5,0.6,"B",null,null,null,null,null,null,null,null,null,null,null,null,null,null,null,null,null,null,null,null,null,null,null,null,null,null,null,null,null,null,null,null,null,null,null,null,null,"D","F3",{"$f":"Makro!E4","v":2},0.6,0.4,0.2,"D",0.6,0.6,0.5,0]
[null,null,null,null,null,null,null,null,null,null,null,null,"F4","Kontor med arkiv",null,3.65,2,7.5,1.5,0.6,"D",null,null,null,null,null,null,null,null,null,null,null,null,null,null,null,null,null,null,null,null,null,null,null,null,null,null,null,null,null,null,null,null,null,null,null,null,null,"E","F4",{"$f":"Makro!E5","v":4},0.6,0.6,0.5,"E",1,0.8,0.7,0]
[null,null,null,null,null,null,null,null,null,null,null,null,"F5","Kontorer",null,4.1500000000000004,4,4,1.5,0.6,"D",null,null,null,null,null,null,null,null,null,null,null,null,null,null,null,null,null,null,null,null,null,null,null,null,null,null,null,null,null,null,null,null,null,null,null,null,null,"F","F5",{"$f":"Makro!E6","v":4},0.6,0.6,0.5,"F",1,0.6,0.5,0]
[null,null,null,null,null,null,null,null,null,null,null,null,"F6","Kontorer",null,3.65,2,3.3,1.5,1,"G",null,null,null,null,null,null,null,null,null,null,null,null,null,null,null,null,null,null,null,null,null,null,null,null,null,null,null,null,null,null,null,null,null,null,null,null,null,"G","F6",{"$f":"Makro!E7","v":7},1,0.4,0.2,"G",1,0.4,0.2,0]
[null,null,null,null,null,null,null,null,null,null,null,null,"F7","Undervisning",null,3.65,2,4.8,1.5,0.6,"D",null,null,null,null,null,null,null,null,null,null,null,null,null,null,null,null,null,null,null,null,null,null,null,null,null,null,null,null,null,null,null,null,null,null,null,null,null,"N","F7",{"$f":"Makro!E8","v":4},0.6,0.6,0.5,"N",{"$f":"IF(BQ9=1,0.6,0.3)","v":0.3},0.2,0,0]
[null,null,null,null,null,null,null,null,null,null,null,null,"F8","Værksted",null,3.65,2,8.3000000000000007,1.5,0.6,"D",null,null,null,null,null,null,null,null,null,null,null,null,null,null,null,null,null,null,null,null,null,null,null,null,null,null,null,null,null,null,null,null,null,null,null,null,null,null,"F8",{"$f":"Makro!E9","v":4},0.6,0.6,0.5,null,null,null,null,0]
[null,null,null,null,null,null,null,null,null,null,null,null,"F9","Butiksarealer",null,3.65,2,3.3,1.5,0.3,"N",null,null,null,null,null,null,null,null,null,null,null,null,null,null,null,null,null,null,null,null,null,null,null,null,null,null,null,null,null,null,null,null,null,null,null,null,null,null,"F9",{"$f":"Makro!E10","v":8},0.3,0.2,0,null,null,null,null,0]
[null,null,null,null,null,null,null,null,null,null,null,null,"Linielaste (kN/m)",null,null,"gk","gfri,k","qk","gq","y0","Kategori"]
[null,null,null,null,null,null,null,null,null,null,null,null,"L0",null,null,0,0,0]
[null,null,null,null,null,null,null,null,null,null,null,null,"L1","Badeværelser",null,8,4,6,1.5,0.5,{"$f":"INDEX($BG$9:$BG$16,BI21,1)","v":"A"},null,null,null,null,null,null,null,null,null,null,null,null,null,null,null,null,null,null,null,null,null,null,null,null,null,null,null,null,null,null,null,null,null,null,null,null,null,null,"L1",{"$f":"Makro!E13","v":1},{"$f":"INDEX(psi,$BI21,BJ$9)","v":0.5},0.3,0.2,null,null,null,null,{"$f":"IF(BI21=5,1,0)","v":0}]
[null,null,null,null,null,null,null,null,null,null,null,null,"L2","Komprimator",null,0,8,10,1.5,0.6,{"$f":"INDEX($BG$9:$BG$16,BI22,1)","v":"D"},null,null,null,null,null,null,null,null,null,null,null,null,null,null,null,null,null,null,null,null,null,null,null,null,null,null,null,null,null,null,null,null,null,null,null,null,null,null,"L2",{"$f":"Makro!E14","v":4},0.6,0.6,0.5,null,null,null,null,{"$f":"IF(BI22=5,1,0)","v":0}]
[null,"Etage","Egenvægt i bærelinie",null,"Laste på venstre dækfelt",null,null,null,"Laste på højre dækfelt",null,null,null,"maksimalværdier",null,null,"reducerede værdier",null,null,"minimalværdier"]
[null,null,"gk","gfri,k","Lv","Fladelast","Linielast","sv","Lh","Fladelast","Linielast","sh","nv","no","nh","nv","no","nh","nv","no","nh",null,null,null,null,null,null,null,null,null,null,null,null,null,null,null,null,null,null,null,null,null,null,null,null,null,null,null,null,null,null,null,null,null,null,null,null,null,"Spændvidder",null,null,null,"Fladelaste, venstre dækfelt",null,null,null,null,null,null,"Linielaste, venstre dækfelt",null,null,null,null,null,null,"Fladelaste, højre dækfelt",null,null,null,null,null,null,"Linielaste, højre dækfelt",null,null,null,null,null,null,"Ng","DNmax (q)",null,null,null,null,null,null,null,"DNsædv (q)",null,null,null,null,null,null,null,"Nmax (q)",null,null,null,null,null,null,null,"Nsædv (q)",null,null,null,null,null,null,null,"No (q)"]
[null,null,"(kN/m)","(kN/m)","(m)",null,null,"(m)","(m)",null,null,"(m)","(kN/m)","(kN/m)","(kN/m)","(kN/m)","(kN/m)","(kN/m)","(kN/m)","(kN/m)","(kN/m)",null,null,null,null,null,null,null,null,null,null,null,null,null,null,null,null,null,null,null,null,null,null,null,null,null,null,null,null,null,null,null,null,null,null,null,null,null,"Lv","sv","Lh","sh",null,"gk","gg","qk","gq","gqyq","Kategori",null,"gk","gg","qk","gq","gqyq","Kategori",null,"gk","gg","qk","gq","gqyq","Kategori",null,"gk","gg","qk","gq","gqyq","Kategori",null,"A","B","C","D","E","F","G","N","A","B","C","D","E","F","G","N","A","B","C","D","E","F","G","N","A","B","C","D","E","F","G","N"]
[null,"Tag",null,null,6,{"$f":"INDEX($M$9:$M$18,$BK27,1)","v":"F3"},{"$f":"INDEX($M$20:$M$22,BR27,1)","v":"L2"},5,13,{"$f":"INDEX($M$9:$M$18,BY27,1)","v":"F3"},{"$f":"INDEX($M$20:$M$22,CF27,1)","v":"L1"},2,{"$f":"IF($BL$44=1,\"-\",0.5*BG27*(BL27*BM27+BN27*BO27)+IF(E26>0,(BG27-BH27)*(BS27*BT27+BU27*BV27)/BG27,0))","v":"-"},{"$f":"IF($BL$44=1,\"-\",CM27+DT27)","v":"-"},{"$f":"IF($BL$44=1,\"-\",0.5*BI27*(BZ27*CA27+CB27*CC27)+IF(I26>0,(BI27-BJ27)*(CG27*CH27+CI27*CJ27)/BI27))","v":"-"},{"$f":"IF($BL$44=1,\"-\",$U$6*(0.5*E26*($O$6*INDEX(fladelast,BK27,1)+$O$6*INDEX(fladelast,BK27,2)+INDEX(fladelast,BK27,3)*INDEX(fladelast,BK27,5)*INDEX(fladelast,BK27,4))+IF(E26>0,($O$6*INDEX(linielast,BR27,1)+$O$6*INDEX(linielast,BR27,2)+INDEX(linielast,BR27,3)*INDEX(linielast,BR27,5)*INDEX(linielast,BR27,4))*(E26-H26)/E26,0)))","v":"-"},{"$f":"IF($BL$44=1,\"-\",$U$6*$O$6*(C27+D27))","v":"-"},{"$f":"IF($BL$44=1,\"-\",$U$6*(0.5*I26*($O$6*INDEX(fladelast,BY27,1)+$O$6*INDEX(fladelast,BY27,2)+INDEX(fladelast,BY27,3)*INDEX(fladelast,BY27,5)*INDEX(fladelast,BY27,4))+IF(I26>0,($O$6*INDEX(linielast,CF27,1)+$O$6*INDEX(linielast,CF27,2)+INDEX(linielast,CF27,3)*INDEX(linielast,CF27,5)*INDEX(linielast,CF27,4))*(I26-L26)/I26)))","v":"-"},{"$f":"IF(BL44=1,\"-\",$Q$6*(0.5*E26*INDEX(fladelast,BK27,1)+IF(E26>0,INDEX(linielast,BR27,1)*(E26-H26)/E26)))","v":"-"},{"$f":"IF(BL44=1,\"-\",$Q$6*C27)","v":"-"},{"$f":"IF(BL44=1,\"-\",$Q$6*(0.5*I26*INDEX(fladelast,BY27,1)+IF(I26>0,INDEX(linielast,CF27,1)*(I26-L26)/I26)))","v":"-"}]
[null,"13. sal",12,5,6,{"$f":"INDEX($M$9:$M$18,$BK$28,1)","v":"F6"},"L1",2,13,"F1","L2",2,"-","-","-","-",{"$f":"IF($BL$44=1,\"-\",P26+Q26+R26+$U$6*$O$6*(C28+D28))","v":"-"},"-",{"$f":"IF($BL$44=1,\"-\",$Q$6*(0.5*E27*INDEX(fladelast,BK28,1)+IF(E27>0,INDEX(linielast,BR28,1)*(E27-H27)/E27)))","v":"-"},{"$f":"IF($BL$44=1,\"-\",S26+T26+U26+$Q$6*C28)","v":"-"},{"$f":"IF($BL$44=1,\"-\",$Q$6*(0.5*I27*INDEX(fladelast,BY28,1)+IF(I27>0,INDEX(linielast,CF28,1)*(I27-L27)/I27)))","v":"-"},null,null,null,null,null,null,null,null,null,null,null,null,null,null,null,null,null,null,null,null,null,null,null,null,null,null,null,null,null,null,null,null,null,null,null,null,null,{"$f":"E26+0.00001","v":6.0000099999999996},{"$f":"H26","v":5},{"$f":"I26+0.00001","v":13.00001},{"$f":"L26","v":2},{"$f":"Makro!A2","v":4},{"$f":"INDEX(fladelast,$BK27,1)+INDEX(fladelast,$BK27,2)","v":5.65},{"$f":"$U$6*$O$6","v":1.1000000000000001},{"$f":"INDEX(fladelast,$BK27,3)","v":2.5},{"$f":"$U$6*INDEX(fladelast,$BK27,4)","v":1.6500000000000001},{"$f":"BO27*INDEX(fladelast,$BK27,5)","v":0.99},{"$f":"INDEX(fladelast,$BK27,6)","v":"B"},{"$f":"Makro!B2","v":3},{"$f":"INDEX(linielast,$BR27,1)+INDEX(linielast,$BR27,2)","v":8},{"$f":"$U$6*$O$6","v":1.1000000000000001},{"$f":"INDEX(linielast,$BR27,3)","v":10},{"$f":"$U$6*INDEX(linielast,$BR27,4)","v":1.6500000000000001},{"$f":"BV27*INDEX(linielast,$BR27,5)","v":0.99},{"$f":"INDEX(linielast,$BR27,6)","v":"D"},{"$f":"Makro!C2","v":4},{"$f":"INDEX(fladelast,$BY27,1)+INDEX(fladelast,$BY27,2)","v":5.65},{"$f":"$U$6*$O$6","v":1.1000000000000001},{"$f":"INDEX(fladelast,$BY27,3)","v":2.5},{"$f":"$U$6*INDEX(fladelast,$BY27,4)","v":1.6500000000000001},{"$f":"CC27*INDEX(fladelast,$BY27,5)","v":0.99},{"$f":"INDEX(fladelast,$BY27,6)","v":"B"},{"$f":"Makro!D2","v":2},{"$f":"INDEX(linielast,$CF27,1)+INDEX(linielast,$CF27,2)","v":12},{"$f":"$U$6*$O$6","v":1.1000000000000001},{"$f":"INDEX(linielast,$CF27,3)","v":6},{"$f":"$U$6*INDEX(linielast,$CF27,4)","v":1.6500000000000001},{"$f":"CJ27*INDEX(linielast,$CF27,5)","v":0.82500000000000007},{"$f":"INDEX(linielast,$CF27,6)","v":"A"},{"$f":"(C27+D27)*$U$6*$O$6","v":18.700000000000003},{"$f":"IF($BQ27=CN$25,0.5*$BG27*$BN27*$BO27,0)+IF(AND($BX27=CN$25,$E26>0),($BG27-$BH27)*$BU27*$BV27/$BG27,0)+IF($CE27=CN$25,0.5*$BI27*$CB27*$CC27,0)+IF(AND($CL27=CN$25,$I26>0),($BI27-$BJ27)*$CI27*$CJ27/$BI27,0)","v":8.3769242485198081},{"$f":"IF($BQ27=CO$25,0.5*$BG27*$BN27*$BO27,0)+IF(AND($BX27=CO$25,$E26>0),($BG27-$BH27)*$BU27*$BV27/$BG27,0)+IF($CE27=CO$25,0.5*$BI27*$CB27*$CC27,0)+IF(AND($CL27=CO$25,$I26>0),($BI27-$BJ27)*$CI27*$CJ27/$BI27,0)","v":39.187541250000002},{"$f":"IF($BQ27=CP$25,0.5*$BG27*$BN27*$BO27,0)+IF(AND($BX27=CP$25,$E26>0),($BG27-$BH27)*$BU27*$BV27/$BG27,0)+IF($CE27=CP$25,0.5*$BI27*$CB27*$CC27,0)+IF(AND($CL27=CP$25,$I26>0),($BI27-$BJ27)*$CI27*$CJ27/$BI27,0)","v":0},{"$f":"IF($BQ27=CQ$25,0.5*$BG27*$BN27*$BO27,0)+IF(AND($BX27=CQ$25,$E26>0),($BG27-$BH27)*$BU27*$BV27/$BG27,0)+IF($CE27=CQ$25,0.5*$BI27*$CB27*$CC27,0)+IF(AND($CL27=CQ$25,$I26>0),($BI27-$BJ27)*$CI27*$CJ27/$BI27,0)","v":2.7500229166284718},{"$f":"IF($BQ27=CR$25,0.5*$BG27*$BN27*$BO27,0)+IF(AND($BX27=CR$25,$E26>0),($BG27-$BH27)*$BU27*$BV27/$BG27,0)+IF($CE27=CR$25,0.5*$BI27*$CB27*$CC27,0)+IF(AND($CL27=CR$25,$I26>0),($BI27-$BJ27)*$CI27*$CJ27/$BI27,0)","v":0},{"$f":"IF($BQ27=CS$25,0.5*$BG27*$BN27*$BO27,0)+IF(AND($BX27=CS$25,$E26>0),($BG27-$BH27)*$BU27*$BV27/$BG27,0)+IF($CE27=CS$25,0.5*$BI27*$CB27*$CC27,0)+IF(AND($CL27=CS$25,$I26>0),($BI27-$BJ27)*$CI27*$CJ27/$BI27,0)","v":0},{"$f":"IF($BQ27=CT$25,0.5*$BG27*$BN27*$BO27,0)+IF(AND($BX27=CT$25,$E26>0),($BG27-$BH27)*$BU27*$BV27/$BG27,0)+IF($CE27=CT$25,0.5*$BI27*$CB27*$CC27,0)+IF(AND($CL27=CT$25,$I26>0),($BI27-$BJ27)*$CI27*$CJ27/$BI27,0)","v":0},{"$f":"IF($BQ27=CU$25,0.5*$BG27*$BN27*$BO27,0)+IF(AND($BX27=CU$25,$E26>0),($BG27-$BH27)*$BU27*$BV27/$BG27,0)+IF($CE27=CU$25,0.5*$BI27*$CB27*$CC27,0)+IF(AND($CL27=CU$25,$I26>0),($BI27-$BJ27)*$CI27*$CJ27/$BI27,0)","v":0},{"$f":"IF($BQ27=CV$25,0.5*$BG27*$BN27*$BP27,0)+IF(AND($BX27=CV$25,$E26>0),($BG27-$BH27)*$BU27*$BW27/$BG27,0)+IF($CE27=CV$25,0.5*$BI27*$CB27*$CD27,0)+IF(AND($CL27=CV$25,$I26>0),($BI27-$BJ27)*$CI27*$CK27/$BI27,0)","v":4.1884621242599041},{"$f":"IF($BQ27=CW$25,0.5*$BG27*$BN27*$BP27,0)+IF(AND($BX27=CW$25,$E26>0),($BG27-$BH27)*$BU27*$BW27/$BG27,0)+IF($CE27=CW$25,0.5*$BI27*$CB27*$CD27,0)+IF(AND($CL27=CW$25,$I26>0),($BI27-$BJ27)*$CI27*$CK27/$BI27,0)","v":23.512524749999997},{"$f":"IF($BQ27=CX$25,0.5*$BG27*$BN27*$BP27,0)+IF(AND($BX27=CX$25,$E26>0),($BG27-$BH27)*$BU27*$BW27/$BG27,0)+IF($CE27=CX$25,0.5*$BI27*$CB27*$CD27,0)+IF(AND($CL27=CX$25,$I26>0),($BI27-$BJ27)*$CI27*$CK27/$BI27,0)","v":0},{"$f":"IF($BQ27=CY$25,0.5*$BG27*$BN27*$BP27,0)+IF(AND($BX27=CY$25,$E26>0),($BG27-$BH27)*$BU27*$BW27/$BG27,0)+IF($CE27=CY$25,0.5*$BI27*$CB27*$CD27,0)+IF(AND($CL27=CY$25,$I26>0),($BI27-$BJ27)*$CI27*$CK27/$BI27,0)","v":1.6500137499770828},{"$f":"IF($BQ27=CZ$25,0.5*$BG27*$BN27*$BP27,0)+IF(AND($BX27=CZ$25,$E26>0),($BG27-$BH27)*$BU27*$BW27/$BG27,0)+IF($CE27=CZ$25,0.5*$BI27*$CB27*$CD27,0)+IF(AND($CL27=CZ$25,$I26>0),($BI27-$BJ27)*$CI27*$CK27/$BI27,0)","v":0},{"$f":"IF($BQ27=DA$25,0.5*$BG27*$BN27*$BP27,0)+IF(AND($BX27=DA$25,$E26>0),($BG27-$BH27)*$BU27*$BW27/$BG27,0)+IF($CE27=DA$25,0.5*$BI27*$CB27*$CD27,0)+IF(AND($CL27=DA$25,$I26>0),($BI27-$BJ27)*$CI27*$CK27/$BI27,0)","v":0},{"$f":"IF($BQ27=DB$25,0.5*$BG27*$BN27*$BP27,0)+IF(AND($BX27=DB$25,$E26>0),($BG27-$BH27)*$BU27*$BW27/$BG27,0)+IF($CE27=DB$25,0.5*$BI27*$CB27*$CD27,0)+IF(AND($CL27=DB$25,$I26>0),($BI27-$BJ27)*$CI27*$CK27/$BI27,0)","v":0},{"$f":"IF($BQ27=DC$25,0.5*$BG27*$BN27*$BP27,0)+IF(AND($BX27=DC$25,$E26>0),($BG27-$BH27)*$BU27*$BW27/$BG27,0)+IF($CE27=DC$25,0.5*$BI27*$CB27*$CD27,0)+IF(AND($CL27=DC$25,$I26>0),($BI27-$BJ27)*$CI27*$CK27/$BI27,0)","v":0},0,0,0,0,0,0,0,0,0,0,0,0,0,0,0,0,{"$f":"IF(DK27>DS27,DK27+SUM(DL27:DR27),DS27+SUM(DD27:DJ27))","v":0}]
[null,"12. sal",12,5,6,{"$f":"INDEX($M$9:$M$18,$BK$29,1)","v":"F5"},"L2",5,13,"F2","L1",2,"-","-","-","-","-","-","-","-","-",null,null,null,null,null,null,null,null,null,null,null,null,null,null,null,null,null,null,null,null,null,null,null,null,null,null,null,null,null,null,null,null,null,null,null,null,null,6.0000099999999996,2,13.00001,2,{"$f":"Makro!A3","v":7},5.65,{"$f":"$U$6*$O$6","v":1.1000000000000001},3.3,1.6500000000000001,1.6500000000000001,{"$f":"INDEX(fladelast,$BK28,6)","v":"G"},{"$f":"Makro!B3","v":2},12,1.1000000000000001,6,1.6500000000000001,0.82500000000000007,"A",{"$f":"Makro!C3","v":2},4.0999999999999996,1.1000000000000001,0.8,1.6500000000000001,0.495,"N",{"$f":"Makro!D3","v":3},8,1.1000000000000001,10,1.6500000000000001,0.99,"D",{"$f":"CM27+0.5*BG27*(BL27*BM27)+IF(E26>0,(BG27-BH27)*(BS27*BT27)/BG27)+0.5*BI27*(BZ27*CA27)+IF(I26>0,(BI27-BJ27)*(CG27*CH27)/BI27)+(C28+D28)*$U$6*$O$6","v":109.07847337022828},6.600005499990834,0,0,13.961540414199682,0,0,16.335027225000001,8.5800066000000008,3.300002749995417,0,0,8.3769242485198081,0,0,16.335027225000001,2.5740019799999998,{"$f":"MAX(DD27+CV27,DL27+CN27)","v":8.3769242485198081},{"$f":"MAX(DE27+CW27,DM27+CO27)","v":39.187541250000002},{"$f":"MAX(DF27+CX27,DN27+CP27)","v":0},{"$f":"MAX(DG27+CY27,DO27+CQ27)","v":2.7500229166284718},{"$f":"MAX(DH27+CZ27,DP27+CR27)","v":0},{"$f":"MAX(DI27+DA27,DQ27+CS27)","v":0},{"$f":"MAX(DJ27+DB27,DR27+CT27)","v":0},{"$f":"IF(DK27+CU27-DS28>SUM(DD28:DJ28)-SUM(DL28:DR28),DK27+CU27,DS28)","v":0},{"$f":"DL27+CV27","v":4.1884621242599041},{"$f":"DM27+CW27","v":23.512524749999997},{"$f":"DN27+CX27","v":0},{"$f":"DO27+CY27","v":1.6500137499770828},{"$f":"DP27+CZ27","v":0},{"$f":"DQ27+DA27","v":0},{"$f":"DR27+DB27","v":0},{"$f":"DS27+DC27","v":0},{"$f":"IF(DK28>DS28,DK28+SUM(DL28:DR28),DS28+SUM(DD28:DJ28))","v":50.314488415148283}]
[null,"11. sal",12,5,6,{"$f":"INDEX($M$9:$M$18,$BK$30,1)","v":"F3"},"L1",2,13,"F2","L2",2,"-","-","-","-","-","-","-","-","-",null,null,null,null,null,null,null,null,null,null,null,null,null,null,null,null,null,null,null,null,null,null,null,null,null,null,null,null,null,null,null,null,null,null,null,null,null,6.0000099999999996,5,13.00001,2,{"$f":"Makro!A4","v":6},8.15,{"$f":"$U$6*$O$6","v":1.1000000000000001},4,1.6500000000000001,0.99,"D",{"$f":"Makro!B4","v":3},8,1.1000000000000001,10,1.6500000000000001,0.99,"D",{"$f":"Makro!C4","v":3},5.15,1.1000000000000001,1.5,1.6500000000000001,0.82500000000000007,"A",{"$f":"Makro!D4","v":2},12,1.1000000000000001,6,1.6500000000000001,0.82500000000000007,"A",191.98468921612255,24.464436623519809,0,0,22.55005591662847,0,0,0,0,12.232218311759905,0,0,13.530033549977082,0,0,0,0,11.676926998515224,39.187541250000002,0,15.611554164176765,0,0,16.335027225000001,2.5740019799999998,7.488464874255321,23.512524749999997,0,10.026937998496891,0,0,16.335027225000001,2.5740019799999998,85.385051617692]
[null,"10. sal",12,5,6,{"$f":"INDEX($M$9:$M$18,$BK$31,1)","v":"F5"},"L2",2,13,"F5","L1",2,"-","-","-","-","-","-","-","-","-",null,null,null,null,null,null,null,null,null,null,null,null,null,null,null,null,null,null,null,null,null,null,null,null,null,null,null,null,null,null,null,null,null,null,null,null,null,6.0000099999999996,2,13.00001,2,{"$f":"Makro!A5","v":4},5.65,1.1000000000000001,2.5,1.6500000000000001,0.99,"B",{"$f":"Makro!B5","v":2},12,1.1000000000000001,6,1.6500000000000001,0.82500000000000007,"A",{"$f":"Makro!C5","v":3},5.15,1.1000000000000001,1.5,1.6500000000000001,0.82500000000000007,"A",{"$f":"Makro!D5","v":3},8,1.1000000000000001,10,1.6500000000000001,0.99,"D",287.03817358635081,22.687517874990832,12.375020624999999,0,13.961540414199682,0,0,0,0,11.343758937495416,7.4250123749999997,0,8.3769242485198081,0,0,0,0,31.95290149777513,39.187541250000002,0,32.576993915125357,0,0,16.335027225000001,2.5740019799999998,19.720683186015226,23.512524749999997,0,23.556971548473975,0,0,16.335027225000001,2.5740019799999998,122.62646586790049]
[null,"9. sal",12,5,6,{"$f":"INDEX($M$9:$M$18,$BK$32,1)","v":"F2"},"L2",2,13,"F3","L2",2,"-","-","-","-","-","-","-","-","-",null,null,null,null,null,null,null,null,null,null,null,null,null,null,null,null,null,null,null,null,null,null,null,null,null,null,null,null,null,null,null,null,null,null,null,null,null,6.0000099999999996,2,13.00001,2,{"$f":"Makro!A6","v":6},8.15,1.1000000000000001,4,1.6500000000000001,0.99,"D",{"$f":"Makro!B6","v":3},8,1.1000000000000001,10,1.6500000000000001,0.99,"D",{"$f":"Makro!C6","v":6},8.15,1.1000000000000001,4,1.6500000000000001,0.99,"D",{"$f":"Makro!D6","v":2},12,1.1000000000000001,6,1.6500000000000001,0.82500000000000007,"A",377.45189520724512,8.3769242485198081,0,0,73.700075166651388,0,0,0,0,4.1884621242599041,0,0,44.220045099990827,0,0,0,0,43.296660435270546,46.612553625000004,0,40.953918163645163,0,0,16.335027225000001,2.5740019799999998,31.064442123510641,30.937537124999999,0,31.933895796993781,0,0,16.335027225000001,2.5740019799999998,149.77216142891572]
[null,"8. sal",12,5,6,{"$f":"INDEX($M$9:$M$18,$BK$33,1)","v":"F6"},"L1",2,13,"F3","L2",2,"-","-","-","-","-","-","-","-","-",null,null,null,null,null,null,null,null,null,null,null,null,null,null,null,null,null,null,null,null,null,null,null,null,null,null,null,null,null,null,null,null,null,null,null,null,null,6.0000099999999996,2,13.00001,2,{"$f":"Makro!A7","v":3},5.15,1.1000000000000001,1.5,1.6500000000000001,0.82500000000000007,"A",{"$f":"Makro!B7","v":3},8,1.1000000000000001,10,1.6500000000000001,0.99,"D",{"$f":"Makro!C7","v":4},5.65,1.1000000000000001,2.5,1.6500000000000001,0.99,"B",{"$f":"Makro!D7","v":3},8,1.1000000000000001,10,1.6500000000000001,0.99,"D",498.35538874415226,7.4250123750000006,26.812520625000001,0,24.96154958085107,0,0,0,0,3.7125061875000003,16.087512374999999,0,14.97692974851064,0,0,0,0,47.485122559530453,46.612553625000004,0,105.63397096364517,0,0,16.335027225000001,2.5740019799999998,35.252904247770545,30.937537124999999,0,76.153940896984608,0,0,16.335027225000001,2.5740019799999998,218.64067635317562]
[null,"7. sal",12,5,6,{"$f":"INDEX($M$9:$M$18,$BK$34,1)","v":"F1"},"L1",2,13,"F5","L1",2,"-","-","-","-","-","-","-","-","-",null,null,null,null,null,null,null,null,null,null,null,null,null,null,null,null,null,null,null,null,null,null,null,null,null,null,null,null,null,null,null,null,null,null,null,null,null,6.0000099999999996,2,13.00001,2,{"$f":"Makro!A8","v":7},5.65,1.1000000000000001,3.3,1.6500000000000001,1.6500000000000001,"G",{"$f":"Makro!B8","v":2},12,1.1000000000000001,6,1.6500000000000001,0.82500000000000007,"A",{"$f":"Makro!C8","v":4},5.65,1.1000000000000001,2.5,1.6500000000000001,0.99,"B",{"$f":"Makro!D8","v":3},8,1.1000000000000001,10,1.6500000000000001,0.99,"D",587.76077458727286,6.600005499990834,26.812520625000001,0,13.961540414199682,0,0,16.335027225000001,0,3.300002749995417,16.087512374999999,0,8.3769242485198081,0,0,16.335027225000001,0,51.19762874703045,62.700066000000007,0,120.61090071215581,0,0,16.335027225000001,2.5740019799999998,38.965410435270542,47.025049499999994,0,91.13087064549525,0,0,16.335027225000001,2.5740019799999998,253.41762466418626]
[null,"6. sal",12,5,6,{"$f":"INDEX($M$9:$M$18,$BK$35,1)","v":"F6"},"L1",2,13,"F4","L1",2,"-","-","-","-","-","-","-","-","-",null,null,null,null,null,null,null,null,null,null,null,null,null,null,null,null,null,null,null,null,null,null,null,null,null,null,null,null,null,null,null,null,null,null,null,null,null,6.0000099999999996,2,13.00001,2,{"$f":"Makro!A9","v":2},4.0999999999999996,1.1000000000000001,0.8,1.6500000000000001,0.495,"N",{"$f":"Makro!B9","v":2},12,1.1000000000000001,6,1.6500000000000001,0.82500000000000007,"A",{"$f":"Makro!C9","v":6},8.15,1.1000000000000001,4,1.6500000000000001,0.99,"D",{"$f":"Makro!D9","v":2},12,1.1000000000000001,6,1.6500000000000001,0.82500000000000007,"A",681.74949895816712,14.976929748510642,0,0,42.900033000000001,0,0,0,3.9600066000000003,7.488464874255321,0,0,25.740019799999999,0,0,0,1.1880019799999999,54.497631497025864,78.78757837500001,0,128.98782496067562,0,0,32.670054450000002,2.5740019799999998,42.265413185265956,63.112561874999997,0,99.507794894015063,0,0,32.670054450000002,2.5740019799999998,297.51709126270146]
[null,"5. sal",12,5,6,{"$f":"INDEX($M$9:$M$18,$BK$36,1)","v":"F6"},"L1",2,13,"F7","L1",2,"-","-","-","-","-","-","-","-","-",null,null,null,null,null,null,null,null,null,null,null,null,null,null,null,null,null,null,null,null,null,null,null,null,null,null,null,null,null,null,null,null,null,null,null,null,null,6.0000099999999996,2,13.00001,2,{"$f":"Makro!A10","v":7},5.65,1.1000000000000001,3.3,1.6500000000000001,1.6500000000000001,"G",{"$f":"Makro!B10","v":2},12,1.1000000000000001,6,1.6500000000000001,0.82500000000000007,"A",{"$f":"Makro!C10","v":5},5.65,1.1000000000000001,7.5,1.6500000000000001,0.99,"D",{"$f":"Makro!D10","v":2},12,1.1000000000000001,6,1.6500000000000001,0.82500000000000007,"A",792.22130599784794,14.976929748510642,0,0,80.437561875,0,0,16.335027225000001,0,7.488464874255321,0,0,48.262537124999994,0,0,16.335027225000001,0,61.986096371281185,78.78757837500001,0,154.72784476067562,0,0,32.670054450000002,3.7620039599999995,49.753878059521277,63.112561874999997,0,125.24781469401506,0,0,32.670054450000002,3.7620039599999995,331.93357791695684]
[null,"4. sal",12,5,6,{"$f":"INDEX($M$9:$M$18,$BK$37,1)","v":"F6"},"L2",2,13,"F2","L1",2,"-",{"$f":"IF($BL$44=1,\"-\",CM37+DT37)","v":"-"},"-","-","-","-","-","-","-",null,null,null,null,null,null,null,null,null,null,null,null,null,null,null,null,null,null,null,null,null,null,null,null,null,null,null,null,null,null,null,null,null,null,null,null,null,6.0000099999999996,2,13.00001,2,{"$f":"Makro!A11","v":7},5.65,1.1000000000000001,3.3,1.6500000000000001,1.6500000000000001,"G",{"$f":"Makro!B11","v":2},12,1.1000000000000001,6,1.6500000000000001,0.82500000000000007,"A",{"$f":"Makro!C11","v":8},5.65,1.1000000000000001,4.8,1.6500000000000001,0.99,"D",{"$f":"Makro!D11","v":2},12,1.1000000000000001,6,1.6500000000000001,0.82500000000000007,"A",889.93310781252876,14.976929748510642,0,0,51.480039600000005,0,0,16.335027225000001,0,7.488464874255321,0,0,30.888023759999999,0,0,16.335027225000001,0,69.474561245536506,78.78757837500001,0,205.68537656901506,0,0,49.005081675,3.7620039599999995,57.242342933776598,63.112561874999997,0,173.51035181901506,0,0,49.005081675,3.7620039599999995,406.71460182455161]
[null,"3. sal",12,5,6,{"$f":"INDEX($M$9:$M$18,$BK$38,1)","v":"F5"},"L1",2,13,"F2","L2",2,"-","-","-","-","-","-","-","-","-",null,null,null,null,null,null,null,null,null,null,null,null,null,null,null,null,null,null,null,null,null,null,null,null,null,null,null,null,null,null,null,null,null,null,null,null,null,6.0000099999999996,2,13.00001,2,{"$f":"Makro!A12","v":7},5.65,1.1000000000000001,3.3,1.6500000000000001,1.6500000000000001,"G",{"$f":"Makro!B12","v":3},8,1.1000000000000001,10,1.6500000000000001,0.99,"D",{"$f":"Makro!C12","v":3},5.15,1.1000000000000001,1.5,1.6500000000000001,0.82500000000000007,"A",{"$f":"Makro!D12","v":2},12,1.1000000000000001,6,1.6500000000000001,0.82500000000000007,"A",987.64490962720959,24.464436623519809,0,0,11.000009166651388,0,0,16.335027225000001,0,12.232218311759905,0,0,6.6000054999908322,0,0,16.335027225000001,0,76.963026119791834,78.78757837500001,0,236.57340032901507,0,0,65.340108900000004,3.7620039599999995,64.730807808031926,63.112561874999997,0,204.39837557901507,0,0,65.340108900000004,3.7620039599999995,461.42611768380698]
[null,"2. sal",12,5,6,{"$f":"INDEX($M$9:$M$18,$BK$39,1)","v":"F5"},"L1",2,13,"F3","L1",2,"-","-","-","-","-","-","-","-","-",null," NB:  Resultaterne skal altid kontrolleres af ansvarlig statiker",null,null,null,null,null,null,null,null,null,null,null,null,null,null,null,null,null,null,null,null,null,null,null,null,null,null,null,null,null,null,null,null,null,null,null,6.0000099999999996,2,13.00001,2,{"$f":"Makro!A13","v":6},8.15,1.1000000000000001,4,1.6500000000000001,0.99,"D",{"$f":"Makro!B13","v":2},12,1.1000000000000001,6,1.6500000000000001,0.82500000000000007,"A",{"$f":"Makro!C13","v":3},5.15,1.1000000000000001,1.5,1.6500000000000001,0.82500000000000007,"A",{"$f":"Makro!D13","v":3},8,1.1000000000000001,10,1.6500000000000001,0.99,"D",1078.8483729141169,22.687517874990832,0,0,33.761573414199681,0,0,0,0,11.343758937495416,0,0,20.256944048519806,0,0,0,0,89.195244431551743,78.78757837500001,0,243.1734058290059,0,0,81.675136125000009,3.7620039599999995,76.963026119791834,63.112561874999997,0,210.9983810790059,0,0,81.675136125000009,3.7620039599999995,496.59336872055769]
[null,"1. sal",12,5,6,{"$f":"INDEX($M$9:$M$18,$BK$40,1)","v":"F4"},"L1",2,13,"F5","L1",2,"-","-","-","-","-","-","-","-","-",null,null,null,null,null,null,null,null,null,null,null,null,null,null,null,null,null,null,null,null,null,null,null,null,null,null,null,null,null,null,null,null,null,null,null,null,null,6.0000099999999996,2,13.00001,2,{"$f":"Makro!A14","v":6},8.15,1.1000000000000001,4,1.6500000000000001,0.99,"D",{"$f":"Makro!B14","v":2},12,1.1000000000000001,6,1.6500000000000001,0.82500000000000007,"A",{"$f":"Makro!C14","v":4},5.65,1.1000000000000001,2.5,1.6500000000000001,0.99,"B",{"$f":"Makro!D14","v":2},12,1.1000000000000001,6,1.6500000000000001,0.82500000000000007,"A",1177.5121082850114,14.976929748510642,26.812520625000001,0,19.800032999999999,0,0,0,0,7.488464874255321,16.087512374999999,0,11.880019799999999,0,0,0,0,100.53900336904715,78.78757837500001,0,263.43034987752571,0,0,81.675136125000009,3.7620039599999995,88.306785057287243,63.112561874999997,0,231.25532512752571,0,0,81.675136125000009,3.7620039599999995,528.19407170657291]
[null,"Stue",12,5,6,{"$f":"INDEX($M$9:$M$18,$BK$41,1)","v":"F3"},"L2",2,13,"F6","L2",2,"-","-","-","-","-","-","-","-","-",null,"Vejledning:",null,null,"Betonelementbyggeriers statik",null,null,null,null,null,null,null,null,null,null,null,null,null,null,null,null,null,null,null,null,null,null,null,null,null,null,null,null,null,null,null,null,6.0000099999999996,2,13.00001,2,{"$f":"Makro!A15","v":5},5.65,1.1000000000000001,7.5,1.6500000000000001,0.99,"D",{"$f":"Makro!B15","v":2},12,1.1000000000000001,6,1.6500000000000001,0.82500000000000007,"A",{"$f":"Makro!C15","v":6},8.15,1.1000000000000001,4,1.6500000000000001,0.99,"D",{"$f":"Makro!D15","v":2},12,1.1000000000000001,6,1.6500000000000001,0.82500000000000007,"A",1283.4739238496925,14.976929748510642,0,0,80.025094875000008,0,0,0,0,7.488464874255321,0,0,48.015056924999996,0,0,0,0,{"$f":"MAX(DD39+CV39,DL39+CN39)","v":108.02746824330248},94.875090750000012,0,275.31036967752573,0,0,81.675136125000009,{"$f":"IF(DK39+CU39-DS40>SUM(DD40:DJ40)-SUM(DL40:DR40),DK39+CU39,DS40)","v":3.7620039599999995},{"$f":"DL39+CV39","v":95.795249931542571},79.20007425,0,243.13534492752569,0,0,81.675136125000009,3.7620039599999995,{"$f":"IF(DK40>DS40,DK40+SUM(DL40:DR40),DS40+SUM(DD40:DJ40))","v":563.65006875582822}]
[null,"Kld.",12,5,null,null,null,null,null,null,null,null,null,{"$f":"IF($BL$44=1,\"-\",CM42+DT42)","v":"-"},null,null,{"$f":"IF($BL$44=1,\"-\",P40+Q40+R40)","v":"-"},null,null,{"$f":"IF(BL44=1,\"-\",S40+T40+U40)","v":"-"},null,null,"Polyteknisk Forlag 2010 eller www.bef.dk",null,null,null,null,null,null,null,null,null,null,null,null,null,null,null,null,null,null,null,null,null,null,null,null,null,null,null,null,null,null,null,null,null,null,null,6.0000099999999996,2,13.00001,2,{"$f":"Makro!A16","v":4},5.65,1.1000000000000001,2.5,1.6500000000000001,0.99,"B",{"$f":"Makro!B16","v":3},8,1.1000000000000001,10,1.6500000000000001,0.99,"D",{"$f":"Makro!C16","v":7},5.65,1.1000000000000001,3.3,1.6500000000000001,1.6500000000000001,"G",{"$f":"Makro!D16","v":3},8,1.1000000000000001,10,1.6500000000000001,0.99,"D",1399.0607394143735,0,12.375020624999999,0,24.96154958085107,0,0,35.392527224999995,0,0,7.4250123749999997,0,14.97692974851064,0,0,35.392527224999995,0,115.51593311755781,94.875090750000012,0,323.32542660252574,0,0,81.675136125000009,{"$f":"IF(DK40+CU40-DS41>SUM(DD41:DJ41)-SUM(DL41:DR41),DK40+CU40,DS41)","v":3.7620039599999995},103.2837148057979,79.20007425,0,291.1504018525257,0,0,81.675136125000009,3.7620039599999995,{"$f":"IF(DK41>DS41,DK41+SUM(DL41:DR41),DS41+SUM(DD41:DJ41))","v":619.15359055508361}]
[null,null,null,null,null,null,null,null,null,null,null,null,null,null,null,null,null,null,null,null,null,null,null,null,null,null,null,null,null,null,null,null,null,null,null,null,null,null,null,null,null,null,null,null,null,null,null,null,null,null,null,null,null,null,null,null,null,null,null,null,null,null,{"$f":"Makro!A17","v":3},null,null,null,null,null,null,null,null,null,null,null,null,null,{"$f":"Makro!C17","v":3},null,null,null,null,null,null,null,null,null,null,null,null,null,{"$f":"CM41+0.5*BG41*(BL41*BM41)+IF(E40>0,(BG41-BH41)*(BS41*BT41)/BG41)+0.5*BI41*(BZ41*CA41)+IF(I40>0,(BI41-BJ41)*(CG41*CH41)/BI41)","v":1471.4161280074939},0,0,0,0,0,0,0,0,0,0,0,0,0,0,0,0,115.51593311755781,102.30010312500001,0,338.30235635103639,0,0,117.06766335,{"$f":"IF(DK41+CU41-DS42>SUM(DD42:DJ42)-SUM(DL42:DR42),DK41+CU41,DS42)","v":3.7620039599999995},103.2837148057979,86.625086624999994,0,306.12733160103636,0,0,117.06766335,3.7620039599999995,{"$f":"IF(DK42>DS42,DK42+SUM(DL42:DR42),DS42+SUM(DD42:DJ42))","v":676.94805990359419}]
[]
[null,null,null,null,null,null,null,null,null,null,null,null,null,null,null,null,null,null,null,null,null,null,null,null,null,null,null,null,null,null,null,null,null,null,null,null,null,null,null,null,null,null,null,null,null,null,null,null,null,null,null,null,null,null,null,null,null,null,"Fejltabel",null,null,null,null,{"$f":"IF(MAX(BL45:BL56)=1,1,0)","v":1},{"$f":"BM45&BM46&BM47&BM48&BM49&BM50&BM51&BM52&BM53&BM54&BM55&BM56","v":"For ny bruger: Klik på knappen 'angiv nyt brugernavn' for ibrugtagning."}]
[null,null,null,null,null,null,null,null,null,null,null,null,null,null,null,null,null,null,null,null,null,null,null,null,null,null,null,null,null,null,null,null,null,null,null,null,null,null,null,null,null,null,null,null,null,null,null,null,null,null,null,null,null,null,null,null,null,null,"Programmet modtager ikke negative inddata !  ",null,null,null,null,{"$f":"IF(MIN(O6,Q6,U6,P10:T18,P21:T22,C27:D41,E26:E40,H26:H40,I26:I40,L26:L40)<0,1,0)","v":0},{"$f":"IF(BL45=0,\"\",BG45)","v":""}]
[null,null,null,null,null,null,null,null,null,null,null,null,null,null,null,null,null,null,null,null,null,null,null,null,null,null,null,null,null,null,null,null,null,null,null,null,null,null,null,null,null,null,null,null,null,null,null,null,null,null,null,null,null,null,null,null,null,null,"Linielast udenfor dækfelt !  ",null,null,null,null,{"$f":"IF(OR(H26>E26,H27>E27,H28>E28,H29>E29,H30>E30,H31>E31,H32>E32,H33>E33,H34>E34,H35>E35,H36>E36,H37>E37,H38>E38,H39>E39,H40>E40,L26>I26,L27>I27,L28>I28,L29>I29,L30>I30,L31>I31,L32>I32,L33>I33,L34>I34,L35>I35,L36>I36,L37>I37,L38>I38,L39>I39,L40>I40),1,0)","v":0},{"$f":"IF(BL46=0,\"\",BG46)","v":""}]
[null,null,null,null,null,null,null,null,null,null,null,null,null,null,null,null,null,null,null,null,null,null,null,null,null,null,null,null,null,null,null,null,null,null,null,null,null,null,null,null,null,null,null,null,null,null,null,null,null,null,null,null,null,null,null,null,null,null,"I kombination med lastkategori E bør lastreduktionsfaktoren for sne ændres",null,null,null,null,{"$f":"IF(AND(BQ9=1,MAX(BR10:BR18)=1),1,0)","v":0},{"$f":"IF(BL47=0,\"\",BG47)","v":""}]
[null,null,null,null,null,null,null,null,null,null,null,null,null,null,null,null,null,null,null,null,null,null,null,null,null,null,null,null,null,null,null,null,null,null,null,null,null,null,null,null,null,null,null,null,null,null,null,null,null,null,null,null,null,null,null,null,null,null,"Partialkoefficient på nyttelast mindst 1 !",null,null,null,null,{"$f":"IF(COUNTIF(S10:S18,\"<\"&1)>0,1,0)","v":0},{"$f":"IF(BL48=0,\"\",BG48)","v":""}]
[null,null,null,null,null,null,null,null,null,null,null,null,null,null,null,null,null,null,null,null,null,null,null,null,null,null,null,null,null,null,null,null,null,null,null,null,null,null,null,null,null,null,null,null,null,null,null,null,null,null,null,null,null,null,null,null,null,null,"Reduktionsfaktor højst 1 !",null,null,null,null,{"$f":"IF(COUNTIF(T10:T18,\">\"&1)>0,1,0)","v":0},{"$f":"IF(BL49=0,\"\",BG49)","v":""}]
[]
[]
[null,null,null,null,null,null,null,null,null,null,null,null,null,null,null,null,null,null,null,null,null,null,null,null,null,null,null,null,null,null,null,null,null,null,null,null,null,null,null,null,null,null,null,null,null,null,null,null,null,null,null,null,null,null,null,null,null,null,"For ny bruger: Klik på knappen 'angiv nyt brugernavn' for ibrugtagning.",null,null,null,null,{"$f":"Makro!E20","v":1},{"$f":"IF(BL52=0,\"\",BG52)","v":"For ny bruger: Klik på knappen 'angiv nyt brugernavn' for ibrugtagning."}]

{"sheet":"Brand","index":1,"n_rows":73,"n_cols":124,"rows_kept":73,"cut":false,"hidden":false,"merged":[[15,13,15,14],[16,13,16,14],[17,13,17,14],[9,13,9,14],[10,13,10,14],[11,13,11,14],[12,13,12,14],[13,13,13,14],[22,4,22,7],[22,12,22,14],[22,18,22,20],[22,2,22,3],[22,8,22,11],[22,15,22,17],[2,10,2,11],[3,10,3,11],[2,3,2,8],[3,3,3,8],[5,15,6,15],[2,12,3,20],[4,12,4,20],[5,12,6,13],[5,14,6,14],[5,20,6,20],[5,17,6,19],[5,16,6,16],[37,22,38,25],[40,22,40,25],[4,10,4,11],[19,13,19,14],[23,115,23,122],[23,91,23,98],[23,99,23,106],[23,107,23,114],[23,83,23,89],[23,69,23,75],[23,76,23,82],[23,58,23,61],[23,62,23,68],[20,13,20,14],[21,13,21,14],[14,13,14,14]]}
[]
[null,"Bruger:",null,{"$f":"Kold!D2","v":0},null,null,null,null,null,null,null,null,{"$f":"Kold!M2","v":"Lastnedføring - 15 etager"},null,null,null,null,null,null,null,{"$f":"Kold!U2","v":"Betonelement-Foreningen feb 2019"}]
[null,"Sagsnavn:",null,{"$f":"Kold!D3","v":"Test projekt"},null,null,null,null,null,"Sag nr.:",{"$f":"Kold!K3","v":"23 - 4545"},null,{"$f":"BM44","v":""}]
[null,"Bygningsdel:",null,{"$f":"Kold!D4","v":"Test bygningsdel"},null,null,null,null,null,"Dato:",{"$f":"Kold!K4","v":"2008-03-01"}]
[null,"Emne:",null,"Branddimensioneringstilstande",null,null,null,null,null,"Init:",{"$f":"Kold!K5","v":"JFJ"}]
[null,null,null,null,null,null,null,null,null,null,null,null," Egenvægt, gg,sup =",null,1,"gg,inf  =",1," Konsekvensklasse:  KFI =",null,null,1]
[]
[null,null,null,null,null,null,null,null,null,null,null,null," Fladelaste  (kN/m2)",null,null,"gk","gfri,k","qk","y1","y2","Kategori",null,null,null,null,null,null,null,null,null,null,null,null,null,null,null,null,null,null,null,null,null,null,null,null,null,null,null,null,null,null,null,null,null,null,null,null,null,"Lastkategorier",null,null,"y0","y1","y2"]
[null,null,null,null,null,null,null,null,null,null,null,null,"F0",null,null,0,0,0,null,null,null,null,null,null,null,null,null,null,null,null,null,null,null,null,null,null,null,null,null,null,null,null,null,null,null,null,null,null,null,null,null,null,null,null,null,null,null,null,"A",null,null,1,2,3]
[null,null,null,null,null,null,null,null,null,null,null,null,{"$f":"BG61","v":"F1"},{"$f":"BH61","v":"Tagflade, sne"},null,{"$f":"BJ61","v":3.1},{"$f":"BK61","v":1},{"$f":"BL61","v":0.8},0.2,0,{"$f":"BO61","v":"N"},null,null,null,null,null,null,null,null,null,null,null,null,null,null,null,null,null,null,null,null,null,null,null,null,null,null,null,null,null,null,null,null,null,null,null,null,null,"B","F1",{"$f":"Kold!BI10","v":8},{"$f":"INDEX(psi,$BI10,BJ$9)","v":0.3},{"$f":"INDEX(psi,$BI10,BK$9)","v":0.2},0]
[null,null,null,null,null,null,null,null,null,null,null,null,{"$f":"BG62","v":"F2"},{"$f":"BH62","v":"Boligarealer"},null,{"$f":"BJ62","v":3.65},{"$f":"BK62","v":1.5},{"$f":"BL62","v":1.5},0.3,0.2,{"$f":"BO62","v":"A"},null,null,null,null,null,null,null,null,null,null,null,null,null,null,null,null,null,null,null,null,null,null,null,null,null,null,null,null,null,null,null,null,null,null,null,null,null,"C","F2",{"$f":"Kold!BI11","v":1},0.5,0.3,0.2]
[null,null,null,null,null,null,null,null,null,null,null,null,"F3",{"$f":"BH63","v":"Kontorer"},null,3.65,2,2.5,0.4,0.2,"B",null,null,null,null,null,null,null,null,null,null,null,null,null,null,null,null,null,null,null,null,null,null,null,null,null,null,null,null,null,null,null,null,null,null,null,null,null,"D","F3",{"$f":"Kold!BI12","v":2},0.6,0.4,0.2]
[null,null,null,null,null,null,null,null,null,null,null,null,"F4",{"$f":"BH64","v":"Kontor med arkiv"},null,3.65,2,7.5,0.6,0.5,"D",null,null,null,null,null,null,null,null,null,null,null,null,null,null,null,null,null,null,null,null,null,null,null,null,null,null,null,null,null,null,null,null,null,null,null,null,null,"E","F4",{"$f":"Kold!BI13","v":4},0.6,0.6,0.5]
[null,null,null,null,null,null,null,null,null,null,null,null,"F5",{"$f":"BH65","v":"Kontorer"},null,4.1500000000000004,4,4,0.6,0.5,"D",null,null,null,null,null,null,null,null,null,null,null,null,null,null,null,null,null,null,null,null,null,null,null,null,null,null,null,null,null,null,null,null,null,null,null,null,null,"F","F5",{"$f":"Kold!BI14","v":4},0.6,0.6,0.5]
[null,null,null,null,null,null,null,null,null,null,null,null,"F6",{"$f":"BH66","v":"Kontorer"},null,3.65,2,3.3,0.4,0.2,"G",null,null,null,null,null,null,null,null,null,null,null,null,null,null,null,null,null,null,null,null,null,null,null,null,null,null,null,null,null,null,null,null,null,null,null,null,null,"G","F6",{"$f":"Kold!BI15","v":7},1,0.4,0.2]
[null,null,null,null,null,null,null,null,null,null,null,null,"F7",{"$f":"BH67","v":"Undervisning"},null,3.65,2,4.8,0.6,0.5,"D",null,null,null,null,null,null,null,null,null,null,null,null,null,null,null,null,null,null,null,null,null,null,null,null,null,null,null,null,null,null,null,null,null,null,null,null,null,"N","F7",{"$f":"Kold!BI16","v":4},{"$f":"INDEX(psi,$BI16,BJ$9)","v":0.6},0.6,0.5]
[null,null,null,null,null,null,null,null,null,null,null,null,"F8",{"$f":"BH68","v":"Værksted"},null,3.65,2,8.3000000000000007,0.6,0.5,"D",null,null,null,null,null,null,null,null,null,null,null,null,null,null,null,null,null,null,null,null,null,null,null,null,null,null,null,null,null,null,null,null,null,null,null,null,null,null,"F8",{"$f":"Kold!BI17","v":4},0.6,0.6,0.5]
[null,null,null,null,null,null,null,null,null,null,null,null,"F9",{"$f":"BH69","v":"Butiksarealer"},null,3.65,2,3.3,0.2,0,"N",null,null,null,null,null,null,null,null,null,null,null,null,null,null,null,null,null,null,null,null,null,null,null,null,null,null,null,null,null,null,null,null,null,null,null,null,null,null,"F9",{"$f":"Kold!BI18","v":8},0.3,0.2,0]
[null,null,null,null,null,null,null,null,null,null,null,null,"Linielaste (kN/m)",null,null,"gk","gfri,k","qk","y1","y2","Kategori"]
[null,null,null,null,null,null,null,null,null,null,null,null,"L0",null,null,0,0,0]
[null,null,null,null,null,null,null,null,null,null,null,null,{"$f":"BG72","v":"L1"},"Badeværelser",null,8,4,6,0.3,0.2,{"$f":"BO72","v":"A"},null,null,null,null,null,null,null,null,null,null,null,null,null,null,null,null,null,null,null,null,null,null,null,null,null,null,null,null,null,null,null,null,null,null,null,null,null,null,"L1",{"$f":"Kold!BI21","v":1},{"$f":"INDEX(psi,$BI21,BJ$9)","v":0.5},0.3,0.2]
[null,null,null,null,null,null,null,null,null,null,null,null,"L2","Komprimator",null,0,8,10,0.6,0.5,{"$f":"BO73","v":"D"},null,null,null,null,null,null,null,null,null,null,null,null,null,null,null,null,null,null,null,null,null,null,null,null,null,null,null,null,null,null,null,null,null,null,null,null,null,null,"L2",{"$f":"Kold!BI22","v":4},0.6,0.6,0.5]
[null,"Etage","Egenvægt i bærelinie",null,"Laste på venstre dækfelt",null,null,null,"Laste på højre dækfelt",null,null,null,"maksimalværdier",null,null,"reducerede værdier",null,null,"minimalværdier"]
[null,null,"gk","gfri,k","Lv","Fladelast","Linielast","sv","Lh","Fladelast","Linielast","sh","nv","no","nh","nv","no","nh","nv","no","nh",null,null,null,null,null,null,null,null,null,null,null,null,null,null,null,null,null,null,null,null,null,null,null,null,null,null,null,null,null,null,null,null,null,null,null,null,null,"Spændvidder",null,null,null,"Fladelaste, venstre dækfelt",null,null,null,null,null,null,"Linielaste, venstre dækfelt",null,null,null,null,null,null,"Fladelaste, højre dækfelt",null,null,null,null,null,null,"Linielaste, højre dækfelt",null,null,null,null,null,null,"Ng","DNmax (q)",null,null,null,null,null,null,null,"DNsædv (q)",null,null,null,null,null,null,null,"Nmax (q)",null,null,null,null,null,null,null,"Nsædv (q)",null,null,null,null,null,null,null,"No (q)"]
[null,null,"(kN/m)","(kN/m)","(m)",null,null,"(m)","(m)",null,null,"(m)","(kN/m)","(kN/m)","(kN/m)","(kN/m)","(kN/m)","(kN/m)","(kN/m)","(kN/m)","(kN/m)",null,null,null,null,null,null,null,null,null,null,null,null,null,null,null,null,null,null,null,null,null,null,null,null,null,null,null,null,null,null,null,null,null,null,null,null,null,"Lv","sv","Lh","sh",null,"gk","gg","qk","yq1","yq2","Kategori",null,"gk","gg","qk","yq1","yq2","Kategori",null,"gk","gg","qk","yq1","yq2","Kategori",null,"gk","gg","qk","yq1","yq2","Kategori",null,"A","B","C","D","E","F","G","N","A","B","C","D","E","F","G","N","A","B","C","D","E","F","G","N","A","B","C","D","E","F","G","N"]
[null,{"$f":"Kold!B26","v":"Tag"},null,null,{"$f":"Kold!E26","v":6},{"$f":"INDEX($BG$60:$BG$69,BK27,1)","v":"F3"},{"$f":"INDEX($BG$71:$BG$73,BR27,1)","v":"L2"},{"$f":"Kold!H26","v":5},{"$f":"Kold!I26","v":13},{"$f":"INDEX($BG$60:$BG$69,BY27,1)","v":"F3"},{"$f":"INDEX($BG$71:$BG$73,CF27,1)","v":"L1"},{"$f":"Kold!L26","v":2},{"$f":"IF(Kold!$BL$44=1,\"-\",0.5*BG27*(BL27*BM27+BN27*BO27)+IF(E26>0,(BG27-BH27)*(BS27*BT27+BU27*BV27)/BG27,0))","v":"-"},{"$f":"IF(Kold!$BL$44=1,\"-\",CM27+DT27)","v":"-"},{"$f":"IF(Kold!$BL$44=1,\"-\",0.5*BI27*(BZ27*CA27+CB27*CC27)+IF(I26>0,(BI27-BJ27)*(CG27*CH27+CI27*CJ27)/BI27))","v":"-"},{"$f":"IF(Kold!$BL$44=1,\"-\",$U$6*$O$6*(0.5*E26*(INDEX(fladelast,BK27,1)+INDEX(fladelast,BK27,2)+INDEX(fladelast,BK27,3)*INDEX(fladelast,BK27,5))+IF(E26>0,(INDEX(linielast,BR27,1)+INDEX(linielast,BR27,2)+INDEX(linielast,BR27,3)*INDEX(linielast,BR27,5))*(E26-H26)/E26,0)))","v":"-"},{"$f":"IF(Kold!$BL$44=1,\"-\",$U$6*$O$6*(C27+D27))","v":"-"},{"$f":"IF(Kold!$BL$44=1,\"-\",$U$6*$O$6*(0.5*I26*(INDEX(fladelast,BY27,1)+INDEX(fladelast,BY27,2)+INDEX(fladelast,BY27,3)*INDEX(fladelast,BY27,5))+IF(I26>0,(INDEX(linielast,CF27,1)+INDEX(linielast,CF27,2)+INDEX(linielast,CF27,3)*INDEX(linielast,CF27,5))*(I26-L26)/I26)))","v":"-"},{"$f":"IF(Kold!$BL$44=1,\"-\",$Q$6*(0.5*E26*INDEX(fladelast,BK27,1)+IF(E26>0,INDEX(linielast,BR27,1)*(E26-H26)/E26)))","v":"-"},{"$f":"IF(Kold!$BL$44=1,\"-\",$Q$6*C27)","v":"-"},{"$f":"IF(Kold!$BL$44=1,\"-\",$Q$6*(0.5*I26*INDEX(fladelast,BY27,1)+IF(I26>0,INDEX(linielast,CF27,1)*(I26-L26)/I26)))","v":"-"}]
[null,{"$f":"Kold!B27","v":"13. sal"},{"$f":"Kold!C27","v":12},{"$f":"Kold!D27","v":5},{"$f":"Kold!E27","v":6},{"$f":"INDEX($BG$60:$BG$69,BK28,1)","v":"F6"},{"$f":"INDEX($BG$71:$BG$73,BR28,1)","v":"L1"},{"$f":"Kold!H27","v":2},{"$f":"Kold!I27","v":13},{"$f":"INDEX($BG$60:$BG$69,BY28,1)","v":"F1"},{"$f":"INDEX($BG$71:$BG$73,CF28,1)","v":"L2"},{"$f":"Kold!L27","v":2},{"$f":"IF(Kold!$BL$44=1,\"-\",0.5*BG28*(BL28*BM28+BN28*BO28)+IF(E27>0,(BG28-BH28)*(BS28*BT28+BU28*BV28)/BG28,0))","v":"-"},{"$f":"IF(Kold!$BL$44=1,\"-\",CM28+DT28)","v":"-"},{"$f":"IF(Kold!$BL$44=1,\"-\",0.5*BI28*(BZ28*CA28+CB28*CC28)+IF(I27>0,(BI28-BJ28)*(CG28*CH28+CI28*CJ28)/BI28))","v":"-"},{"$f":"IF(Kold!$BL$44=1,\"-\",$U$6*$O$6*(0.5*E27*(INDEX(fladelast,BK28,1)+INDEX(fladelast,BK28,2)+INDEX(fladelast,BK28,3)*INDEX(fladelast,BK28,5))+IF(E27>0,(INDEX(linielast,BR28,1)+INDEX(linielast,BR28,2)+INDEX(linielast,BR28,3)*INDEX(linielast,BR28,5))*(E27-H27)/E27,0)))","v":"-"},{"$f":"IF(Kold!$BL$44=1,\"-\",P26+Q26+R26+$U$6*$O$6*(C28+D28))","v":"-"},{"$f":"IF(Kold!$BL$44=1,\"-\",$U$6*$O$6*(0.5*I27*(INDEX(fladelast,BY28,1)+INDEX(fladelast,BY28,2)+INDEX(fladelast,BY28,3)*INDEX(fladelast,BY28,5))+IF(I27>0,(INDEX(linielast,CF28,1)+INDEX(linielast,CF28,2)+INDEX(linielast,CF28,3)*INDEX(linielast,CF28,5))*(I27-L27)/I27)))","v":"-"},{"$f":"IF(Kold!$BL$44=1,\"-\",$Q$6*(0.5*E27*INDEX(fladelast,BK28,1)+IF(E27>0,INDEX(linielast,BR28,1)*(E27-H27)/E27)))","v":"-"},{"$f":"IF(Kold!$BL$44=1,\"-\",S26+T26+U26+$Q$6*C28)","v":"-"},{"$f":"IF(Kold!$BL$44=1,\"-\",$Q$6*(0.5*I27*INDEX(fladelast,BY28,1)+IF(I27>0,INDEX(linielast,CF28,1)*(I27-L27)/I27)))","v":"-"},null,null,null,null,null,null,null,null,null,null,null,null,null,null,null,null,null,null,null,null,null,null,null,null,null,null,null,null,null,null,null,null,null,null,null,null,null,{"$f":"E26+0.00001","v":6.0000099999999996},{"$f":"H26","v":5},{"$f":"I26+0.00001","v":13.00001},{"$f":"L26","v":2},{"$f":"Kold!BK27","v":4},{"$f":"INDEX(fladelast,$BK27,1)+INDEX(fladelast,$BK27,2)","v":5.65},{"$f":"$U$6*$O$6","v":1},{"$f":"INDEX(fladelast,$BK27,3)","v":2.5},{"$f":"$U$6*INDEX(fladelast,$BK27,4)","v":0.4},{"$f":"INDEX(fladelast,$BK27,5)","v":0.2},{"$f":"INDEX(fladelast,$BK27,6)","v":"B"},{"$f":"Kold!BR27","v":3},{"$f":"INDEX(linielast,$BR27,1)+INDEX(linielast,$BR27,2)","v":8},{"$f":"$U$6*$O$6","v":1},{"$f":"INDEX(linielast,$BR27,3)","v":10},{"$f":"$U$6*INDEX(linielast,$BR27,4)","v":0.6},{"$f":"INDEX(linielast,$BR27,5)","v":0.5},{"$f":"INDEX(linielast,$BR27,6)","v":"D"},{"$f":"Kold!BY27","v":4},{"$f":"INDEX(fladelast,$BY27,1)+INDEX(fladelast,$BY27,2)","v":5.65},{"$f":"$U$6*$O$6","v":1},{"$f":"INDEX(fladelast,$BY27,3)","v":2.5},{"$f":"$U$6*INDEX(fladelast,$BY27,4)","v":0.4},{"$f":"INDEX(fladelast,$BY27,5)","v":0.2},{"$f":"INDEX(fladelast,$BY27,6)","v":"B"},{"$f":"Kold!CF27","v":2},{"$f":"INDEX(linielast,$CF27,1)+INDEX(linielast,$CF27,2)","v":12},{"$f":"$U$6*$O$6","v":1},{"$f":"INDEX(linielast,$CF27,3)","v":6},{"$f":"$U$6*INDEX(linielast,$CF27,4)","v":0.3},{"$f":"INDEX(linielast,$CF27,5)","v":0.2},{"$f":"INDEX(linielast,$CF27,6)","v":"A"},{"$f":"(C27+D27)*$U$6*$O$6","v":17},{"$f":"IF($BQ27=CN$25,0.5*$BG27*$BN27*$BO27,0)+IF(AND($BX27=CN$25,$E26>0),($BG27-$BH27)*$BU27*$BV27/$BG27,0)+IF($CE27=CN$25,0.5*$BI27*$CB27*$CC27,0)+IF(AND($CL27=CN$25,$I26>0),($BI27-$BJ27)*$CI27*$CJ27/$BI27,0)","v":1.5230771360945106},9.5000099999999996,0,1.0000083333194441,0,0,0,0,{"$f":"IF($BQ27=CV$25,0.5*$BG27*$BN27*$BP27,0)+IF(AND($BX27=CV$25,$E26>0),($BG27-$BH27)*$BU27*$BW27/$BG27,0)+IF($CE27=CV$25,0.5*$BI27*$CB27*$CD27,0)+IF(AND($CL27=CV$25,$I26>0),($BI27-$BJ27)*$CI27*$CK27/$BI27,0)","v":1.0153847573963404},4.7500049999999998,0,0.83334027776620345,0,0,0,0,0,0,0,0,0,0,0,0,0,0,0,0,0,0,0,0,{"$f":"IF(DK27>DS27,DK27+SUM(DL27:DR27),DS27+SUM(DD27:DJ27))","v":0}]
[null,{"$f":"Kold!B28","v":"12. sal"},{"$f":"Kold!C28","v":12},{"$f":"Kold!D28","v":5},{"$f":"Kold!E28","v":6},"F5","L2",{"$f":"Kold!H28","v":5},{"$f":"Kold!I28","v":13},"F2","L1",{"$f":"Kold!L28","v":2},{"$f":"IF(Kold!$BL$44=1,\"-\",0.5*BG29*(BL29*BM29+BN29*BO29)+IF(E28>0,(BG29-BH29)*(BS29*BT29+BU29*BV29)/BG29,0))","v":"-"},{"$f":"IF(Kold!$BL$44=1,\"-\",CM29+DT29)","v":"-"},{"$f":"IF(Kold!$BL$44=1,\"-\",0.5*BI29*(BZ29*CA29+CB29*CC29)+IF(I28>0,(BI29-BJ29)*(CG29*CH29+CI29*CJ29)/BI29))","v":"-"},{"$f":"IF(Kold!$BL$44=1,\"-\",$U$6*$O$6*(0.5*E28*(INDEX(fladelast,BK29,1)+INDEX(fladelast,BK29,2)+INDEX(fladelast,BK29,3)*INDEX(fladelast,BK29,5))+IF(E28>0,(INDEX(linielast,BR29,1)+INDEX(linielast,BR29,2)+INDEX(linielast,BR29,3)*INDEX(linielast,BR29,5))*(E28-H28)/E28,0)))","v":"-"},{"$f":"IF(Kold!$BL$44=1,\"-\",P27+Q27+R27+$U$6*$O$6*(C29+D29))","v":"-"},{"$f":"IF(Kold!$BL$44=1,\"-\",$U$6*$O$6*(0.5*I28*(INDEX(fladelast,BY29,1)+INDEX(fladelast,BY29,2)+INDEX(fladelast,BY29,3)*INDEX(fladelast,BY29,5))+IF(I28>0,(INDEX(linielast,CF29,1)+INDEX(linielast,CF29,2)+INDEX(linielast,CF29,3)*INDEX(linielast,CF29,5))*(I28-L28)/I28)))","v":"-"},{"$f":"IF(Kold!$BL$44=1,\"-\",$Q$6*(0.5*E28*INDEX(fladelast,BK29,1)+IF(E28>0,INDEX(linielast,BR29,1)*(E28-H28)/E28)))","v":"-"},{"$f":"IF(Kold!$BL$44=1,\"-\",S27+T27+U27+$Q$6*C29)","v":"-"},{"$f":"IF(Kold!$BL$44=1,\"-\",$Q$6*(0.5*I28*INDEX(fladelast,BY29,1)+IF(I28>0,INDEX(linielast,CF29,1)*(I28-L28)/I28)))","v":"-"},null,null,null,null,null,null,null,null,null,null,null,null,null,null,null,null,null,null,null,null,null,null,null,null,null,null,null,null,null,null,null,null,null,null,null,null,null,{"$f":"E27+0.00001","v":6.0000099999999996},{"$f":"H27","v":2},{"$f":"I27+0.00001","v":13.00001},{"$f":"L27","v":2},{"$f":"Kold!BK28","v":7},5.65,{"$f":"$U$6*$O$6","v":1},3.3,0.4,0.2,"G",{"$f":"Kold!BR28","v":2},12,1,6,0.3,0.2,"A",{"$f":"Kold!BY28","v":2},4.0999999999999996,1,0.8,0.2,0,"N",{"$f":"Kold!CF28","v":3},8,1,10,0.6,0.5,"D",{"$f":"CM27+0.5*BG27*(BL27*BM27)+IF(E26>0,(BG27-BH27)*(BS27*BT27)/BG27)+0.5*BI27*(BZ27*CA27)+IF(I26>0,(BI27-BJ27)*(CG27*CH27)/BI27)+(C28+D28)*$U$6*$O$6","v":99.162248518389333},1.2000009999983332,0,0,5.0769237869817028,0,0,3.9600065999999998,1.0400008000000001,0.80000066666555558,0,0,4.2307698224847519,0,0,1.9800032999999999,0,{"$f":"MAX(DD27+CV27,DL27+CN27)","v":1.5230771360945106},9.5000099999999996,0,1.0000083333194441,0,0,0,{"$f":"IF(DK27+CU27-DS28>SUM(DD28:DJ28)-SUM(DL28:DR28),DK27+CU27,DS28)","v":0},{"$f":"DL27+CV27","v":1.0153847573963404},4.7500049999999998,0,0.83334027776620345,0,0,0,0,{"$f":"IF(DK28>DS28,DK28+SUM(DL28:DR28),DS28+SUM(DD28:DJ28))","v":12.023095469413954}]
[null,{"$f":"Kold!B29","v":"11. sal"},{"$f":"Kold!C29","v":12},{"$f":"Kold!D29","v":5},{"$f":"Kold!E29","v":6},"F3","L1",{"$f":"Kold!H29","v":2},{"$f":"Kold!I29","v":13},"F2","L2",{"$f":"Kold!L29","v":2},{"$f":"IF(Kold!$BL$44=1,\"-\",0.5*BG30*(BL30*BM30+BN30*BO30)+IF(E29>0,(BG30-BH30)*(BS30*BT30+BU30*BV30)/BG30,0))","v":"-"},{"$f":"IF(Kold!$BL$44=1,\"-\",CM30+DT30)","v":"-"},{"$f":"IF(Kold!$BL$44=1,\"-\",0.5*BI30*(BZ30*CA30+CB30*CC30)+IF(I29>0,(BI30-BJ30)*(CG30*CH30+CI30*CJ30)/BI30))","v":"-"},{"$f":"IF(Kold!$BL$44=1,\"-\",$U$6*$O$6*(0.5*E29*(INDEX(fladelast,BK30,1)+INDEX(fladelast,BK30,2)+INDEX(fladelast,BK30,3)*INDEX(fladelast,BK30,5))+IF(E29>0,(INDEX(linielast,BR30,1)+INDEX(linielast,BR30,2)+INDEX(linielast,BR30,3)*INDEX(linielast,BR30,5))*(E29-H29)/E29,0)))","v":"-"},{"$f":"IF(Kold!$BL$44=1,\"-\",P28+Q28+R28+$U$6*$O$6*(C30+D30))","v":"-"},{"$f":"IF(Kold!$BL$44=1,\"-\",$U$6*$O$6*(0.5*I29*(INDEX(fladelast,BY30,1)+INDEX(fladelast,BY30,2)+INDEX(fladelast,BY30,3)*INDEX(fladelast,BY30,5))+IF(I29>0,(INDEX(linielast,CF30,1)+INDEX(linielast,CF30,2)+INDEX(linielast,CF30,3)*INDEX(linielast,CF30,5))*(I29-L29)/I29)))","v":"-"},{"$f":"IF(Kold!$BL$44=1,\"-\",$Q$6*(0.5*E29*INDEX(fladelast,BK30,1)+IF(E29>0,INDEX(linielast,BR30,1)*(E29-H29)/E29)))","v":"-"},{"$f":"IF(Kold!$BL$44=1,\"-\",S28+T28+U28+$Q$6*C30)","v":"-"},{"$f":"IF(Kold!$BL$44=1,\"-\",$Q$6*(0.5*I29*INDEX(fladelast,BY30,1)+IF(I29>0,INDEX(linielast,CF30,1)*(I29-L29)/I29)))","v":"-"},null,null,null,null,null,null,null,null,null,null,null,null,null,null,null,null,null,null,null,null,null,null,null,null,null,null,null,null,null,null,null,null,null,null,null,null,null,6.0000099999999996,5,13.00001,2,{"$f":"Kold!BK29","v":6},8.15,1,4,0.6,0.5,"D",{"$f":"Kold!BR29","v":3},8,1,10,0.6,0.5,"D",{"$f":"Kold!BY29","v":3},5.15,1,1.5,0.3,0.2,"A",{"$f":"Kold!CF29","v":2},12,1,6,0.3,0.2,"A",{"$f":"CM28+0.5*BG28*(BL28*BM28)+IF(E27>0,(BG28-BH28)*(BS28*BT28)/BG28)+0.5*BI28*(BZ28*CA28)+IF(I27>0,(BI28-BJ28)*(CG28*CH28)/BI28)+(C29+D29)*$U$6*$O$6","v":174.53153565102048},4.44807938609451,0,0,8.2000203333194435,0,0,0,0,2.9653862573963403,0,0,6.8333502777662032,0,0,0,0,2.323077802760066,9.5000099999999996,0,5.9102640647479063,0,0,3.9600065999999998,0,1.8153854240618958,4.7500049999999998,0,5.0641101002509554,0,0,1.9800032999999999,0,21.69335846750797]
[null,{"$f":"Kold!B30","v":"10. sal"},{"$f":"Kold!C30","v":12},{"$f":"Kold!D30","v":5},{"$f":"Kold!E30","v":6},"F5","L2",{"$f":"Kold!H30","v":2},{"$f":"Kold!I30","v":13},"F5","L1",{"$f":"Kold!L30","v":2},{"$f":"IF(Kold!$BL$44=1,\"-\",0.5*BG31*(BL31*BM31+BN31*BO31)+IF(E30>0,(BG31-BH31)*(BS31*BT31+BU31*BV31)/BG31,0))","v":"-"},{"$f":"IF(Kold!$BL$44=1,\"-\",CM31+DT31)","v":"-"},{"$f":"IF(Kold!$BL$44=1,\"-\",0.5*BI31*(BZ31*CA31+CB31*CC31)+IF(I30>0,(BI31-BJ31)*(CG31*CH31+CI31*CJ31)/BI31))","v":"-"},{"$f":"IF(Kold!$BL$44=1,\"-\",$U$6*$O$6*(0.5*E30*(INDEX(fladelast,BK31,1)+INDEX(fladelast,BK31,2)+INDEX(fladelast,BK31,3)*INDEX(fladelast,BK31,5))+IF(E30>0,(INDEX(linielast,BR31,1)+INDEX(linielast,BR31,2)+INDEX(linielast,BR31,3)*INDEX(linielast,BR31,5))*(E30-H30)/E30,0)))","v":"-"},{"$f":"IF(Kold!$BL$44=1,\"-\",P29+Q29+R29+$U$6*$O$6*(C31+D31))","v":"-"},{"$f":"IF(Kold!$BL$44=1,\"-\",$U$6*$O$6*(0.5*I30*(INDEX(fladelast,BY31,1)+INDEX(fladelast,BY31,2)+INDEX(fladelast,BY31,3)*INDEX(fladelast,BY31,5))+IF(I30>0,(INDEX(linielast,CF31,1)+INDEX(linielast,CF31,2)+INDEX(linielast,CF31,3)*INDEX(linielast,CF31,5))*(I30-L30)/I30)))","v":"-"},{"$f":"IF(Kold!$BL$44=1,\"-\",$Q$6*(0.5*E30*INDEX(fladelast,BK31,1)+IF(E30>0,INDEX(linielast,BR31,1)*(E30-H30)/E30)))","v":"-"},{"$f":"IF(Kold!$BL$44=1,\"-\",S29+T29+U29+$Q$6*C31)","v":"-"},{"$f":"IF(Kold!$BL$44=1,\"-\",$Q$6*(0.5*I30*INDEX(fladelast,BY31,1)+IF(I30>0,INDEX(linielast,CF31,1)*(I30-L30)/I30)))","v":"-"},null,null,null,null,null,null,null,null,null,null,null,null,null,null,null,null,null,null,null,null,null,null,null,null,null,null,null,null,null,null,null,null,null,null,null,null,null,6.0000099999999996,2,13.00001,2,{"$f":"Kold!BK30","v":4},5.65,1,2.5,0.4,0.2,"B",{"$f":"Kold!BR30","v":2},12,1,6,0.3,0.2,"A",{"$f":"Kold!BY30","v":3},5.15,1,1.5,0.3,0.2,"A",{"$f":"Kold!CF30","v":3},8,1,10,0.6,0.5,"D",260.94379416940978,4.1250032499983327,3.0000049999999998,0,5.0769237869817028,0,0,0,0,2.7500021666655554,1.5000024999999999,0,4.2307698224847519,0,0,0,0,6.2634648101564059,9.5000099999999996,0,13.264130433570399,0,0,3.9600065999999998,0,4.7807716814582362,4.7500049999999998,0,11.897460378017158,0,0,1.9800032999999999,0,32.987611843726803]
[null,{"$f":"Kold!B31","v":"9. sal"},{"$f":"Kold!C31","v":12},{"$f":"Kold!D31","v":5},{"$f":"Kold!E31","v":6},"F2","L2",{"$f":"Kold!H31","v":2},{"$f":"Kold!I31","v":13},"F3","L2",{"$f":"Kold!L31","v":2},{"$f":"IF(Kold!$BL$44=1,\"-\",0.5*BG32*(BL32*BM32+BN32*BO32)+IF(E31>0,(BG32-BH32)*(BS32*BT32+BU32*BV32)/BG32,0))","v":"-"},{"$f":"IF(Kold!$BL$44=1,\"-\",CM32+DT32)","v":"-"},{"$f":"IF(Kold!$BL$44=1,\"-\",0.5*BI32*(BZ32*CA32+CB32*CC32)+IF(I31>0,(BI32-BJ32)*(CG32*CH32+CI32*CJ32)/BI32))","v":"-"},{"$f":"IF(Kold!$BL$44=1,\"-\",$U$6*$O$6*(0.5*E31*(INDEX(fladelast,BK32,1)+INDEX(fladelast,BK32,2)+INDEX(fladelast,BK32,3)*INDEX(fladelast,BK32,5))+IF(E31>0,(INDEX(linielast,BR32,1)+INDEX(linielast,BR32,2)+INDEX(linielast,BR32,3)*INDEX(linielast,BR32,5))*(E31-H31)/E31,0)))","v":"-"},{"$f":"IF(Kold!$BL$44=1,\"-\",P30+Q30+R30+$U$6*$O$6*(C32+D32))","v":"-"},{"$f":"IF(Kold!$BL$44=1,\"-\",$U$6*$O$6*(0.5*I31*(INDEX(fladelast,BY32,1)+INDEX(fladelast,BY32,2)+INDEX(fladelast,BY32,3)*INDEX(fladelast,BY32,5))+IF(I31>0,(INDEX(linielast,CF32,1)+INDEX(linielast,CF32,2)+INDEX(linielast,CF32,3)*INDEX(linielast,CF32,5))*(I31-L31)/I31)))","v":"-"},{"$f":"IF(Kold!$BL$44=1,\"-\",$Q$6*(0.5*E31*INDEX(fladelast,BK32,1)+IF(E31>0,INDEX(linielast,BR32,1)*(E31-H31)/E31)))","v":"-"},{"$f":"IF(Kold!$BL$44=1,\"-\",S30+T30+U30+$Q$6*C32)","v":"-"},{"$f":"IF(Kold!$BL$44=1,\"-\",$Q$6*(0.5*I31*INDEX(fladelast,BY32,1)+IF(I31>0,INDEX(linielast,CF32,1)*(I31-L31)/I31)))","v":"-"},null,null,null,null,null,null,null,null,null,null,null,null,null,null,null,null,null,null,null,null,null,null,null,null,null,null,null,null,null,null,null,null,null,null,null,null,null,6.0000099999999996,2,13.00001,2,{"$f":"Kold!BK31","v":6},8.15,1,4,0.6,0.5,"D",{"$f":"Kold!BR31","v":3},8,1,10,0.6,0.5,"D",{"$f":"Kold!BY31","v":6},8.15,1,4,0.6,0.5,"D",{"$f":"Kold!CF31","v":2},12,1,6,0.3,0.2,"A",343.13808655204093,1.5230771360945106,0,0,26.800027333327776,0,0,0,0,1.0153847573963404,0,0,22.333356111106482,0,0,0,0,{"$f":"MAX(DD30+CV30,DL30+CN30)","v":9.0134669768219613},11.0000125,0,17.49490025605515,0,0,3.9600065999999998,{"$f":"IF(DK30+CU30-DS31>SUM(DD31:DJ31)-SUM(DL31:DR31),DK30+CU30,DS31)","v":0},7.5307738481237916,6.2500074999999997,0,16.12823020050191,0,0,1.9800032999999999,0,41.468386332877117]
[null,{"$f":"Kold!B32","v":"8. sal"},{"$f":"Kold!C32","v":12},{"$f":"Kold!D32","v":5},{"$f":"Kold!E32","v":6},"F6","L1",{"$f":"Kold!H32","v":2},{"$f":"Kold!I32","v":13},"F3","L2",{"$f":"Kold!L32","v":2},{"$f":"IF(Kold!$BL$44=1,\"-\",0.5*BG33*(BL33*BM33+BN33*BO33)+IF(E32>0,(BG33-BH33)*(BS33*BT33+BU33*BV33)/BG33,0))","v":"-"},{"$f":"IF(Kold!$BL$44=1,\"-\",CM33+DT33)","v":"-"},{"$f":"IF(Kold!$BL$44=1,\"-\",0.5*BI33*(BZ33*CA33+CB33*CC33)+IF(I32>0,(BI33-BJ33)*(CG33*CH33+CI33*CJ33)/BI33))","v":"-"},{"$f":"IF(Kold!$BL$44=1,\"-\",$U$6*$O$6*(0.5*E32*(INDEX(fladelast,BK33,1)+INDEX(fladelast,BK33,2)+INDEX(fladelast,BK33,3)*INDEX(fladelast,BK33,5))+IF(E32>0,(INDEX(linielast,BR33,1)+INDEX(linielast,BR33,2)+INDEX(linielast,BR33,3)*INDEX(linielast,BR33,5))*(E32-H32)/E32,0)))","v":"-"},{"$f":"IF(Kold!$BL$44=1,\"-\",P31+Q31+R31+$U$6*$O$6*(C33+D33))","v":"-"},{"$f":"IF(Kold!$BL$44=1,\"-\",$U$6*$O$6*(0.5*I32*(INDEX(fladelast,BY33,1)+INDEX(fladelast,BY33,2)+INDEX(fladelast,BY33,3)*INDEX(fladelast,BY33,5))+IF(I32>0,(INDEX(linielast,CF33,1)+INDEX(linielast,CF33,2)+INDEX(linielast,CF33,3)*INDEX(linielast,CF33,5))*(I32-L32)/I32)))","v":"-"},{"$f":"IF(Kold!$BL$44=1,\"-\",$Q$6*(0.5*E32*INDEX(fladelast,BK33,1)+IF(E32>0,INDEX(linielast,BR33,1)*(E32-H32)/E32)))","v":"-"},{"$f":"IF(Kold!$BL$44=1,\"-\",S31+T31+U31+$Q$6*C33)","v":"-"},{"$f":"IF(Kold!$BL$44=1,\"-\",$Q$6*(0.5*I32*INDEX(fladelast,BY33,1)+IF(I32>0,INDEX(linielast,CF33,1)*(I32-L32)/I32)))","v":"-"},null,null,null,null,null,null,null,null,null,null,null,null,null,null,null,null,null,null,null,null,null,null,null,null,null,null,null,null,null,null,null,null,null,null,null,null,null,6.0000099999999996,2,13.00001,2,{"$f":"Kold!BK32","v":3},5.15,1,1.5,0.3,0.2,"A",{"$f":"Kold!BR32","v":3},8,1,10,0.6,0.5,"D",{"$f":"Kold!BY32","v":4},5.65,1,2.5,0.4,0.2,"B",{"$f":"Kold!CF32","v":3},8,1,10,0.6,0.5,"D",453.05035340377469,{"$f":"IF($BQ32=CN$25,0.5*$BG32*$BN32*$BO32,0)+IF(AND($BX32=CN$25,$E31>0),($BG32-$BH32)*$BU32*$BV32/$BG32,0)+IF($CE32=CN$25,0.5*$BI32*$CB32*$CC32,0)+IF(AND($CL32=CN$25,$I31>0),($BI32-$BJ32)*$CI32*$CJ32/$BI32,0)","v":1.35000225},{"$f":"IF($BQ32=CO$25,0.5*$BG32*$BN32*$BO32,0)+IF(AND($BX32=CO$25,$E31>0),($BG32-$BH32)*$BU32*$BV32/$BG32,0)+IF($CE32=CO$25,0.5*$BI32*$CB32*$CC32,0)+IF(AND($CL32=CO$25,$I31>0),($BI32-$BJ32)*$CI32*$CJ32/$BI32,0)","v":6.5000050000000007},{"$f":"IF($BQ32=CP$25,0.5*$BG32*$BN32*$BO32,0)+IF(AND($BX32=CP$25,$E31>0),($BG32-$BH32)*$BU32*$BV32/$BG32,0)+IF($CE32=CP$25,0.5*$BI32*$CB32*$CC32,0)+IF(AND($CL32=CP$25,$I31>0),($BI32-$BJ32)*$CI32*$CJ32/$BI32,0)","v":0},{"$f":"IF($BQ32=CQ$25,0.5*$BG32*$BN32*$BO32,0)+IF(AND($BX32=CQ$25,$E31>0),($BG32-$BH32)*$BU32*$BV32/$BG32,0)+IF($CE32=CQ$25,0.5*$BI32*$CB32*$CC32,0)+IF(AND($CL32=CQ$25,$I31>0),($BI32-$BJ32)*$CI32*$CJ32/$BI32,0)","v":9.076927120309481},{"$f":"IF($BQ32=CR$25,0.5*$BG32*$BN32*$BO32,0)+IF(AND($BX32=CR$25,$E31>0),($BG32-$BH32)*$BU32*$BV32/$BG32,0)+IF($CE32=CR$25,0.5*$BI32*$CB32*$CC32,0)+IF(AND($CL32=CR$25,$I31>0),($BI32-$BJ32)*$CI32*$CJ32/$BI32,0)","v":0},{"$f":"IF($BQ32=CS$25,0.5*$BG32*$BN32*$BO32,0)+IF(AND($BX32=CS$25,$E31>0),($BG32-$BH32)*$BU32*$BV32/$BG32,0)+IF($CE32=CS$25,0.5*$BI32*$CB32*$CC32,0)+IF(AND($CL32=CS$25,$I31>0),($BI32-$BJ32)*$CI32*$CJ32/$BI32,0)","v":0},{"$f":"IF($BQ32=CT$25,0.5*$BG32*$BN32*$BO32,0)+IF(AND($BX32=CT$25,$E31>0),($BG32-$BH32)*$BU32*$BV32/$BG32,0)+IF($CE32=CT$25,0.5*$BI32*$CB32*$CC32,0)+IF(AND($CL32=CT$25,$I31>0),($BI32-$BJ32)*$CI32*$CJ32/$BI32,0)","v":0},{"$f":"IF($BQ32=CU$25,0.5*$BG32*$BN32*$BO32,0)+IF(AND($BX32=CU$25,$E31>0),($BG32-$BH32)*$BU32*$BV32/$BG32,0)+IF($CE32=CU$25,0.5*$BI32*$CB32*$CC32,0)+IF(AND($CL32=CU$25,$I31>0),($BI32-$BJ32)*$CI32*$CJ32/$BI32,0)","v":0},{"$f":"IF($BQ32=CV$25,0.5*$BG32*$BN32*$BP32,0)+IF(AND($BX32=CV$25,$E31>0),($BG32-$BH32)*$BU32*$BW32/$BG32,0)+IF($CE32=CV$25,0.5*$BI32*$CB32*$CD32,0)+IF(AND($CL32=CV$25,$I31>0),($BI32-$BJ32)*$CI32*$CK32/$BI32,0)","v":0.90000150000000001},{"$f":"IF($BQ32=CW$25,0.5*$BG32*$BN32*$BP32,0)+IF(AND($BX32=CW$25,$E31>0),($BG32-$BH32)*$BU32*$BW32/$BG32,0)+IF($CE32=CW$25,0.5*$BI32*$CB32*$CD32,0)+IF(AND($CL32=CW$25,$I31>0),($BI32-$BJ32)*$CI32*$CK32/$BI32,0)","v":3.2500025000000003},{"$f":"IF($BQ32=CX$25,0.5*$BG32*$BN32*$BP32,0)+IF(AND($BX32=CX$25,$E31>0),($BG32-$BH32)*$BU32*$BW32/$BG32,0)+IF($CE32=CX$25,0.5*$BI32*$CB32*$CD32,0)+IF(AND($CL32=CX$25,$I31>0),($BI32-$BJ32)*$CI32*$CK32/$BI32,0)","v":0},{"$f":"IF($BQ32=CY$25,0.5*$BG32*$BN32*$BP32,0)+IF(AND($BX32=CY$25,$E31>0),($BG32-$BH32)*$BU32*$BW32/$BG32,0)+IF($CE32=CY$25,0.5*$BI32*$CB32*$CD32,0)+IF(AND($CL32=CY$25,$I31>0),($BI32-$BJ32)*$CI32*$CK32/$BI32,0)","v":7.5641059335912333},{"$f":"IF($BQ32=CZ$25,0.5*$BG32*$BN32*$BP32,0)+IF(AND($BX32=CZ$25,$E31>0),($BG32-$BH32)*$BU32*$BW32/$BG32,0)+IF($CE32=CZ$25,0.5*$BI32*$CB32*$CD32,0)+IF(AND($CL32=CZ$25,$I31>0),($BI32-$BJ32)*$CI32*$CK32/$BI32,0)","v":0},{"$f":"IF($BQ32=DA$25,0.5*$BG32*$BN32*$BP32,0)+IF(AND($BX32=DA$25,$E31>0),($BG32-$BH32)*$BU32*$BW32/$BG32,0)+IF($CE32=DA$25,0.5*$BI32*$CB32*$CD32,0)+IF(AND($CL32=DA$25,$I31>0),($BI32-$BJ32)*$CI32*$CK32/$BI32,0)","v":0},{"$f":"IF($BQ32=DB$25,0.5*$BG32*$BN32*$BP32,0)+IF(AND($BX32=DB$25,$E31>0),($BG32-$BH32)*$BU32*$BW32/$BG32,0)+IF($CE32=DB$25,0.5*$BI32*$CB32*$CD32,0)+IF(AND($CL32=DB$25,$I31>0),($BI32-$BJ32)*$CI32*$CK32/$BI32,0)","v":0},{"$f":"IF($BQ32=DC$25,0.5*$BG32*$BN32*$BP32,0)+IF(AND($BX32=DC$25,$E31>0),($BG32-$BH32)*$BU32*$BW32/$BG32,0)+IF($CE32=DC$25,0.5*$BI32*$CB32*$CD32,0)+IF(AND($CL32=DC$25,$I31>0),($BI32-$BJ32)*$CI32*$CK32/$BI32,0)","v":0},{"$f":"MAX(DD31+CV31,DL31+CN31)","v":10.028851734218302},{"$f":"MAX(DE31+CW31,DM31+CO31)","v":11.0000125},{"$f":"MAX(DF31+CX31,DN31+CP31)","v":0},{"$f":"MAX(DG31+CY31,DO31+CQ31)","v":42.928257533829687},{"$f":"MAX(DH31+CZ31,DP31+CR31)","v":0},{"$f":"MAX(DI31+DA31,DQ31+CS31)","v":0},{"$f":"MAX(DJ31+DB31,DR31+CT31)","v":3.9600065999999998},{"$f":"IF(DK31+CU31-DS32>SUM(DD32:DJ32)-SUM(DL32:DR32),DK31+CU31,DS32)","v":0},{"$f":"DL31+CV31","v":8.546158605520132},{"$f":"DM31+CW31","v":6.2500074999999997},{"$f":"DN31+CX31","v":0},{"$f":"DO31+CY31","v":38.461586311608393},{"$f":"DP31+CZ31","v":0},{"$f":"DQ31+DA31","v":0},{"$f":"DR31+DB31","v":1.9800032999999999},{"$f":"DS31+DC31","v":0},67.917128368047997]
[null,{"$f":"Kold!B33","v":"7. sal"},{"$f":"Kold!C33","v":12},{"$f":"Kold!D33","v":5},{"$f":"Kold!E33","v":6},"F1","L1",{"$f":"Kold!H33","v":2},{"$f":"Kold!I33","v":13},"F5","L1",{"$f":"Kold!L33","v":2},{"$f":"IF(Kold!$BL$44=1,\"-\",0.5*BG34*(BL34*BM34+BN34*BO34)+IF(E33>0,(BG34-BH34)*(BS34*BT34+BU34*BV34)/BG34,0))","v":"-"},{"$f":"IF(Kold!$BL$44=1,\"-\",CM34+DT34)","v":"-"},{"$f":"IF(Kold!$BL$44=1,\"-\",0.5*BI34*(BZ34*CA34+CB34*CC34)+IF(I33>0,(BI34-BJ34)*(CG34*CH34+CI34*CJ34)/BI34))","v":"-"},{"$f":"IF(Kold!$BL$44=1,\"-\",$U$6*$O$6*(0.5*E33*(INDEX(fladelast,BK34,1)+INDEX(fladelast,BK34,2)+INDEX(fladelast,BK34,3)*INDEX(fladelast,BK34,5))+IF(E33>0,(INDEX(linielast,BR34,1)+INDEX(linielast,BR34,2)+INDEX(linielast,BR34,3)*INDEX(linielast,BR34,5))*(E33-H33)/E33,0)))","v":"-"},{"$f":"IF(Kold!$BL$44=1,\"-\",P32+Q32+R32+$U$6*$O$6*(C34+D34))","v":"-"},{"$f":"IF(Kold!$BL$44=1,\"-\",$U$6*$O$6*(0.5*I33*(INDEX(fladelast,BY34,1)+INDEX(fladelast,BY34,2)+INDEX(fladelast,BY34,3)*INDEX(fladelast,BY34,5))+IF(I33>0,(INDEX(linielast,CF34,1)+INDEX(linielast,CF34,2)+INDEX(linielast,CF34,3)*INDEX(linielast,CF34,5))*(I33-L33)/I33)))","v":"-"},{"$f":"IF(Kold!$BL$44=1,\"-\",$Q$6*(0.5*E33*INDEX(fladelast,BK34,1)+IF(E33>0,INDEX(linielast,BR34,1)*(E33-H33)/E33)))","v":"-"},{"$f":"IF(Kold!$BL$44=1,\"-\",S32+T32+U32+$Q$6*C34)","v":"-"},{"$f":"IF(Kold!$BL$44=1,\"-\",$Q$6*(0.5*I33*INDEX(fladelast,BY34,1)+IF(I33>0,INDEX(linielast,CF34,1)*(I33-L33)/I33)))","v":"-"},null,null,null,null,null,null,null,null,null,null,null,null,null,null,null,null,null,null,null,null,null,null,null,null,null,null,null,null,null,null,null,null,null,null,null,null,null,6.0000099999999996,2,13.00001,2,{"$f":"Kold!BK33","v":7},5.65,1,3.3,0.4,0.2,"G",{"$f":"Kold!BR33","v":2},12,1,6,0.3,0.2,"A",{"$f":"Kold!BY33","v":4},5.65,1,2.5,0.4,0.2,"B",{"$f":"Kold!CF33","v":3},8,1,10,0.6,0.5,"D",534.32797689752067,1.2000009999983332,6.5000050000000007,0,5.0769237869817028,0,0,3.9600065999999998,0,0.80000066666555558,3.2500025000000003,0,4.2307698224847519,0,0,1.9800032999999999,0,10.928853234218302,14.250015000000001,0,50.492363467420923,0,0,3.9600065999999998,0,9.4461601055201321,9.5000099999999996,0,46.025692245199629,0,0,1.9800032999999999,0,79.631238301639229]
[null,{"$f":"Kold!B34","v":"6. sal"},{"$f":"Kold!C34","v":12},{"$f":"Kold!D34","v":5},{"$f":"Kold!E34","v":6},"F6","L1",{"$f":"Kold!H34","v":2},{"$f":"Kold!I34","v":13},"F4","L1",{"$f":"Kold!L34","v":2},{"$f":"IF(Kold!$BL$44=1,\"-\",0.5*BG35*(BL35*BM35+BN35*BO35)+IF(E34>0,(BG35-BH35)*(BS35*BT35+BU35*BV35)/BG35,0))","v":"-"},{"$f":"IF(Kold!$BL$44=1,\"-\",CM35+DT35)","v":"-"},{"$f":"IF(Kold!$BL$44=1,\"-\",0.5*BI35*(BZ35*CA35+CB35*CC35)+IF(I34>0,(BI35-BJ35)*(CG35*CH35+CI35*CJ35)/BI35))","v":"-"},{"$f":"IF(Kold!$BL$44=1,\"-\",$U$6*$O$6*(0.5*E34*(INDEX(fladelast,BK35,1)+INDEX(fladelast,BK35,2)+INDEX(fladelast,BK35,3)*INDEX(fladelast,BK35,5))+IF(E34>0,(INDEX(linielast,BR35,1)+INDEX(linielast,BR35,2)+INDEX(linielast,BR35,3)*INDEX(linielast,BR35,5))*(E34-H34)/E34,0)))","v":"-"},{"$f":"IF(Kold!$BL$44=1,\"-\",P33+Q33+R33+$U$6*$O$6*(C35+D35))","v":"-"},{"$f":"IF(Kold!$BL$44=1,\"-\",$U$6*$O$6*(0.5*I34*(INDEX(fladelast,BY35,1)+INDEX(fladelast,BY35,2)+INDEX(fladelast,BY35,3)*INDEX(fladelast,BY35,5))+IF(I34>0,(INDEX(linielast,CF35,1)+INDEX(linielast,CF35,2)+INDEX(linielast,CF35,3)*INDEX(linielast,CF35,5))*(I34-L34)/I34)))","v":"-"},{"$f":"IF(Kold!$BL$44=1,\"-\",$Q$6*(0.5*E34*INDEX(fladelast,BK35,1)+IF(E34>0,INDEX(linielast,BR35,1)*(E34-H34)/E34)))","v":"-"},{"$f":"IF(Kold!$BL$44=1,\"-\",S33+T33+U33+$Q$6*C35)","v":"-"},{"$f":"IF(Kold!$BL$44=1,\"-\",$Q$6*(0.5*I34*INDEX(fladelast,BY35,1)+IF(I34>0,INDEX(linielast,CF35,1)*(I34-L34)/I34)))","v":"-"},null,null,null,null,null,null,null,null,null,null,null,null,null,null,null,null,null,null,null,null,null,null,null,null,null,null,null,null,null,null,null,null,null,null,null,null,null,6.0000099999999996,2,13.00001,2,{"$f":"Kold!BK34","v":2},4.0999999999999996,1,0.8,0.2,0,"N",{"$f":"Kold!BR34","v":2},12,1,6,0.3,0.2,"A",{"$f":"Kold!BY34","v":6},8.15,1,4,0.6,0.5,"D",{"$f":"Kold!CF34","v":2},12,1,6,0.3,0.2,"A",619.77227178015175,2.7230781360928438,0,0,15.600012,0,0,0,0.48000080000000001,1.8153854240618958,0,0,13.00001,0,0,0,0,11.728853900883857,17.500017500000002,0,54.723133289905675,0,0,5.9400098999999997,0,10.246160772185688,12.7500125,0,50.256462067684382,0,0,3.9600065999999998,0,89.892014590789529]
[null,{"$f":"Kold!B35","v":"5. sal"},{"$f":"Kold!C35","v":12},{"$f":"Kold!D35","v":5},{"$f":"Kold!E35","v":6},"F6","L1",{"$f":"Kold!H35","v":2},{"$f":"Kold!I35","v":13},"F7","L1",{"$f":"Kold!L35","v":2},{"$f":"IF(Kold!$BL$44=1,\"-\",0.5*BG36*(BL36*BM36+BN36*BO36)+IF(E35>0,(BG36-BH36)*(BS36*BT36+BU36*BV36)/BG36,0))","v":"-"},{"$f":"IF(Kold!$BL$44=1,\"-\",CM36+DT36)","v":"-"},{"$f":"IF(Kold!$BL$44=1,\"-\",0.5*BI36*(BZ36*CA36+CB36*CC36)+IF(I35>0,(BI36-BJ36)*(CG36*CH36+CI36*CJ36)/BI36))","v":"-"},{"$f":"IF(Kold!$BL$44=1,\"-\",$U$6*$O$6*(0.5*E35*(INDEX(fladelast,BK36,1)+INDEX(fladelast,BK36,2)+INDEX(fladelast,BK36,3)*INDEX(fladelast,BK36,5))+IF(E35>0,(INDEX(linielast,BR36,1)+INDEX(linielast,BR36,2)+INDEX(linielast,BR36,3)*INDEX(linielast,BR36,5))*(E35-H35)/E35,0)))","v":"-"},{"$f":"IF(Kold!$BL$44=1,\"-\",P34+Q34+R34+$U$6*$O$6*(C36+D36))","v":"-"},{"$f":"IF(Kold!$BL$44=1,\"-\",$U$6*$O$6*(0.5*I35*(INDEX(fladelast,BY36,1)+INDEX(fladelast,BY36,2)+INDEX(fladelast,BY36,3)*INDEX(fladelast,BY36,5))+IF(I35>0,(INDEX(linielast,CF36,1)+INDEX(linielast,CF36,2)+INDEX(linielast,CF36,3)*INDEX(linielast,CF36,5))*(I35-L35)/I35)))","v":"-"},{"$f":"IF(Kold!$BL$44=1,\"-\",$Q$6*(0.5*E35*INDEX(fladelast,BK36,1)+IF(E35>0,INDEX(linielast,BR36,1)*(E35-H35)/E35)))","v":"-"},{"$f":"IF(Kold!$BL$44=1,\"-\",S34+T34+U34+$Q$6*C36)","v":"-"},{"$f":"IF(Kold!$BL$44=1,\"-\",$Q$6*(0.5*I35*INDEX(fladelast,BY36,1)+IF(I35>0,INDEX(linielast,CF36,1)*(I35-L35)/I35)))","v":"-"},null,null,null,null,null,null,null,null,null,null,null,null,null,null,null,null,null,null,null,null,null,null,null,null,null,null,null,null,null,null,null,null,null,null,null,null,null,6.0000099999999996,2,13.00001,2,{"$f":"Kold!BK35","v":7},5.65,1,3.3,0.4,0.2,"G",{"$f":"Kold!BR35","v":2},12,1,6,0.3,0.2,"A",{"$f":"Kold!BY35","v":5},5.65,1,7.5,0.6,0.5,"D",{"$f":"Kold!CF35","v":2},12,1,6,0.3,0.2,"A",720.20118727077056,2.7230781360928438,0,0,29.250022499999996,0,0,3.9600065999999998,0,1.8153854240618958,0,0,24.375018749999999,0,0,1.9800032999999999,0,13.544239324945753,17.500017500000002,0,67.723143289905678,0,0,5.9400098999999997,0,12.061546196247583,12.7500125,0,63.256472067684385,0,0,3.9600065999999998,0,104.70741001485143]
[null,{"$f":"Kold!B36","v":"4. sal"},{"$f":"Kold!C36","v":12},{"$f":"Kold!D36","v":5},{"$f":"Kold!E36","v":6},"F6","L2",{"$f":"Kold!H36","v":2},{"$f":"Kold!I36","v":13},"F2","L1",{"$f":"Kold!L36","v":2},{"$f":"IF(Kold!$BL$44=1,\"-\",0.5*BG37*(BL37*BM37+BN37*BO37)+IF(E36>0,(BG37-BH37)*(BS37*BT37+BU37*BV37)/BG37,0))","v":"-"},{"$f":"IF(Kold!$BL$44=1,\"-\",CM37+DT37)","v":"-"},{"$f":"IF(Kold!$BL$44=1,\"-\",0.5*BI37*(BZ37*CA37+CB37*CC37)+IF(I36>0,(BI37-BJ37)*(CG37*CH37+CI37*CJ37)/BI37))","v":"-"},{"$f":"IF(Kold!$BL$44=1,\"-\",$U$6*$O$6*(0.5*E36*(INDEX(fladelast,BK37,1)+INDEX(fladelast,BK37,2)+INDEX(fladelast,BK37,3)*INDEX(fladelast,BK37,5))+IF(E36>0,(INDEX(linielast,BR37,1)+INDEX(linielast,BR37,2)+INDEX(linielast,BR37,3)*INDEX(linielast,BR37,5))*(E36-H36)/E36,0)))","v":"-"},{"$f":"IF(Kold!$BL$44=1,\"-\",P35+Q35+R35+$U$6*$O$6*(C37+D37))","v":"-"},{"$f":"IF(Kold!$BL$44=1,\"-\",$U$6*$O$6*(0.5*I36*(INDEX(fladelast,BY37,1)+INDEX(fladelast,BY37,2)+INDEX(fladelast,BY37,3)*INDEX(fladelast,BY37,5))+IF(I36>0,(INDEX(linielast,CF37,1)+INDEX(linielast,CF37,2)+INDEX(linielast,CF37,3)*INDEX(linielast,CF37,5))*(I36-L36)/I36)))","v":"-"},{"$f":"IF(Kold!$BL$44=1,\"-\",$Q$6*(0.5*E36*INDEX(fladelast,BK37,1)+IF(E36>0,INDEX(linielast,BR37,1)*(E36-H36)/E36)))","v":"-"},{"$f":"IF(Kold!$BL$44=1,\"-\",S35+T35+U35+$Q$6*C37)","v":"-"},{"$f":"IF(Kold!$BL$44=1,\"-\",$Q$6*(0.5*I36*INDEX(fladelast,BY37,1)+IF(I36>0,INDEX(linielast,CF37,1)*(I36-L36)/I36)))","v":"-"},null,null,null,null,null,null,null,null,null,null,null,null,null,null,null,null,null,null,null,null,null,null,null,null,null,null,null,null,null,null,null,null,null,null,null,null,null,6.0000099999999996,2,13.00001,2,{"$f":"Kold!BK36","v":7},5.65,1,3.3,0.4,0.2,"G",{"$f":"Kold!BR36","v":2},12,1,6,0.3,0.2,"A",{"$f":"Kold!BY36","v":8},5.65,1,4.8,0.6,0.5,"D",{"$f":"Kold!CF36","v":2},12,1,6,0.3,0.2,"A",809.03009801138944,2.7230781360928438,0,0,18.7200144,0,0,3.9600065999999998,0,1.8153854240618958,0,0,15.600012,0,0,1.9800032999999999,0,15.359624749007649,17.500017500000002,0,92.506494567684385,0,0,7.9200131999999996,0,13.876931620309479,12.7500125,0,87.63149081768438,0,0,5.9400098999999997,0,133.28615001669203]
[null,{"$f":"Kold!B37","v":"3. sal"},{"$f":"Kold!C37","v":12},{"$f":"Kold!D37","v":5},{"$f":"Kold!E37","v":6},"F5","L1",{"$f":"Kold!H37","v":2},{"$f":"Kold!I37","v":13},"F2","L2",{"$f":"Kold!L37","v":2},{"$f":"IF(Kold!$BL$44=1,\"-\",0.5*BG38*(BL38*BM38+BN38*BO38)+IF(E37>0,(BG38-BH38)*(BS38*BT38+BU38*BV38)/BG38,0))","v":"-"},{"$f":"IF(Kold!$BL$44=1,\"-\",CM38+DT38)","v":"-"},{"$f":"IF(Kold!$BL$44=1,\"-\",0.5*BI38*(BZ38*CA38+CB38*CC38)+IF(I37>0,(BI38-BJ38)*(CG38*CH38+CI38*CJ38)/BI38))","v":"-"},{"$f":"IF(Kold!$BL$44=1,\"-\",$U$6*$O$6*(0.5*E37*(INDEX(fladelast,BK38,1)+INDEX(fladelast,BK38,2)+INDEX(fladelast,BK38,3)*INDEX(fladelast,BK38,5))+IF(E37>0,(INDEX(linielast,BR38,1)+INDEX(linielast,BR38,2)+INDEX(linielast,BR38,3)*INDEX(linielast,BR38,5))*(E37-H37)/E37,0)))","v":"-"},{"$f":"IF(Kold!$BL$44=1,\"-\",P36+Q36+R36+$U$6*$O$6*(C38+D38))","v":"-"},{"$f":"IF(Kold!$BL$44=1,\"-\",$U$6*$O$6*(0.5*I37*(INDEX(fladelast,BY38,1)+INDEX(fladelast,BY38,2)+INDEX(fladelast,BY38,3)*INDEX(fladelast,BY38,5))+IF(I37>0,(INDEX(linielast,CF38,1)+INDEX(linielast,CF38,2)+INDEX(linielast,CF38,3)*INDEX(linielast,CF38,5))*(I37-L37)/I37)))","v":"-"},{"$f":"IF(Kold!$BL$44=1,\"-\",$Q$6*(0.5*E37*INDEX(fladelast,BK38,1)+IF(E37>0,INDEX(linielast,BR38,1)*(E37-H37)/E37)))","v":"-"},{"$f":"IF(Kold!$BL$44=1,\"-\",S36+T36+U36+$Q$6*C38)","v":"-"},{"$f":"IF(Kold!$BL$44=1,\"-\",$Q$6*(0.5*I37*INDEX(fladelast,BY38,1)+IF(I37>0,INDEX(linielast,CF38,1)*(I37-L37)/I37)))","v":"-"},null,null,null,null,null,null,null,null,null,null,null,null,null,null,null,null,null,null,null,null,null,null,null,null,null,null,null,null,null,null,null,null,null,null,null,null,null,6.0000099999999996,2,13.00001,2,{"$f":"Kold!BK37","v":7},5.65,1,3.3,0.4,0.2,"G",{"$f":"Kold!BR37","v":3},8,1,10,0.6,0.5,"D",{"$f":"Kold!BY37","v":3},5.15,1,1.5,0.3,0.2,"A",{"$f":"Kold!CF37","v":2},12,1,6,0.3,0.2,"A",897.85900875200832,4.44807938609451,0,0,4.0000033333277774,0,0,3.9600065999999998,0,2.9653862573963403,0,0,3.3333361111064814,0,0,1.9800032999999999,0,17.175010173069545,17.500017500000002,0,108.10650656768439,0,0,9.9000164999999996,0,15.692317044371375,12.7500125,0,103.23150281768437,0,0,7.9200131999999996,0,152.68155074075395]
[null,{"$f":"Kold!B38","v":"2. sal"},{"$f":"Kold!C38","v":12},{"$f":"Kold!D38","v":5},{"$f":"Kold!E38","v":6},"F5","L1",{"$f":"Kold!H38","v":2},{"$f":"Kold!I38","v":13},"F3","L1",{"$f":"Kold!L38","v":2},{"$f":"IF(Kold!$BL$44=1,\"-\",0.5*BG39*(BL39*BM39+BN39*BO39)+IF(E38>0,(BG39-BH39)*(BS39*BT39+BU39*BV39)/BG39,0))","v":"-"},{"$f":"IF(Kold!$BL$44=1,\"-\",CM39+DT39)","v":"-"},{"$f":"IF(Kold!$BL$44=1,\"-\",0.5*BI39*(BZ39*CA39+CB39*CC39)+IF(I38>0,(BI39-BJ39)*(CG39*CH39+CI39*CJ39)/BI39))","v":"-"},{"$f":"IF(Kold!$BL$44=1,\"-\",$U$6*$O$6*(0.5*E38*(INDEX(fladelast,BK39,1)+INDEX(fladelast,BK39,2)+INDEX(fladelast,BK39,3)*INDEX(fladelast,BK39,5))+IF(E38>0,(INDEX(linielast,BR39,1)+INDEX(linielast,BR39,2)+INDEX(linielast,BR39,3)*INDEX(linielast,BR39,5))*(E38-H38)/E38,0)))","v":"-"},{"$f":"IF(Kold!$BL$44=1,\"-\",P37+Q37+R37+$U$6*$O$6*(C39+D39))","v":"-"},{"$f":"IF(Kold!$BL$44=1,\"-\",$U$6*$O$6*(0.5*I38*(INDEX(fladelast,BY39,1)+INDEX(fladelast,BY39,2)+INDEX(fladelast,BY39,3)*INDEX(fladelast,BY39,5))+IF(I38>0,(INDEX(linielast,CF39,1)+INDEX(linielast,CF39,2)+INDEX(linielast,CF39,3)*INDEX(linielast,CF39,5))*(I38-L38)/I38)))","v":"-"},{"$f":"IF(Kold!$BL$44=1,\"-\",$Q$6*(0.5*E38*INDEX(fladelast,BK39,1)+IF(E38>0,INDEX(linielast,BR39,1)*(E38-H38)/E38)))","v":"-"},{"$f":"IF(Kold!$BL$44=1,\"-\",S37+T37+U37+$Q$6*C39)","v":"-"},{"$f":"IF(Kold!$BL$44=1,\"-\",$Q$6*(0.5*I38*INDEX(fladelast,BY39,1)+IF(I38>0,INDEX(linielast,CF39,1)*(I38-L38)/I38)))","v":"-"},null," NB:  Resultaterne skal altid kontrolleres af ansvarlig statiker",null,null,null,null,null,null,null,null,null,null,null,null,null,null,null,null,null,null,null,null,null,null,null,null,null,null,null,null,null,null,null,null,null,null,null,6.0000099999999996,2,13.00001,2,{"$f":"Kold!BK38","v":6},8.15,1,4,0.6,0.5,"D",{"$f":"Kold!BR38","v":2},12,1,6,0.3,0.2,"A",{"$f":"Kold!BY38","v":3},5.15,1,1.5,0.3,0.2,"A",{"$f":"Kold!CF38","v":3},8,1,10,0.6,0.5,"D",980.77124810374198,4.1250032499983327,0,0,12.276935786981703,0,0,0,0,2.7500021666655554,0,0,10.230779822484752,0,0,0,0,20.140396430465884,17.500017500000002,0,111.43984267879087,0,0,11.880019799999999,0,18.657703301767715,12.7500125,0,106.56483892879085,0,0,9.9000164999999996,0,160.96027640925678]
[null,{"$f":"Kold!B39","v":"1. sal"},{"$f":"Kold!C39","v":12},{"$f":"Kold!D39","v":5},{"$f":"Kold!E39","v":6},"F4","L1",{"$f":"Kold!H39","v":2},{"$f":"Kold!I39","v":13},"F5","L1",{"$f":"Kold!L39","v":2},{"$f":"IF(Kold!$BL$44=1,\"-\",0.5*BG40*(BL40*BM40+BN40*BO40)+IF(E39>0,(BG40-BH40)*(BS40*BT40+BU40*BV40)/BG40,0))","v":"-"},{"$f":"IF(Kold!$BL$44=1,\"-\",CM40+DT40)","v":"-"},{"$f":"IF(Kold!$BL$44=1,\"-\",0.5*BI40*(BZ40*CA40+CB40*CC40)+IF(I39>0,(BI40-BJ40)*(CG40*CH40+CI40*CJ40)/BI40))","v":"-"},{"$f":"IF(Kold!$BL$44=1,\"-\",$U$6*$O$6*(0.5*E39*(INDEX(fladelast,BK40,1)+INDEX(fladelast,BK40,2)+INDEX(fladelast,BK40,3)*INDEX(fladelast,BK40,5))+IF(E39>0,(INDEX(linielast,BR40,1)+INDEX(linielast,BR40,2)+INDEX(linielast,BR40,3)*INDEX(linielast,BR40,5))*(E39-H39)/E39,0)))","v":"-"},{"$f":"IF(Kold!$BL$44=1,\"-\",P38+Q38+R38+$U$6*$O$6*(C40+D40))","v":"-"},{"$f":"IF(Kold!$BL$44=1,\"-\",$U$6*$O$6*(0.5*I39*(INDEX(fladelast,BY40,1)+INDEX(fladelast,BY40,2)+INDEX(fladelast,BY40,3)*INDEX(fladelast,BY40,5))+IF(I39>0,(INDEX(linielast,CF40,1)+INDEX(linielast,CF40,2)+INDEX(linielast,CF40,3)*INDEX(linielast,CF40,5))*(I39-L39)/I39)))","v":"-"},{"$f":"IF(Kold!$BL$44=1,\"-\",$Q$6*(0.5*E39*INDEX(fladelast,BK40,1)+IF(E39>0,INDEX(linielast,BR40,1)*(E39-H39)/E39)))","v":"-"},{"$f":"IF(Kold!$BL$44=1,\"-\",S38+T38+U38+$Q$6*C40)","v":"-"},{"$f":"IF(Kold!$BL$44=1,\"-\",$Q$6*(0.5*I39*INDEX(fladelast,BY40,1)+IF(I39>0,INDEX(linielast,CF40,1)*(I39-L39)/I39)))","v":"-"},null,null,null,null,null,null,null,null,null,null,null,null,null,null,null,null,null,null,null,null,null,null,null,null,null,null,null,null,null,null,null,null,null,null,null,null,null,6.0000099999999996,2,13.00001,2,{"$f":"Kold!BK39","v":6},8.15,1,4,0.6,0.5,"D",{"$f":"Kold!BR39","v":2},12,1,6,0.3,0.2,"A",{"$f":"Kold!BY39","v":4},5.65,1,2.5,0.4,0.2,"B",{"$f":"Kold!CF39","v":2},12,1,6,0.3,0.2,"A",1070.465552986373,2.7230781360928438,6.5000050000000007,0,7.2000119999999992,0,0,0,0,1.8153854240618958,3.2500025000000003,0,6.0000099999999996,0,0,0,0,22.890398597131441,17.500017500000002,0,121.67062250127562,0,0,11.880019799999999,0,21.407705468433271,12.7500125,0,116.7956187512756,0,0,9.9000164999999996,0,173.94105839840705]
[null,{"$f":"Kold!B40","v":"Stue"},{"$f":"Kold!C40","v":12},{"$f":"Kold!D40","v":5},{"$f":"Kold!E40","v":6},"F3","L2",{"$f":"Kold!H40","v":2},{"$f":"Kold!I40","v":13},"F6","L2",{"$f":"Kold!L40","v":2},{"$f":"IF(Kold!$BL$44=1,\"-\",0.5*BG41*(BL41*BM41+BN41*BO41)+IF(E40>0,(BG41-BH41)*(BS41*BT41+BU41*BV41)/BG41,0))","v":"-"},{"$f":"IF(Kold!$BL$44=1,\"-\",CM41+DT41)","v":"-"},{"$f":"IF(Kold!$BL$44=1,\"-\",0.5*BI41*(BZ41*CA41+CB41*CC41)+IF(I40>0,(BI41-BJ41)*(CG41*CH41+CI41*CJ41)/BI41))","v":"-"},{"$f":"IF(Kold!$BL$44=1,\"-\",$U$6*$O$6*(0.5*E40*(INDEX(fladelast,BK41,1)+INDEX(fladelast,BK41,2)+INDEX(fladelast,BK41,3)*INDEX(fladelast,BK41,5))+IF(E40>0,(INDEX(linielast,BR41,1)+INDEX(linielast,BR41,2)+INDEX(linielast,BR41,3)*INDEX(linielast,BR41,5))*(E40-H40)/E40,0)))","v":"-"},{"$f":"IF(Kold!$BL$44=1,\"-\",P39+Q39+R39+$U$6*$O$6*(C41+D41))","v":"-"},{"$f":"IF(Kold!$BL$44=1,\"-\",$U$6*$O$6*(0.5*I40*(INDEX(fladelast,BY41,1)+INDEX(fladelast,BY41,2)+INDEX(fladelast,BY41,3)*INDEX(fladelast,BY41,5))+IF(I40>0,(INDEX(linielast,CF41,1)+INDEX(linielast,CF41,2)+INDEX(linielast,CF41,3)*INDEX(linielast,CF41,5))*(I40-L40)/I40)))","v":"-"},{"$f":"IF(Kold!$BL$44=1,\"-\",$Q$6*(0.5*E40*INDEX(fladelast,BK41,1)+IF(E40>0,INDEX(linielast,BR41,1)*(E40-H40)/E40)))","v":"-"},{"$f":"IF(Kold!$BL$44=1,\"-\",S39+T39+U39+$Q$6*C41)","v":"-"},{"$f":"IF(Kold!$BL$44=1,\"-\",$Q$6*(0.5*I40*INDEX(fladelast,BY41,1)+IF(I40>0,INDEX(linielast,CF41,1)*(I40-L40)/I40)))","v":"-"},null,"Vejledning:",null,null,"Betonelementbyggeriers statik",null,null,null,null,null,null,null,null,null,null,null,null,null,null,null,null,null,null,null,null,null,null,null,null,null,null,null,null,null,null,null,null,6.0000099999999996,2,13.00001,2,{"$f":"Kold!BK40","v":5},5.65,1,7.5,0.6,0.5,"D",{"$f":"Kold!BR40","v":2},12,1,6,0.3,0.2,"A",{"$f":"Kold!BY40","v":6},8.15,1,4,0.6,0.5,"D",{"$f":"Kold!CF40","v":2},12,1,6,0.3,0.2,"A",1166.7944762269919,2.7230781360928438,0,0,29.1000345,0,0,0,0,1.8153854240618958,0,0,24.250028749999998,0,0,0,0,24.705784021193338,20.750020000000003,0,127.67063250127562,0,0,11.880019799999999,0,23.223090892495165,16.000015000000001,0,122.7956287512756,0,0,9.9000164999999996,0,185.00645632246898]
[null,{"$f":"Kold!B41","v":"Kld."},{"$f":"Kold!C41","v":12},{"$f":"Kold!D41","v":5},null,null,null,null,null,null,null,null,null,{"$f":"IF(Kold!$BL$44=1,\"-\",CM42+DT42)","v":"-"},null,null,{"$f":"IF(Kold!$BL$44=1,\"-\",P40+Q40+R40)","v":"-"},null,null,{"$f":"IF(Kold!$BL$44=1,\"-\",S40+T40+U40)","v":"-"},null,null,"Polyteknisk Forlag 2010 eller www.bef.dk",null,null,null,null,null,null,null,null,null,null,null,null,null,null,null,null,null,null,null,null,null,null,null,null,null,null,null,null,null,null,null,null,null,null,null,6.0000099999999996,2,13.00001,2,{"$f":"Kold!BK41","v":4},5.65,1,2.5,0.4,0.2,"B",{"$f":"Kold!BR41","v":3},8,1,10,0.6,0.5,"D",{"$f":"Kold!BY41","v":7},5.65,1,3.3,0.4,0.2,"G",{"$f":"Kold!CF41","v":3},8,1,10,0.6,0.5,"D",{"$f":"CM40+0.5*BG40*(BL40*BM40)+IF(E39>0,(BG40-BH40)*(BS40*BT40)/BG40)+0.5*BI40*(BZ40*CA40)+IF(I39>0,(BI40-BJ40)*(CG40*CH40)/BI40)+(C41+D41)*$U$6*$O$6","v":1271.8733994676111},0,3.0000049999999998,0,9.076927120309481,0,0,8.580006599999999,0,0,1.5000024999999999,0,7.5641059335912333,0,0,4.2900032999999995,0,26.521169445255232,20.750020000000003,0,151.92066125127562,0,0,11.880019799999999,0,25.038476316557059,16.000015000000001,0,147.0456575012756,0,0,9.9000164999999996,0,211.07187049653083]
[null,null,null,null,null,null,null,null,null,null,null,null,null,null,null,null,null,null,null,null,null,null,null,null,null,null,null,null,null,null,null,null,null,null,null,null,null,null,null,null,null,null,null,null,null,null,null,null,null,null,null,null,null,null,null,null,null,null,null,null,null,null,null,null,null,null,null,null,null,null,null,null,null,null,null,null,null,null,null,null,null,null,null,null,null,null,null,null,null,null,{"$f":"CM41+0.5*BG41*(BL41*BM41)+IF(E40>0,(BG41-BH41)*(BS41*BT41)/BG41)+0.5*BI41*(BZ41*CA41)+IF(I40>0,(BI41-BJ41)*(CG41*CH41)/BI41)","v":1337.651025461357},{"$f":"IF($BQ42=CN$25,0.5*$BG42*$BN42*$BO42,0)+IF(AND($BX42=CN$25,$E41>0),($BG42-$BH42)*$BU42*$BV42/$BG42,0)+IF($CE42=CN$25,0.5*$BI42*$CB42*$CC42,0)+IF(AND($CL42=CN$25,$I41>0),($BI42-$BJ42)*$CI42*$CJ42/$BI42,0)","v":0},0,0,0,0,0,0,0,{"$f":"IF($BQ42=CV$25,0.5*$BG42*$BN42*$BP42,0)+IF(AND($BX42=CV$25,$E41>0),($BG42-$BH42)*$BU42*$BW42/$BG42,0)+IF($CE42=CV$25,0.5*$BI42*$CB42*$CD42,0)+IF(AND($CL42=CV$25,$I41>0),($BI42-$BJ42)*$CI42*$CK42/$BI42,0)","v":0},0,0,0,0,0,0,0,26.521169445255232,22.250022500000004,0,159.48476718486685,0,0,18.480023099999997,0,25.038476316557059,17.500017500000002,0,154.60976343486684,0,0,14.190019799999998,0,226.73598223012209]
[]
[null,null,null,null,null,null,null,null,null,null,null,null,null,null,null,null,null,null,null,null,null,null,null,null,null,null,null,null,null,null,null,null,null,null,null,null,null,null,null,null,null,null,null,null,null,null,null,null,null,null,null,null,null,null,null,null,null,null,"Fejltabel",null,null,null,null,{"$f":"IF(MAX(BL45:BL56)=1,1,0)","v":0},{"$f":"BM45&BM46&BM47&BM48&BM49&BM50&BM51&BM52&BM53&BM54&BM55&BM56","v":""}]
[null,null,null,null,null,null,null,null,null,null,null,null,null,null,null,null,null,null,null,null,null,null,null,null,null,null,null,null,null,null,null,null,null,null,null,null,null,null,null,null,null,null,null,null,null,null,null,null,null,null,null,null,null,null,null,null,null,null,"Programmet modtager ikke negative inddata !  ",null,null,null,null,{"$f":"IF(MIN(O6,Q6,U6,BJ61:BN65,BJ72:BN73,C27:D41,E26:E40,H26:H40,I26:I40,L26:L40)<0,1,0)","v":0},{"$f":"IF(BL45=0,\"\",BG45)","v":""}]
[null,null,null,null,null,null,null,null,null,null,null,null,null,null,null,null,null,null,null,null,null,null,null,null,null,null,null,null,null,null,null,null,null,null,null,null,null,null,null,null,null,null,null,null,null,null,null,null,null,null,null,null,null,null,null,null,null,null,"Linielast udenfor dækfelt !  ",null,null,null,null,{"$f":"Kold!BL46","v":0},{"$f":"IF(BL46=0,\"\",BG46)","v":""}]
[null,null,null,null,null,null,null,null,null,null,null,null,null,null,null,null,null,null,null,null,null,null,null,null,null,null,null,null,null,null,null,null,null,null,null,null,null,null,null,null,null,null,null,null,null,null,null,null,null,null,null,null,null,null,null,null,null,null,"Primær reduktionsfaktor skal være størst !",null,null,null,null,{"$f":"IF(OR(T10>S10,T11>S11,T12>S12,T13>S13,T14>S14,T21>S21,T22>S22,T15>S15,T16>S16,T17>S17,T18>S18),1,0)","v":0},{"$f":"IF(BL47=0,\"\",BG47)","v":""}]
[]
[]
[]
[]
[]
[]
[]
[]
[]
[]
[]
[null,null,null,null,null,null,null,null,null,null,null,null,null,null,null,null,null,null,null,null,null,null,null,null,null,null,null,null,null,null,null,null,null,null,null,null,null,null,null,null,null,null,null,null,null,null,null,null,null,null,null,null,null,null,null,null,null,null," Fladelaste",null,null,"gk","gfri,k","qk","yq1/yq2","yq2","Kategori"]
[null,null,null,null,null,null,null,null,null,null,null,null,null,null,null,null,null,null,null,null,null,null,null,null,null,null,null,null,null,null,null,null,null,null,null,null,null,null,null,null,null,null,null,null,null,null,null,null,null,null,null,null,null,null,null,null,null,null,"F0",null,null,0,0,0]
[null,null,null,null,null,null,null,null,null,null,null,null,null,null,null,null,null,null,null,null,null,null,null,null,null,null,null,null,null,null,null,null,null,null,null,null,null,null,null,null,null,null,null,null,null,null,null,null,null,null,null,null,null,null,null,null,null,null,{"$f":"Kold!M10","v":"F1"},{"$f":"Kold!N10","v":"Tagflade, sne"},{"$f":"Kold!O10","v":0},{"$f":"Kold!P10","v":3.1},{"$f":"Kold!Q10","v":1},{"$f":"Kold!R10","v":0.8},{"$f":"S10","v":0.2},{"$f":"T10","v":0},{"$f":"INDEX($BG$9:$BG$16,BI10,1)","v":"N"}]
[null,null,null,null,null,null,null,null,null,null,null,null,null,null,null,null,null,null,null,null,null,null,null,null,null,null,null,null,null,null,null,null,null,null,null,null,null,null,null,null,null,null,null,null,null,null,null,null,null,null,null,null,null,null,null,null,null,null,{"$f":"Kold!M11","v":"F2"},{"$f":"Kold!N11","v":"Boligarealer"},{"$f":"Kold!O11","v":0},{"$f":"Kold!P11","v":3.65},{"$f":"Kold!Q11","v":1.5},{"$f":"Kold!R11","v":1.5},{"$f":"S11","v":0.3},0.2,{"$f":"INDEX($BG$9:$BG$16,BI11,1)","v":"A"}]
[null,null,null,null,null,null,null,null,null,null,null,null,null,null,null,null,null,null,null,null,null,null,null,null,null,null,null,null,null,null,null,null,null,null,null,null,null,null,null,null,null,null,null,null,null,null,null,null,null,null,null,null,null,null,null,null,null,null,{"$f":"Kold!M12","v":"F3"},{"$f":"Kold!N12","v":"Kontorer"},{"$f":"Kold!O12","v":0},{"$f":"Kold!P12","v":3.65},{"$f":"Kold!Q12","v":2},{"$f":"Kold!R12","v":2.5},{"$f":"S12","v":0.4},0.2,"B"]
[null,null,null,null,null,null,null,null,null,null,null,null,null,null,null,null,null,null,null,null,null,null,null,null,null,null,null,null,null,null,null,null,null,null,null,null,null,null,null,null,null,null,null,null,null,null,null,null,null,null,null,null,null,null,null,null,null,null,{"$f":"Kold!M13","v":"F4"},{"$f":"Kold!N13","v":"Kontor med arkiv"},{"$f":"Kold!O13","v":0},{"$f":"Kold!P13","v":3.65},{"$f":"Kold!Q13","v":2},{"$f":"Kold!R13","v":7.5},{"$f":"S13","v":0.6},0.5,"D"]
[null,null,null,null,null,null,null,null,null,null,null,null,null,null,null,null,null,null,null,null,null,null,null,null,null,null,null,null,null,null,null,null,null,null,null,null,null,null,null,null,null,null,null,null,null,null,null,null,null,null,null,null,null,null,null,null,null,null,{"$f":"Kold!M14","v":"F5"},{"$f":"Kold!N14","v":"Kontorer"},{"$f":"Kold!O14","v":0},{"$f":"Kold!P14","v":4.1500000000000004},{"$f":"Kold!Q14","v":4},{"$f":"Kold!R14","v":4},{"$f":"S14","v":0.6},0.5,"D"]
[null,null,null,null,null,null,null,null,null,null,null,null,null,null,null,null,null,null,null,null,null,null,null,null,null,null,null,null,null,null,null,null,null,null,null,null,null,null,null,null,null,null,null,null,null,null,null,null,null,null,null,null,null,null,null,null,null,null,{"$f":"Kold!M15","v":"F6"},{"$f":"Kold!N15","v":"Kontorer"},{"$f":"Kold!O15","v":0},{"$f":"Kold!P15","v":3.65},{"$f":"Kold!Q15","v":2},{"$f":"Kold!R15","v":3.3},{"$f":"S15","v":0.4},0.2,"G"]
[null,null,null,null,null,null,null,null,null,null,null,null,null,null,null,null,null,null,null,null,null,null,null,null,null,null,null,null,null,null,null,null,null,null,null,null,null,null,null,null,null,null,null,null,null,null,null,null,null,null,null,null,null,null,null,null,null,null,{"$f":"Kold!M16","v":"F7"},{"$f":"Kold!N16","v":"Undervisning"},{"$f":"Kold!O16","v":0},{"$f":"Kold!P16","v":3.65},{"$f":"Kold!Q16","v":2},{"$f":"Kold!R16","v":4.8},{"$f":"S16","v":0.6},0.5,"D"]
[null,null,null,null,null,null,null,null,null,null,null,null,null,null,null,null,null,null,null,null,null,null,null,null,null,null,null,null,null,null,null,null,null,null,null,null,null,null,null,null,null,null,null,null,null,null,null,null,null,null,null,null,null,null,null,null,null,null,{"$f":"Kold!M17","v":"F8"},{"$f":"Kold!N17","v":"Værksted"},{"$f":"Kold!O17","v":0},{"$f":"Kold!P17","v":3.65},{"$f":"Kold!Q17","v":2},{"$f":"Kold!R17","v":8.3000000000000007},{"$f":"S17","v":0.6},0.5,"D"]
[null,null,null,null,null,null,null,null,null,null,null,null,null,null,null,null,null,null,null,null,null,null,null,null,null,null,null,null,null,null,null,null,null,null,null,null,null,null,null,null,null,null,null,null,null,null,null,null,null,null,null,null,null,null,null,null,null,null,{"$f":"Kold!M18","v":"F9"},{"$f":"Kold!N18","v":"Butiksarealer"},{"$f":"Kold!O18","v":0},{"$f":"Kold!P18","v":3.65},{"$f":"Kold!Q18","v":2},{"$f":"Kold!R18","v":3.3},{"$f":"S18","v":0.2},0,"N"]
[null,null,null,null,null,null,null,null,null,null,null,null,null,null,null,null,null,null,null,null,null,null,null,null,null,null,null,null,null,null,null,null,null,null,null,null,null,null,null,null,null,null,null,null,null,null,null,null,null,null,null,null,null,null,null,null,null,null,"Linielaste",null,null,"gk","gfri,k","qk","yq1/yq2","yq2","Kategori"]
[null,null,null,null,null,null,null,null,null,null,null,null,null,null,null,null,null,null,null,null,null,null,null,null,null,null,null,null,null,null,null,null,null,null,null,null,null,null,null,null,null,null,null,null,null,null,null,null,null,null,null,null,null,null,null,null,null,null,"L0",null,null,0,0,0]
[null,null,null,null,null,null,null,null,null,null,null,null,null,null,null,null,null,null,null,null,null,null,null,null,null,null,null,null,null,null,null,null,null,null,null,null,null,null,null,null,null,null,null,null,null,null,null,null,null,null,null,null,null,null,null,null,null,null,{"$f":"Kold!M21","v":"L1"},{"$f":"Kold!N21","v":"Badeværelser"},{"$f":"Kold!O21","v":0},{"$f":"Kold!P21","v":8},{"$f":"Kold!Q21","v":4},{"$f":"Kold!R21","v":6},{"$f":"S21","v":0.3},{"$f":"T21","v":0.2},{"$f":"INDEX($BG$9:$BG$16,BI21,1)","v":"A"}]
[null,null,null,null,null,null,null,null,null,null,null,null,null,null,null,null,null,null,null,null,null,null,null,null,null,null,null,null,null,null,null,null,null,null,null,null,null,null,null,null,null,null,null,null,null,null,null,null,null,null,null,null,null,null,null,null,null,null,{"$f":"Kold!M22","v":"L2"},{"$f":"Kold!N22","v":"Komprimator"},{"$f":"Kold!O22","v":0},{"$f":"Kold!P22","v":0},{"$f":"Kold!Q22","v":8},{"$f":"Kold!R22","v":10},{"$f":"S22","v":0.6},{"$f":"T22","v":0.5},{"$f":"INDEX($BG$9:$BG$16,BI22,1)","v":"D"}]

{"sheet":"610a","index":2,"n_rows":73,"n_cols":91,"rows_kept":73,"cut":false,"hidden":false,"merged":[[23,99,23,106],[23,107,23,114],[23,115,23,122],[23,58,23,61],[23,62,23,68],[23,69,23,75],[23,76,23,82],[23,83,23,89],[23,91,23,98],[22,2,22,3],[22,4,22,7],[22,8,22,11],[22,12,22,14],[22,15,22,17],[22,18,22,20],[15,13,15,14],[16,13,16,14],[17,13,17,14],[19,13,19,14],[20,13,20,14],[21,13,21,14],[2,3,2,8],[2,10,2,11],[2,12,3,20],[3,3,3,8],[3,10,3,11],[37,22,38,25],[40,22,40,25],[4,10,4,11],[5,17,6,19],[5,20,6,20],[4,12,4,20],[14,13,14,14],[5,12,6,13],[5,14,6,14],[5,15,6,15],[5,16,6,16],[9,13,9,14],[10,13,10,14],[11,13,11,14],[12,13,12,14],[13,13,13,14]]}
[]
[null,"Bruger:",null,{"$f":"Kold!D2","v":0},null,null,null,null,null,null,null,null,{"$f":"Kold!M2","v":"Lastnedføring - 15 etager"},null,null,null,null,null,null,null,{"$f":"Kold!U2","v":"Betonelement-Foreningen feb 2019"}]
[null,"Sagsnavn:",null,{"$f":"Kold!D3","v":"Test projekt"},null,null,null,null,null,"Sag nr.:",{"$f":"Kold!K3","v":"23 - 4545"},null,{"$f":"BM44","v":""}]
[null,"Bygningsdel:",null,{"$f":"Kold!D4","v":"Test bygningsdel"},null,null,null,null,null,"Dato:",{"$f":"Kold!K4","v":"2008-03-01"}]
[null,"Emne:",null,"Branddimensioneringstilstande",null,null,null,null,null,"Init:",{"$f":"Kold!K5","v":"JFJ"}]
[null,null,null,null,null,null,null,null,null,null,null,null," Egenvægt, gg,sup =",null,1.2,"gg,inf  =",1," Konsekvensklasse:  KFI =",null,null,{"$f":"Kold!U6","v":1.1000000000000001}]
[]
[null,null,null,null,null,null,null,null,null,null,null,null," Fladelaste  (kN/m2)",null,null,"gk","gfri,k"]
[null,null,null,null,null,null,null,null,null,null,null,null,"F0",null,null,0,0]
[null,null,null,null,null,null,null,null,null,null,null,null,{"$f":"BG61","v":"F1"},{"$f":"BH61","v":"Tagflade, sne"},null,{"$f":"BJ61","v":3.1},{"$f":"BK61","v":1}]
[null,null,null,null,null,null,null,null,null,null,null,null,{"$f":"BG62","v":"F2"},"Boligarealer",null,{"$f":"BJ62","v":3.65},1.5]
[null,null,null,null,null,null,null,null,null,null,null,null,"F3","Kontorer",null,3.65,2]
[null,null,null,null,null,null,null,null,null,null,null,null,"F4","Kontor med arkiv",null,3.65,2]
[null,null,null,null,null,null,null,null,null,null,null,null,"F5","Kontorer",null,4.1500000000000004,4]
[null,null,null,null,null,null,null,null,null,null,null,null,"F6","Kontorer",null,3.65,2]
[null,null,null,null,null,null,null,null,null,null,null,null,"F7","Undervisning",null,3.65,2]
[null,null,null,null,null,null,null,null,null,null,null,null,"F8","Værksted",null,3.65,2]
[null,null,null,null,null,null,null,null,null,null,null,null,"F9","Butiksarealer",null,3.65,2]
[null,null,null,null,null,null,null,null,null,null,null,null,"Linielaste (kN/m)",null,null,"gk","gfri,k"]
[null,null,null,null,null,null,null,null,null,null,null,null,"L0",null,null,0,0]
[null,null,null,null,null,null,null,null,null,null,null,null,{"$f":"BG72","v":"L1"},"Badeværelser",null,8,4]
[null,null,null,null,null,null,null,null,null,null,null,null,"L2","Komprimator",null,0,8]
[null,"Etage","Egenvægt i bærelinie",null,"Laste på venstre dækfelt",null,null,null,"Laste på højre dækfelt",null,null,null,"maksimalværdier",null,null,"reducerede værdier",null,null,"minimalværdier"]
[null,null,"gk","gfri,k","Lv","Fladelast","Linielast","sv","Lh","Fladelast","Linielast","sh","nv","no","nh","nv","no","nh","nv","no","nh",null,null,null,null,null,null,null,null,null,null,null,null,null,null,null,null,null,null,null,null,null,null,null,null,null,null,null,null,null,null,null,null,null,null,null,null,null,"Spændvidder",null,null,null,"Fladelaste, venstre dækfelt",null,null,null,null,null,null,"Linielaste, venstre dækfelt",null,null,null,null,null,null,"Fladelaste, højre dækfelt",null,null,null,null,null,null,"Linielaste, højre dækfelt",null,null,null,null,null,null,"Ng"]
[null,null,"(kN/m)","(kN/m)","(m)",null,null,"(m)","(m)",null,null,"(m)","(kN/m)","(kN/m)","(kN/m)","(kN/m)","(kN/m)","(kN/m)","(kN/m)","(kN/m)","(kN/m)",null,null,null,null,null,null,null,null,null,null,null,null,null,null,null,null,null,null,null,null,null,null,null,null,null,null,null,null,null,null,null,null,null,null,null,null,null,"Lv","sv","Lh","sh",null,"gk","gg",null,null,null,null,null,"gk","gg",null,null,null,null,null,"gk","gg",null,null,null,null,null,"gk","gg"]
[null,{"$f":"Kold!B26","v":"Tag"},null,null,{"$f":"Kold!E26","v":6},{"$f":"INDEX($BG$60:$BG$69,BK27,1)","v":"F3"},{"$f":"INDEX($BG$71:$BG$73,BR27,1)","v":"L2"},{"$f":"Kold!H26","v":5},{"$f":"Kold!I26","v":13},{"$f":"INDEX($BG$60:$BG$69,BY27,1)","v":"F3"},{"$f":"INDEX($BG$71:$BG$73,CF27,1)","v":"L1"},{"$f":"Kold!L26","v":2},{"$f":"IF(Kold!$BL$44=1,\"-\",0.5*BG27*(BL27*BM27+BN27*BO27)+IF(E26>0,(BG27-BH27)*(BS27*BT27+BU27*BV27)/BG27,0))","v":"-"},{"$f":"IF(Kold!$BL$44=1,\"-\",CM27+DT27)","v":"-"},{"$f":"IF(Kold!$BL$44=1,\"-\",0.5*BI27*(BZ27*CA27+CB27*CC27)+IF(I26>0,(BI27-BJ27)*(CG27*CH27+CI27*CJ27)/BI27))","v":"-"},{"$f":"IF(Kold!$BL$44=1,\"-\",$U$6*$O$6*(0.5*E26*(INDEX(fladelast,BK27,1)+INDEX(fladelast,BK27,2)+INDEX(fladelast,BK27,3)*INDEX(fladelast,BK27,5))+IF(E26>0,(INDEX(linielast,BR27,1)+INDEX(linielast,BR27,2)+INDEX(linielast,BR27,3)*INDEX(linielast,BR27,5))*(E26-H26)/E26,0)))","v":"-"},{"$f":"IF(Kold!$BL$44=1,\"-\",$U$6*$O$6*(C27+D27))","v":"-"},{"$f":"IF(Kold!$BL$44=1,\"-\",$U$6*$O$6*(0.5*I26*(INDEX(fladelast,BY27,1)+INDEX(fladelast,BY27,2)+INDEX(fladelast,BY27,3)*INDEX(fladelast,BY27,5))+IF(I26>0,(INDEX(linielast,CF27,1)+INDEX(linielast,CF27,2)+INDEX(linielast,CF27,3)*INDEX(linielast,CF27,5))*(I26-L26)/I26)))","v":"-"},{"$f":"IF(Kold!$BL$44=1,\"-\",$Q$6*(0.5*E26*INDEX(fladelast,BK27,1)+IF(E26>0,INDEX(linielast,BR27,1)*(E26-H26)/E26)))","v":"-"},{"$f":"IF(Kold!$BL$44=1,\"-\",$Q$6*C27)","v":"-"},{"$f":"IF(Kold!$BL$44=1,\"-\",$Q$6*(0.5*I26*INDEX(fladelast,BY27,1)+IF(I26>0,INDEX(linielast,CF27,1)*(I26-L26)/I26)))","v":"-"}]
[null,{"$f":"Kold!B27","v":"13. sal"},{"$f":"Kold!C27","v":12},{"$f":"Kold!D27","v":5},{"$f":"Kold!E27","v":6},{"$f":"INDEX($BG$60:$BG$69,BK28,1)","v":"F6"},{"$f":"INDEX($BG$71:$BG$73,BR28,1)","v":"L1"},{"$f":"Kold!H27","v":2},{"$f":"Kold!I27","v":13},{"$f":"INDEX($BG$60:$BG$69,BY28,1)","v":"F1"},{"$f":"INDEX($BG$71:$BG$73,CF28,1)","v":"L2"},{"$f":"Kold!L27","v":2},{"$f":"IF(Kold!$BL$44=1,\"-\",0.5*BG28*(BL28*BM28+BN28*BO28)+IF(E27>0,(BG28-BH28)*(BS28*BT28+BU28*BV28)/BG28,0))","v":"-"},{"$f":"IF(Kold!$BL$44=1,\"-\",CM28+DT28)","v":"-"},{"$f":"IF(Kold!$BL$44=1,\"-\",0.5*BI28*(BZ28*CA28+CB28*CC28)+IF(I27>0,(BI28-BJ28)*(CG28*CH28+CI28*CJ28)/BI28))","v":"-"},{"$f":"IF(Kold!$BL$44=1,\"-\",$U$6*$O$6*(0.5*E27*(INDEX(fladelast,BK28,1)+INDEX(fladelast,BK28,2)+INDEX(fladelast,BK28,3)*INDEX(fladelast,BK28,5))+IF(E27>0,(INDEX(linielast,BR28,1)+INDEX(linielast,BR28,2)+INDEX(linielast,BR28,3)*INDEX(linielast,BR28,5))*(E27-H27)/E27,0)))","v":"-"},{"$f":"IF(Kold!$BL$44=1,\"-\",P26+Q26+R26+$U$6*$O$6*(C28+D28))","v":"-"},{"$f":"IF(Kold!$BL$44=1,\"-\",$U$6*$O$6*(0.5*I27*(INDEX(fladelast,BY28,1)+INDEX(fladelast,BY28,2)+INDEX(fladelast,BY28,3)*INDEX(fladelast,BY28,5))+IF(I27>0,(INDEX(linielast,CF28,1)+INDEX(linielast,CF28,2)+INDEX(linielast,CF28,3)*INDEX(linielast,CF28,5))*(I27-L27)/I27)))","v":"-"},{"$f":"IF(Kold!$BL$44=1,\"-\",$Q$6*(0.5*E27*INDEX(fladelast,BK28,1)+IF(E27>0,INDEX(linielast,BR28,1)*(E27-H27)/E27)))","v":"-"},{"$f":"IF(Kold!$BL$44=1,\"-\",S26+T26+U26+$Q$6*C28)","v":"-"},{"$f":"IF(Kold!$BL$44=1,\"-\",$Q$6*(0.5*I27*INDEX(fladelast,BY28,1)+IF(I27>0,INDEX(linielast,CF28,1)*(I27-L27)/I27)))","v":"-"},null,null,null,null,null,null,null,null,null,null,null,null,null,null,null,null,null,null,null,null,null,null,null,null,null,null,null,null,null,null,null,null,null,null,null,null,null,{"$f":"E26+0.00001","v":6.0000099999999996},{"$f":"H26","v":5},{"$f":"I26+0.00001","v":13.00001},{"$f":"L26","v":2},{"$f":"Kold!BK27","v":4},{"$f":"INDEX(fladelast,$BK27,1)+INDEX(fladelast,$BK27,2)","v":5.65},{"$f":"$U$6*$O$6","v":1.32},null,null,null,null,{"$f":"Kold!BR27","v":3},{"$f":"INDEX(linielast,$BR27,1)+INDEX(linielast,$BR27,2)","v":8},{"$f":"$U$6*$O$6","v":1.32},null,null,null,null,{"$f":"Kold!BY27","v":4},{"$f":"INDEX(fladelast,$BY27,1)+INDEX(fladelast,$BY27,2)","v":5.65},{"$f":"$U$6*$O$6","v":1.32},null,null,null,null,{"$f":"Kold!CF27","v":2},{"$f":"INDEX(linielast,$CF27,1)+INDEX(linielast,$CF27,2)","v":12},{"$f":"$U$6*$O$6","v":1.32},null,null,null,null,{"$f":"(C27+D27)*$U$6*$O$6","v":22.44}]
[null,{"$f":"Kold!B28","v":"12. sal"},{"$f":"Kold!C28","v":12},{"$f":"Kold!D28","v":5},{"$f":"Kold!E28","v":6},"F5","L2",{"$f":"Kold!H28","v":5},{"$f":"Kold!I28","v":13},"F2","L1",{"$f":"Kold!L28","v":2},{"$f":"IF(Kold!$BL$44=1,\"-\",0.5*BG29*(BL29*BM29+BN29*BO29)+IF(E28>0,(BG29-BH29)*(BS29*BT29+BU29*BV29)/BG29,0))","v":"-"},{"$f":"IF(Kold!$BL$44=1,\"-\",CM29+DT29)","v":"-"},{"$f":"IF(Kold!$BL$44=1,\"-\",0.5*BI29*(BZ29*CA29+CB29*CC29)+IF(I28>0,(BI29-BJ29)*(CG29*CH29+CI29*CJ29)/BI29))","v":"-"},{"$f":"IF(Kold!$BL$44=1,\"-\",$U$6*$O$6*(0.5*E28*(INDEX(fladelast,BK29,1)+INDEX(fladelast,BK29,2)+INDEX(fladelast,BK29,3)*INDEX(fladelast,BK29,5))+IF(E28>0,(INDEX(linielast,BR29,1)+INDEX(linielast,BR29,2)+INDEX(linielast,BR29,3)*INDEX(linielast,BR29,5))*(E28-H28)/E28,0)))","v":"-"},{"$f":"IF(Kold!$BL$44=1,\"-\",P27+Q27+R27+$U$6*$O$6*(C29+D29))","v":"-"},{"$f":"IF(Kold!$BL$44=1,\"-\",$U$6*$O$6*(0.5*I28*(INDEX(fladelast,BY29,1)+INDEX(fladelast,BY29,2)+INDEX(fladelast,BY29,3)*INDEX(fladelast,BY29,5))+IF(I28>0,(INDEX(linielast,CF29,1)+INDEX(linielast,CF29,2)+INDEX(linielast,CF29,3)*INDEX(linielast,CF29,5))*(I28-L28)/I28)))","v":"-"},{"$f":"IF(Kold!$BL$44=1,\"-\",$Q$6*(0.5*E28*INDEX(fladelast,BK29,1)+IF(E28>0,INDEX(linielast,BR29,1)*(E28-H28)/E28)))","v":"-"},{"$f":"IF(Kold!$BL$44=1,\"-\",S27+T27+U27+$Q$6*C29)","v":"-"},{"$f":"IF(Kold!$BL$44=1,\"-\",$Q$6*(0.5*I28*INDEX(fladelast,BY29,1)+IF(I28>0,INDEX(linielast,CF29,1)*(I28-L28)/I28)))","v":"-"},null,null,null,null,null,null,null,null,null,null,null,null,null,null,null,null,null,null,null,null,null,null,null,null,null,null,null,null,null,null,null,null,null,null,null,null,null,{"$f":"E27+0.00001","v":6.0000099999999996},{"$f":"H27","v":2},{"$f":"I27+0.00001","v":13.00001},{"$f":"L27","v":2},{"$f":"Kold!BK28","v":7},5.65,{"$f":"$U$6*$O$6","v":1.32},null,null,null,null,{"$f":"Kold!BR28","v":2},12,1.32,null,null,null,null,{"$f":"Kold!BY28","v":2},4.0999999999999996,1.32,null,null,null,null,{"$f":"Kold!CF28","v":3},8,1.32,null,null,null,null,{"$f":"CM27+0.5*BG27*(BL27*BM27)+IF(E26>0,(BG27-BH27)*(BS27*BT27)/BG27)+0.5*BI27*(BZ27*CA27)+IF(I26>0,(BI27-BJ27)*(CG27*CH27)/BI27)+(C28+D28)*$U$6*$O$6","v":130.89416804427393}]
[null,{"$f":"Kold!B29","v":"11. sal"},{"$f":"Kold!C29","v":12},{"$f":"Kold!D29","v":5},{"$f":"Kold!E29","v":6},"F3","L1",{"$f":"Kold!H29","v":2},{"$f":"Kold!I29","v":13},"F2","L2",{"$f":"Kold!L29","v":2},{"$f":"IF(Kold!$BL$44=1,\"-\",0.5*BG30*(BL30*BM30+BN30*BO30)+IF(E29>0,(BG30-BH30)*(BS30*BT30+BU30*BV30)/BG30,0))","v":"-"},{"$f":"IF(Kold!$BL$44=1,\"-\",CM30+DT30)","v":"-"},{"$f":"IF(Kold!$BL$44=1,\"-\",0.5*BI30*(BZ30*CA30+CB30*CC30)+IF(I29>0,(BI30-BJ30)*(CG30*CH30+CI30*CJ30)/BI30))","v":"-"},{"$f":"IF(Kold!$BL$44=1,\"-\",$U$6*$O$6*(0.5*E29*(INDEX(fladelast,BK30,1)+INDEX(fladelast,BK30,2)+INDEX(fladelast,BK30,3)*INDEX(fladelast,BK30,5))+IF(E29>0,(INDEX(linielast,BR30,1)+INDEX(linielast,BR30,2)+INDEX(linielast,BR30,3)*INDEX(linielast,BR30,5))*(E29-H29)/E29,0)))","v":"-"},{"$f":"IF(Kold!$BL$44=1,\"-\",P28+Q28+R28+$U$6*$O$6*(C30+D30))","v":"-"},{"$f":"IF(Kold!$BL$44=1,\"-\",$U$6*$O$6*(0.5*I29*(INDEX(fladelast,BY30,1)+INDEX(fladelast,BY30,2)+INDEX(fladelast,BY30,3)*INDEX(fladelast,BY30,5))+IF(I29>0,(INDEX(linielast,CF30,1)+INDEX(linielast,CF30,2)+INDEX(linielast,CF30,3)*INDEX(linielast,CF30,5))*(I29-L29)/I29)))","v":"-"},{"$f":"IF(Kold!$BL$44=1,\"-\",$Q$6*(0.5*E29*INDEX(fladelast,BK30,1)+IF(E29>0,INDEX(linielast,BR30,1)*(E29-H29)/E29)))","v":"-"},{"$f":"IF(Kold!$BL$44=1,\"-\",S28+T28+U28+$Q$6*C30)","v":"-"},{"$f":"IF(Kold!$BL$44=1,\"-\",$Q$6*(0.5*I29*INDEX(fladelast,BY30,1)+IF(I29>0,INDEX(linielast,CF30,1)*(I29-L29)/I29)))","v":"-"},null,null,null,null,null,null,null,null,null,null,null,null,null,null,null,null,null,null,null,null,null,null,null,null,null,null,null,null,null,null,null,null,null,null,null,null,null,6.0000099999999996,5,13.00001,2,{"$f":"Kold!BK29","v":6},8.15,1.32,null,null,null,null,{"$f":"Kold!BR29","v":3},8,1.32,null,null,null,null,{"$f":"Kold!BY29","v":3},5.15,1.32,null,null,null,null,{"$f":"Kold!CF29","v":2},12,1.32,null,null,null,null,{"$f":"CM28+0.5*BG28*(BL28*BM28)+IF(E27>0,(BG28-BH28)*(BS28*BT28)/BG28)+0.5*BI28*(BZ28*CA28)+IF(I27>0,(BI28-BJ28)*(CG28*CH28)/BI28)+(C29+D29)*$U$6*$O$6","v":230.38162705934704}]
[null,{"$f":"Kold!B30","v":"10. sal"},{"$f":"Kold!C30","v":12},{"$f":"Kold!D30","v":5},{"$f":"Kold!E30","v":6},"F5","L2",{"$f":"Kold!H30","v":2},{"$f":"Kold!I30","v":13},"F5","L1",{"$f":"Kold!L30","v":2},{"$f":"IF(Kold!$BL$44=1,\"-\",0.5*BG31*(BL31*BM31+BN31*BO31)+IF(E30>0,(BG31-BH31)*(BS31*BT31+BU31*BV31)/BG31,0))","v":"-"},{"$f":"IF(Kold!$BL$44=1,\"-\",CM31+DT31)","v":"-"},{"$f":"IF(Kold!$BL$44=1,\"-\",0.5*BI31*(BZ31*CA31+CB31*CC31)+IF(I30>0,(BI31-BJ31)*(CG31*CH31+CI31*CJ31)/BI31))","v":"-"},{"$f":"IF(Kold!$BL$44=1,\"-\",$U$6*$O$6*(0.5*E30*(INDEX(fladelast,BK31,1)+INDEX(fladelast,BK31,2)+INDEX(fladelast,BK31,3)*INDEX(fladelast,BK31,5))+IF(E30>0,(INDEX(linielast,BR31,1)+INDEX(linielast,BR31,2)+INDEX(linielast,BR31,3)*INDEX(linielast,BR31,5))*(E30-H30)/E30,0)))","v":"-"},{"$f":"IF(Kold!$BL$44=1,\"-\",P29+Q29+R29+$U$6*$O$6*(C31+D31))","v":"-"},{"$f":"IF(Kold!$BL$44=1,\"-\",$U$6*$O$6*(0.5*I30*(INDEX(fladelast,BY31,1)+INDEX(fladelast,BY31,2)+INDEX(fladelast,BY31,3)*INDEX(fladelast,BY31,5))+IF(I30>0,(INDEX(linielast,CF31,1)+INDEX(linielast,CF31,2)+INDEX(linielast,CF31,3)*INDEX(linielast,CF31,5))*(I30-L30)/I30)))","v":"-"},{"$f":"IF(Kold!$BL$44=1,\"-\",$Q$6*(0.5*E30*INDEX(fladelast,BK31,1)+IF(E30>0,INDEX(linielast,BR31,1)*(E30-H30)/E30)))","v":"-"},{"$f":"IF(Kold!$BL$44=1,\"-\",S29+T29+U29+$Q$6*C31)","v":"-"},{"$f":"IF(Kold!$BL$44=1,\"-\",$Q$6*(0.5*I30*INDEX(fladelast,BY31,1)+IF(I30>0,INDEX(linielast,CF31,1)*(I30-L30)/I30)))","v":"-"},null,null,null,null,null,null,null,null,null,null,null,null,null,null,null,null,null,null,null,null,null,null,null,null,null,null,null,null,null,null,null,null,null,null,null,null,null,6.0000099999999996,2,13.00001,2,{"$f":"Kold!BK30","v":4},5.65,1.32,null,null,null,null,{"$f":"Kold!BR30","v":2},12,1.32,null,null,null,null,{"$f":"Kold!BY30","v":3},5.15,1.32,null,null,null,null,{"$f":"Kold!CF30","v":3},8,1.32,null,null,null,null,344.44580830362094]
[null,{"$f":"Kold!B31","v":"9. sal"},{"$f":"Kold!C31","v":12},{"$f":"Kold!D31","v":5},{"$f":"Kold!E31","v":6},"F2","L2",{"$f":"Kold!H31","v":2},{"$f":"Kold!I31","v":13},"F3","L2",{"$f":"Kold!L31","v":2},{"$f":"IF(Kold!$BL$44=1,\"-\",0.5*BG32*(BL32*BM32+BN32*BO32)+IF(E31>0,(BG32-BH32)*(BS32*BT32+BU32*BV32)/BG32,0))","v":"-"},{"$f":"IF(Kold!$BL$44=1,\"-\",CM32+DT32)","v":"-"},{"$f":"IF(Kold!$BL$44=1,\"-\",0.5*BI32*(BZ32*CA32+CB32*CC32)+IF(I31>0,(BI32-BJ32)*(CG32*CH32+CI32*CJ32)/BI32))","v":"-"},{"$f":"IF(Kold!$BL$44=1,\"-\",$U$6*$O$6*(0.5*E31*(INDEX(fladelast,BK32,1)+INDEX(fladelast,BK32,2)+INDEX(fladelast,BK32,3)*INDEX(fladelast,BK32,5))+IF(E31>0,(INDEX(linielast,BR32,1)+INDEX(linielast,BR32,2)+INDEX(linielast,BR32,3)*INDEX(linielast,BR32,5))*(E31-H31)/E31,0)))","v":"-"},{"$f":"IF(Kold!$BL$44=1,\"-\",P30+Q30+R30+$U$6*$O$6*(C32+D32))","v":"-"},{"$f":"IF(Kold!$BL$44=1,\"-\",$U$6*$O$6*(0.5*I31*(INDEX(fladelast,BY32,1)+INDEX(fladelast,BY32,2)+INDEX(fladelast,BY32,3)*INDEX(fladelast,BY32,5))+IF(I31>0,(INDEX(linielast,CF32,1)+INDEX(linielast,CF32,2)+INDEX(linielast,CF32,3)*INDEX(linielast,CF32,5))*(I31-L31)/I31)))","v":"-"},{"$f":"IF(Kold!$BL$44=1,\"-\",$Q$6*(0.5*E31*INDEX(fladelast,BK32,1)+IF(E31>0,INDEX(linielast,BR32,1)*(E31-H31)/E31)))","v":"-"},{"$f":"IF(Kold!$BL$44=1,\"-\",S30+T30+U30+$Q$6*C32)","v":"-"},{"$f":"IF(Kold!$BL$44=1,\"-\",$Q$6*(0.5*I31*INDEX(fladelast,BY32,1)+IF(I31>0,INDEX(linielast,CF32,1)*(I31-L31)/I31)))","v":"-"},null,null,null,null,null,null,null,null,null,null,null,null,null,null,null,null,null,null,null,null,null,null,null,null,null,null,null,null,null,null,null,null,null,null,null,null,null,6.0000099999999996,2,13.00001,2,{"$f":"Kold!BK31","v":6},8.15,1.32,null,null,null,null,{"$f":"Kold!BR31","v":3},8,1.32,null,null,null,null,{"$f":"Kold!BY31","v":6},8.15,1.32,null,null,null,null,{"$f":"Kold!CF31","v":2},12,1.32,null,null,null,null,452.9422742486941]
[null,{"$f":"Kold!B32","v":"8. sal"},{"$f":"Kold!C32","v":12},{"$f":"Kold!D32","v":5},{"$f":"Kold!E32","v":6},"F6","L1",{"$f":"Kold!H32","v":2},{"$f":"Kold!I32","v":13},"F3","L2",{"$f":"Kold!L32","v":2},{"$f":"IF(Kold!$BL$44=1,\"-\",0.5*BG33*(BL33*BM33+BN33*BO33)+IF(E32>0,(BG33-BH33)*(BS33*BT33+BU33*BV33)/BG33,0))","v":"-"},{"$f":"IF(Kold!$BL$44=1,\"-\",CM33+DT33)","v":"-"},{"$f":"IF(Kold!$BL$44=1,\"-\",0.5*BI33*(BZ33*CA33+CB33*CC33)+IF(I32>0,(BI33-BJ33)*(CG33*CH33+CI33*CJ33)/BI33))","v":"-"},{"$f":"IF(Kold!$BL$44=1,\"-\",$U$6*$O$6*(0.5*E32*(INDEX(fladelast,BK33,1)+INDEX(fladelast,BK33,2)+INDEX(fladelast,BK33,3)*INDEX(fladelast,BK33,5))+IF(E32>0,(INDEX(linielast,BR33,1)+INDEX(linielast,BR33,2)+INDEX(linielast,BR33,3)*INDEX(linielast,BR33,5))*(E32-H32)/E32,0)))","v":"-"},{"$f":"IF(Kold!$BL$44=1,\"-\",P31+Q31+R31+$U$6*$O$6*(C33+D33))","v":"-"},{"$f":"IF(Kold!$BL$44=1,\"-\",$U$6*$O$6*(0.5*I32*(INDEX(fladelast,BY33,1)+INDEX(fladelast,BY33,2)+INDEX(fladelast,BY33,3)*INDEX(fladelast,BY33,5))+IF(I32>0,(INDEX(linielast,CF33,1)+INDEX(linielast,CF33,2)+INDEX(linielast,CF33,3)*INDEX(linielast,CF33,5))*(I32-L32)/I32)))","v":"-"},{"$f":"IF(Kold!$BL$44=1,\"-\",$Q$6*(0.5*E32*INDEX(fladelast,BK33,1)+IF(E32>0,INDEX(linielast,BR33,1)*(E32-H32)/E32)))","v":"-"},{"$f":"IF(Kold!$BL$44=1,\"-\",S31+T31+U31+$Q$6*C33)","v":"-"},{"$f":"IF(Kold!$BL$44=1,\"-\",$Q$6*(0.5*I32*INDEX(fladelast,BY33,1)+IF(I32>0,INDEX(linielast,CF33,1)*(I32-L32)/I32)))","v":"-"},null,null,null,null,null,null,null,null,null,null,null,null,null,null,null,null,null,null,null,null,null,null,null,null,null,null,null,null,null,null,null,null,null,null,null,null,null,6.0000099999999996,2,13.00001,2,{"$f":"Kold!BK32","v":3},5.15,1.32,null,null,null,null,{"$f":"Kold!BR32","v":3},8,1.32,null,null,null,null,{"$f":"Kold!BY32","v":4},5.65,1.32,null,null,null,null,{"$f":"Kold!CF32","v":3},8,1.32,null,null,null,null,598.02646649298276]
[null,{"$f":"Kold!B33","v":"7. sal"},{"$f":"Kold!C33","v":12},{"$f":"Kold!D33","v":5},{"$f":"Kold!E33","v":6},"F1","L1",{"$f":"Kold!H33","v":2},{"$f":"Kold!I33","v":13},"F5","L1",{"$f":"Kold!L33","v":2},{"$f":"IF(Kold!$BL$44=1,\"-\",0.5*BG34*(BL34*BM34+BN34*BO34)+IF(E33>0,(BG34-BH34)*(BS34*BT34+BU34*BV34)/BG34,0))","v":"-"},{"$f":"IF(Kold!$BL$44=1,\"-\",CM34+DT34)","v":"-"},{"$f":"IF(Kold!$BL$44=1,\"-\",0.5*BI34*(BZ34*CA34+CB34*CC34)+IF(I33>0,(BI34-BJ34)*(CG34*CH34+CI34*CJ34)/BI34))","v":"-"},{"$f":"IF(Kold!$BL$44=1,\"-\",$U$6*$O$6*(0.5*E33*(INDEX(fladelast,BK34,1)+INDEX(fladelast,BK34,2)+INDEX(fladelast,BK34,3)*INDEX(fladelast,BK34,5))+IF(E33>0,(INDEX(linielast,BR34,1)+INDEX(linielast,BR34,2)+INDEX(linielast,BR34,3)*INDEX(linielast,BR34,5))*(E33-H33)/E33,0)))","v":"-"},{"$f":"IF(Kold!$BL$44=1,\"-\",P32+Q32+R32+$U$6*$O$6*(C34+D34))","v":"-"},{"$f":"IF(Kold!$BL$44=1,\"-\",$U$6*$O$6*(0.5*I33*(INDEX(fladelast,BY34,1)+INDEX(fladelast,BY34,2)+INDEX(fladelast,BY34,3)*INDEX(fladelast,BY34,5))+IF(I33>0,(INDEX(linielast,CF34,1)+INDEX(linielast,CF34,2)+INDEX(linielast,CF34,3)*INDEX(linielast,CF34,5))*(I33-L33)/I33)))","v":"-"},{"$f":"IF(Kold!$BL$44=1,\"-\",$Q$6*(0.5*E33*INDEX(fladelast,BK34,1)+IF(E33>0,INDEX(linielast,BR34,1)*(E33-H33)/E33)))","v":"-"},{"$f":"IF(Kold!$BL$44=1,\"-\",S32+T32+U32+$Q$6*C34)","v":"-"},{"$f":"IF(Kold!$BL$44=1,\"-\",$Q$6*(0.5*I33*INDEX(fladelast,BY34,1)+IF(I33>0,INDEX(linielast,CF34,1)*(I33-L33)/I33)))","v":"-"},null,null,null,null,null,null,null,null,null,null,null,null,null,null,null,null,null,null,null,null,null,null,null,null,null,null,null,null,null,null,null,null,null,null,null,null,null,6.0000099999999996,2,13.00001,2,{"$f":"Kold!BK33","v":7},5.65,1.32,null,null,null,null,{"$f":"Kold!BR33","v":2},12,1.32,null,null,null,null,{"$f":"Kold!BY33","v":4},5.65,1.32,null,null,null,null,{"$f":"Kold!CF33","v":3},8,1.32,null,null,null,null,705.31292950472755]
[null,{"$f":"Kold!B34","v":"6. sal"},{"$f":"Kold!C34","v":12},{"$f":"Kold!D34","v":5},{"$f":"Kold!E34","v":6},"F6","L1",{"$f":"Kold!H34","v":2},{"$f":"Kold!I34","v":13},"F4","L1",{"$f":"Kold!L34","v":2},{"$f":"IF(Kold!$BL$44=1,\"-\",0.5*BG35*(BL35*BM35+BN35*BO35)+IF(E34>0,(BG35-BH35)*(BS35*BT35+BU35*BV35)/BG35,0))","v":"-"},{"$f":"IF(Kold!$BL$44=1,\"-\",CM35+DT35)","v":"-"},{"$f":"IF(Kold!$BL$44=1,\"-\",0.5*BI35*(BZ35*CA35+CB35*CC35)+IF(I34>0,(BI35-BJ35)*(CG35*CH35+CI35*CJ35)/BI35))","v":"-"},{"$f":"IF(Kold!$BL$44=1,\"-\",$U$6*$O$6*(0.5*E34*(INDEX(fladelast,BK35,1)+INDEX(fladelast,BK35,2)+INDEX(fladelast,BK35,3)*INDEX(fladelast,BK35,5))+IF(E34>0,(INDEX(linielast,BR35,1)+INDEX(linielast,BR35,2)+INDEX(linielast,BR35,3)*INDEX(linielast,BR35,5))*(E34-H34)/E34,0)))","v":"-"},{"$f":"IF(Kold!$BL$44=1,\"-\",P33+Q33+R33+$U$6*$O$6*(C35+D35))","v":"-"},{"$f":"IF(Kold!$BL$44=1,\"-\",$U$6*$O$6*(0.5*I34*(INDEX(fladelast,BY35,1)+INDEX(fladelast,BY35,2)+INDEX(fladelast,BY35,3)*INDEX(fladelast,BY35,5))+IF(I34>0,(INDEX(linielast,CF35,1)+INDEX(linielast,CF35,2)+INDEX(linielast,CF35,3)*INDEX(linielast,CF35,5))*(I34-L34)/I34)))","v":"-"},{"$f":"IF(Kold!$BL$44=1,\"-\",$Q$6*(0.5*E34*INDEX(fladelast,BK35,1)+IF(E34>0,INDEX(linielast,BR35,1)*(E34-H34)/E34)))","v":"-"},{"$f":"IF(Kold!$BL$44=1,\"-\",S33+T33+U33+$Q$6*C35)","v":"-"},{"$f":"IF(Kold!$BL$44=1,\"-\",$Q$6*(0.5*I34*INDEX(fladelast,BY35,1)+IF(I34>0,INDEX(linielast,CF35,1)*(I34-L34)/I34)))","v":"-"},null,null,null,null,null,null,null,null,null,null,null,null,null,null,null,null,null,null,null,null,null,null,null,null,null,null,null,null,null,null,null,null,null,null,null,null,null,6.0000099999999996,2,13.00001,2,{"$f":"Kold!BK34","v":2},4.0999999999999996,1.32,null,null,null,null,{"$f":"Kold!BR34","v":2},12,1.32,null,null,null,null,{"$f":"Kold!BY34","v":6},8.15,1.32,null,null,null,null,{"$f":"Kold!CF34","v":2},12,1.32,null,null,null,null,818.0993987498008]
[null,{"$f":"Kold!B35","v":"5. sal"},{"$f":"Kold!C35","v":12},{"$f":"Kold!D35","v":5},{"$f":"Kold!E35","v":6},"F6","L1",{"$f":"Kold!H35","v":2},{"$f":"Kold!I35","v":13},"F7","L1",{"$f":"Kold!L35","v":2},{"$f":"IF(Kold!$BL$44=1,\"-\",0.5*BG36*(BL36*BM36+BN36*BO36)+IF(E35>0,(BG36-BH36)*(BS36*BT36+BU36*BV36)/BG36,0))","v":"-"},{"$f":"IF(Kold!$BL$44=1,\"-\",CM36+DT36)","v":"-"},{"$f":"IF(Kold!$BL$44=1,\"-\",0.5*BI36*(BZ36*CA36+CB36*CC36)+IF(I35>0,(BI36-BJ36)*(CG36*CH36+CI36*CJ36)/BI36))","v":"-"},{"$f":"IF(Kold!$BL$44=1,\"-\",$U$6*$O$6*(0.5*E35*(INDEX(fladelast,BK36,1)+INDEX(fladelast,BK36,2)+INDEX(fladelast,BK36,3)*INDEX(fladelast,BK36,5))+IF(E35>0,(INDEX(linielast,BR36,1)+INDEX(linielast,BR36,2)+INDEX(linielast,BR36,3)*INDEX(linielast,BR36,5))*(E35-H35)/E35,0)))","v":"-"},{"$f":"IF(Kold!$BL$44=1,\"-\",P34+Q34+R34+$U$6*$O$6*(C36+D36))","v":"-"},{"$f":"IF(Kold!$BL$44=1,\"-\",$U$6*$O$6*(0.5*I35*(INDEX(fladelast,BY36,1)+INDEX(fladelast,BY36,2)+INDEX(fladelast,BY36,3)*INDEX(fladelast,BY36,5))+IF(I35>0,(INDEX(linielast,CF36,1)+INDEX(linielast,CF36,2)+INDEX(linielast,CF36,3)*INDEX(linielast,CF36,5))*(I35-L35)/I35)))","v":"-"},{"$f":"IF(Kold!$BL$44=1,\"-\",$Q$6*(0.5*E35*INDEX(fladelast,BK36,1)+IF(E35>0,INDEX(linielast,BR36,1)*(E35-H35)/E35)))","v":"-"},{"$f":"IF(Kold!$BL$44=1,\"-\",S34+T34+U34+$Q$6*C36)","v":"-"},{"$f":"IF(Kold!$BL$44=1,\"-\",$Q$6*(0.5*I35*INDEX(fladelast,BY36,1)+IF(I35>0,INDEX(linielast,CF36,1)*(I35-L35)/I35)))","v":"-"},null,null,null,null,null,null,null,null,null,null,null,null,null,null,null,null,null,null,null,null,null,null,null,null,null,null,null,null,null,null,null,null,null,null,null,null,null,6.0000099999999996,2,13.00001,2,{"$f":"Kold!BK35","v":7},5.65,1.32,null,null,null,null,{"$f":"Kold!BR35","v":2},12,1.32,null,null,null,null,{"$f":"Kold!BY35","v":5},5.65,1.32,null,null,null,null,{"$f":"Kold!CF35","v":2},12,1.32,null,null,null,null,950.66556719741789]
[null,{"$f":"Kold!B36","v":"4. sal"},{"$f":"Kold!C36","v":12},{"$f":"Kold!D36","v":5},{"$f":"Kold!E36","v":6},"F6","L2",{"$f":"Kold!H36","v":2},{"$f":"Kold!I36","v":13},"F2","L1",{"$f":"Kold!L36","v":2},{"$f":"IF(Kold!$BL$44=1,\"-\",0.5*BG37*(BL37*BM37+BN37*BO37)+IF(E36>0,(BG37-BH37)*(BS37*BT37+BU37*BV37)/BG37,0))","v":"-"},{"$f":"IF(Kold!$BL$44=1,\"-\",CM37+DT37)","v":"-"},{"$f":"IF(Kold!$BL$44=1,\"-\",0.5*BI37*(BZ37*CA37+CB37*CC37)+IF(I36>0,(BI37-BJ37)*(CG37*CH37+CI37*CJ37)/BI37))","v":"-"},{"$f":"IF(Kold!$BL$44=1,\"-\",$U$6*$O$6*(0.5*E36*(INDEX(fladelast,BK37,1)+INDEX(fladelast,BK37,2)+INDEX(fladelast,BK37,3)*INDEX(fladelast,BK37,5))+IF(E36>0,(INDEX(linielast,BR37,1)+INDEX(linielast,BR37,2)+INDEX(linielast,BR37,3)*INDEX(linielast,BR37,5))*(E36-H36)/E36,0)))","v":"-"},{"$f":"IF(Kold!$BL$44=1,\"-\",P35+Q35+R35+$U$6*$O$6*(C37+D37))","v":"-"},{"$f":"IF(Kold!$BL$44=1,\"-\",$U$6*$O$6*(0.5*I36*(INDEX(fladelast,BY37,1)+INDEX(fladelast,BY37,2)+INDEX(fladelast,BY37,3)*INDEX(fladelast,BY37,5))+IF(I36>0,(INDEX(linielast,CF37,1)+INDEX(linielast,CF37,2)+INDEX(linielast,CF37,3)*INDEX(linielast,CF37,5))*(I36-L36)/I36)))","v":"-"},{"$f":"IF(Kold!$BL$44=1,\"-\",$Q$6*(0.5*E36*INDEX(fladelast,BK37,1)+IF(E36>0,INDEX(linielast,BR37,1)*(E36-H36)/E36)))","v":"-"},{"$f":"IF(Kold!$BL$44=1,\"-\",S35+T35+U35+$Q$6*C37)","v":"-"},{"$f":"IF(Kold!$BL$44=1,\"-\",$Q$6*(0.5*I36*INDEX(fladelast,BY37,1)+IF(I36>0,INDEX(linielast,CF37,1)*(I36-L36)/I36)))","v":"-"},null,null,null,null,null,null,null,null,null,null,null,null,null,null,null,null,null,null,null,null,null,null,null,null,null,null,null,null,null,null,null,null,null,null,null,null,null,6.0000099999999996,2,13.00001,2,{"$f":"Kold!BK36","v":7},5.65,1.32,null,null,null,null,{"$f":"Kold!BR36","v":2},12,1.32,null,null,null,null,{"$f":"Kold!BY36","v":8},5.65,1.32,null,null,null,null,{"$f":"Kold!CF36","v":2},12,1.32,null,null,null,null,1067.9197293750351]
[null,{"$f":"Kold!B37","v":"3. sal"},{"$f":"Kold!C37","v":12},{"$f":"Kold!D37","v":5},{"$f":"Kold!E37","v":6},"F5","L1",{"$f":"Kold!H37","v":2},{"$f":"Kold!I37","v":13},"F2","L2",{"$f":"Kold!L37","v":2},{"$f":"IF(Kold!$BL$44=1,\"-\",0.5*BG38*(BL38*BM38+BN38*BO38)+IF(E37>0,(BG38-BH38)*(BS38*BT38+BU38*BV38)/BG38,0))","v":"-"},{"$f":"IF(Kold!$BL$44=1,\"-\",CM38+DT38)","v":"-"},{"$f":"IF(Kold!$BL$44=1,\"-\",0.5*BI38*(BZ38*CA38+CB38*CC38)+IF(I37>0,(BI38-BJ38)*(CG38*CH38+CI38*CJ38)/BI38))","v":"-"},{"$f":"IF(Kold!$BL$44=1,\"-\",$U$6*$O$6*(0.5*E37*(INDEX(fladelast,BK38,1)+INDEX(fladelast,BK38,2)+INDEX(fladelast,BK38,3)*INDEX(fladelast,BK38,5))+IF(E37>0,(INDEX(linielast,BR38,1)+INDEX(linielast,BR38,2)+INDEX(linielast,BR38,3)*INDEX(linielast,BR38,5))*(E37-H37)/E37,0)))","v":"-"},{"$f":"IF(Kold!$BL$44=1,\"-\",P36+Q36+R36+$U$6*$O$6*(C38+D38))","v":"-"},{"$f":"IF(Kold!$BL$44=1,\"-\",$U$6*$O$6*(0.5*I37*(INDEX(fladelast,BY38,1)+INDEX(fladelast,BY38,2)+INDEX(fladelast,BY38,3)*INDEX(fladelast,BY38,5))+IF(I37>0,(INDEX(linielast,CF38,1)+INDEX(linielast,CF38,2)+INDEX(linielast,CF38,3)*INDEX(linielast,CF38,5))*(I37-L37)/I37)))","v":"-"},{"$f":"IF(Kold!$BL$44=1,\"-\",$Q$6*(0.5*E37*INDEX(fladelast,BK38,1)+IF(E37>0,INDEX(linielast,BR38,1)*(E37-H37)/E37)))","v":"-"},{"$f":"IF(Kold!$BL$44=1,\"-\",S36+T36+U36+$Q$6*C38)","v":"-"},{"$f":"IF(Kold!$BL$44=1,\"-\",$Q$6*(0.5*I37*INDEX(fladelast,BY38,1)+IF(I37>0,INDEX(linielast,CF38,1)*(I37-L37)/I37)))","v":"-"},null,null,null,null,null,null,null,null,null,null,null,null,null,null,null,null,null,null,null,null,null,null,null,null,null,null,null,null,null,null,null,null,null,null,null,null,null,6.0000099999999996,2,13.00001,2,{"$f":"Kold!BK37","v":7},5.65,1.32,null,null,null,null,{"$f":"Kold!BR37","v":3},8,1.32,null,null,null,null,{"$f":"Kold!BY37","v":3},5.15,1.32,null,null,null,null,{"$f":"Kold!CF37","v":2},12,1.32,null,null,null,null,1185.1738915526521]
[null,{"$f":"Kold!B38","v":"2. sal"},{"$f":"Kold!C38","v":12},{"$f":"Kold!D38","v":5},{"$f":"Kold!E38","v":6},"F5","L1",{"$f":"Kold!H38","v":2},{"$f":"Kold!I38","v":13},"F3","L1",{"$f":"Kold!L38","v":2},{"$f":"IF(Kold!$BL$44=1,\"-\",0.5*BG39*(BL39*BM39+BN39*BO39)+IF(E38>0,(BG39-BH39)*(BS39*BT39+BU39*BV39)/BG39,0))","v":"-"},{"$f":"IF(Kold!$BL$44=1,\"-\",CM39+DT39)","v":"-"},{"$f":"IF(Kold!$BL$44=1,\"-\",0.5*BI39*(BZ39*CA39+CB39*CC39)+IF(I38>0,(BI39-BJ39)*(CG39*CH39+CI39*CJ39)/BI39))","v":"-"},{"$f":"IF(Kold!$BL$44=1,\"-\",$U$6*$O$6*(0.5*E38*(INDEX(fladelast,BK39,1)+INDEX(fladelast,BK39,2)+INDEX(fladelast,BK39,3)*INDEX(fladelast,BK39,5))+IF(E38>0,(INDEX(linielast,BR39,1)+INDEX(linielast,BR39,2)+INDEX(linielast,BR39,3)*INDEX(linielast,BR39,5))*(E38-H38)/E38,0)))","v":"-"},{"$f":"IF(Kold!$BL$44=1,\"-\",P37+Q37+R37+$U$6*$O$6*(C39+D39))","v":"-"},{"$f":"IF(Kold!$BL$44=1,\"-\",$U$6*$O$6*(0.5*I38*(INDEX(fladelast,BY39,1)+INDEX(fladelast,BY39,2)+INDEX(fladelast,BY39,3)*INDEX(fladelast,BY39,5))+IF(I38>0,(INDEX(linielast,CF39,1)+INDEX(linielast,CF39,2)+INDEX(linielast,CF39,3)*INDEX(linielast,CF39,5))*(I38-L38)/I38)))","v":"-"},{"$f":"IF(Kold!$BL$44=1,\"-\",$Q$6*(0.5*E38*INDEX(fladelast,BK39,1)+IF(E38>0,INDEX(linielast,BR39,1)*(E38-H38)/E38)))","v":"-"},{"$f":"IF(Kold!$BL$44=1,\"-\",S37+T37+U37+$Q$6*C39)","v":"-"},{"$f":"IF(Kold!$BL$44=1,\"-\",$Q$6*(0.5*I38*INDEX(fladelast,BY39,1)+IF(I38>0,INDEX(linielast,CF39,1)*(I38-L38)/I38)))","v":"-"},null," NB:  Resultaterne skal altid kontrolleres af ansvarlig statiker",null,null,null,null,null,null,null,null,null,null,null,null,null,null,null,null,null,null,null,null,null,null,null,null,null,null,null,null,null,null,null,null,null,null,null,6.0000099999999996,2,13.00001,2,{"$f":"Kold!BK38","v":6},8.15,1.32,null,null,null,null,{"$f":"Kold!BR38","v":2},12,1.32,null,null,null,null,{"$f":"Kold!BY38","v":3},5.15,1.32,null,null,null,null,{"$f":"Kold!CF38","v":3},8,1.32,null,null,null,null,1294.6180474969406]
[null,{"$f":"Kold!B39","v":"1. sal"},{"$f":"Kold!C39","v":12},{"$f":"Kold!D39","v":5},{"$f":"Kold!E39","v":6},"F4","L1",{"$f":"Kold!H39","v":2},{"$f":"Kold!I39","v":13},"F5","L1",{"$f":"Kold!L39","v":2},{"$f":"IF(Kold!$BL$44=1,\"-\",0.5*BG40*(BL40*BM40+BN40*BO40)+IF(E39>0,(BG40-BH40)*(BS40*BT40+BU40*BV40)/BG40,0))","v":"-"},{"$f":"IF(Kold!$BL$44=1,\"-\",CM40+DT40)","v":"-"},{"$f":"IF(Kold!$BL$44=1,\"-\",0.5*BI40*(BZ40*CA40+CB40*CC40)+IF(I39>0,(BI40-BJ40)*(CG40*CH40+CI40*CJ40)/BI40))","v":"-"},{"$f":"IF(Kold!$BL$44=1,\"-\",$U$6*$O$6*(0.5*E39*(INDEX(fladelast,BK40,1)+INDEX(fladelast,BK40,2)+INDEX(fladelast,BK40,3)*INDEX(fladelast,BK40,5))+IF(E39>0,(INDEX(linielast,BR40,1)+INDEX(linielast,BR40,2)+INDEX(linielast,BR40,3)*INDEX(linielast,BR40,5))*(E39-H39)/E39,0)))","v":"-"},{"$f":"IF(Kold!$BL$44=1,\"-\",P38+Q38+R38+$U$6*$O$6*(C40+D40))","v":"-"},{"$f":"IF(Kold!$BL$44=1,\"-\",$U$6*$O$6*(0.5*I39*(INDEX(fladelast,BY40,1)+INDEX(fladelast,BY40,2)+INDEX(fladelast,BY40,3)*INDEX(fladelast,BY40,5))+IF(I39>0,(INDEX(linielast,CF40,1)+INDEX(linielast,CF40,2)+INDEX(linielast,CF40,3)*INDEX(linielast,CF40,5))*(I39-L39)/I39)))","v":"-"},{"$f":"IF(Kold!$BL$44=1,\"-\",$Q$6*(0.5*E39*INDEX(fladelast,BK40,1)+IF(E39>0,INDEX(linielast,BR40,1)*(E39-H39)/E39)))","v":"-"},{"$f":"IF(Kold!$BL$44=1,\"-\",S38+T38+U38+$Q$6*C40)","v":"-"},{"$f":"IF(Kold!$BL$44=1,\"-\",$Q$6*(0.5*I39*INDEX(fladelast,BY40,1)+IF(I39>0,INDEX(linielast,CF40,1)*(I39-L39)/I39)))","v":"-"},null,null,null,null,null,null,null,null,null,null,null,null,null,null,null,null,null,null,null,null,null,null,null,null,null,null,null,null,null,null,null,null,null,null,null,null,null,6.0000099999999996,2,13.00001,2,{"$f":"Kold!BK39","v":6},8.15,1.32,null,null,null,null,{"$f":"Kold!BR39","v":2},12,1.32,null,null,null,null,{"$f":"Kold!BY39","v":4},5.65,1.32,null,null,null,null,{"$f":"Kold!CF39","v":2},12,1.32,null,null,null,null,1413.0145299420135]
[null,{"$f":"Kold!B40","v":"Stue"},{"$f":"Kold!C40","v":12},{"$f":"Kold!D40","v":5},{"$f":"Kold!E40","v":6},"F3","L2",{"$f":"Kold!H40","v":2},{"$f":"Kold!I40","v":13},"F6","L2",{"$f":"Kold!L40","v":2},{"$f":"IF(Kold!$BL$44=1,\"-\",0.5*BG41*(BL41*BM41+BN41*BO41)+IF(E40>0,(BG41-BH41)*(BS41*BT41+BU41*BV41)/BG41,0))","v":"-"},{"$f":"IF(Kold!$BL$44=1,\"-\",CM41+DT41)","v":"-"},{"$f":"IF(Kold!$BL$44=1,\"-\",0.5*BI41*(BZ41*CA41+CB41*CC41)+IF(I40>0,(BI41-BJ41)*(CG41*CH41+CI41*CJ41)/BI41))","v":"-"},{"$f":"IF(Kold!$BL$44=1,\"-\",$U$6*$O$6*(0.5*E40*(INDEX(fladelast,BK41,1)+INDEX(fladelast,BK41,2)+INDEX(fladelast,BK41,3)*INDEX(fladelast,BK41,5))+IF(E40>0,(INDEX(linielast,BR41,1)+INDEX(linielast,BR41,2)+INDEX(linielast,BR41,3)*INDEX(linielast,BR41,5))*(E40-H40)/E40,0)))","v":"-"},{"$f":"IF(Kold!$BL$44=1,\"-\",P39+Q39+R39+$U$6*$O$6*(C41+D41))","v":"-"},{"$f":"IF(Kold!$BL$44=1,\"-\",$U$6*$O$6*(0.5*I40*(INDEX(fladelast,BY41,1)+INDEX(fladelast,BY41,2)+INDEX(fladelast,BY41,3)*INDEX(fladelast,BY41,5))+IF(I40>0,(INDEX(linielast,CF41,1)+INDEX(linielast,CF41,2)+INDEX(linielast,CF41,3)*INDEX(linielast,CF41,5))*(I40-L40)/I40)))","v":"-"},{"$f":"IF(Kold!$BL$44=1,\"-\",$Q$6*(0.5*E40*INDEX(fladelast,BK41,1)+IF(E40>0,INDEX(linielast,BR41,1)*(E40-H40)/E40)))","v":"-"},{"$f":"IF(Kold!$BL$44=1,\"-\",S39+T39+U39+$Q$6*C41)","v":"-"},{"$f":"IF(Kold!$BL$44=1,\"-\",$Q$6*(0.5*I40*INDEX(fladelast,BY41,1)+IF(I40>0,INDEX(linielast,CF41,1)*(I40-L40)/I40)))","v":"-"},null,"Vejledning:",null,null,"Betonelementbyggeriers statik",null,null,null,null,null,null,null,null,null,null,null,null,null,null,null,null,null,null,null,null,null,null,null,null,null,null,null,null,null,null,null,null,6.0000099999999996,2,13.00001,2,{"$f":"Kold!BK40","v":5},5.65,1.32,null,null,null,null,{"$f":"Kold!BR40","v":2},12,1.32,null,null,null,null,{"$f":"Kold!BY40","v":6},8.15,1.32,null,null,null,null,{"$f":"Kold!CF40","v":2},12,1.32,null,null,null,null,1540.1687086196305]
[null,{"$f":"Kold!B41","v":"Kld."},{"$f":"Kold!C41","v":12},{"$f":"Kold!D41","v":5},null,null,null,null,null,null,null,null,null,{"$f":"IF(Kold!$BL$44=1,\"-\",CM42+DT42)","v":"-"},null,null,{"$f":"IF(Kold!$BL$44=1,\"-\",P40+Q40+R40)","v":"-"},null,null,{"$f":"IF(Kold!$BL$44=1,\"-\",S40+T40+U40)","v":"-"},null,null,"Polyteknisk Forlag 2010 eller www.bef.dk",null,null,null,null,null,null,null,null,null,null,null,null,null,null,null,null,null,null,null,null,null,null,null,null,null,null,null,null,null,null,null,null,null,null,null,6.0000099999999996,2,13.00001,2,{"$f":"Kold!BK41","v":4},5.65,1.32,null,null,null,null,{"$f":"Kold!BR41","v":3},8,1.32,null,null,null,null,{"$f":"Kold!BY41","v":7},5.65,1.32,null,null,null,null,{"$f":"Kold!CF41","v":3},8,1.32,null,null,null,null,{"$f":"CM40+0.5*BG40*(BL40*BM40)+IF(E39>0,(BG40-BH40)*(BS40*BT40)/BG40)+0.5*BI40*(BZ40*CA40)+IF(I39>0,(BI40-BJ40)*(CG40*CH40)/BI40)+(C41+D41)*$U$6*$O$6","v":1678.8728872972474}]
[null,"Vejledning:",null,"Betonelementbyggeriers statik",null,null,null,null,null,null,null,"Polyteknisk Forlag 2010 eller www.bef.dk"," NB:  Resultaterne skal altid kontrolleres af ansvarlig statiker",null,null,null,null,null,null,null,null,null,null,null,null,null,null,null,null,null,null,null,null,null,null,null,null,null,null,null,null,null,null,null,null,null,null,null,null,null,null,null,null,null,null,null,null,null,null,null,null,null,null,null,null,null,null,null,null,null,null,null,null,null,null,null,null,null,null,null,null,null,null,null,null,null,null,null,null,null,{"$f":"CM41+0.5*BG41*(BL41*BM41)+IF(E40>0,(BG41-BH41)*(BS41*BT41)/BG41)+0.5*BI41*(BZ41*CA41)+IF(I40>0,(BI41-BJ41)*(CG41*CH41)/BI41)","v":1765.6993536089919}]
[]
[null,null,null,null,null,null,null,null,null,null,null,null,null,null,null,null,null,null,null,null,null,null,null,null,null,null,null,null,null,null,null,null,null,null,null,null,null,null,null,null,null,null,null,null,null,null,null,null,null,null,null,null,null,null,null,null,null,null,"Fejltabel",null,null,null,null,{"$f":"IF(MAX(BL45:BL56)=1,1,0)","v":0},{"$f":"BM45&BM46&BM47&BM48&BM49&BM50&BM51&BM52&BM53&BM54&BM55&BM56","v":""}]
[null,null,null,null,null,null,null,null,null,null,null,null,null,null,null,null,null,null,null,null,null,null,null,null,null,null,null,null,null,null,null,null,null,null,null,null,null,null,null,null,null,null,null,null,null,null,null,null,null,null,null,null,null,null,null,null,null,null,"Programmet modtager ikke negative inddata !  ",null,null,null,null,{"$f":"IF(MIN(O6,Q6,U6,BJ61:BN65,BJ72:BN73,C27:D41,E26:E40,H26:H40,I26:I40,L26:L40)<0,1,0)","v":0},{"$f":"IF(BL45=0,\"\",BG45)","v":""}]
[null,null,null,null,null,null,null,null,null,null,null,null,null,null,null,null,null,null,null,null,null,null,null,null,null,null,null,null,null,null,null,null,null,null,null,null,null,null,null,null,null,null,null,null,null,null,null,null,null,null,null,null,null,null,null,null,null,null,"Linielast udenfor dækfelt !  ",null,null,null,null,{"$f":"Kold!BL46","v":0},{"$f":"IF(BL46=0,\"\",BG46)","v":""}]
[null,null,null,null,null,null,null,null,null,null,null,null,null,null,null,null,null,null,null,null,null,null,null,null,null,null,null,null,null,null,null,null,null,null,null,null,null,null,null,null,null,null,null,null,null,null,null,null,null,null,null,null,null,null,null,null,null,null,"Primær reduktionsfaktor skal være størst !",null,null,null,null,{"$f":"IF(OR(T10>S10,T11>S11,T12>S12,T13>S13,T14>S14,T21>S21,T22>S22,T15>S15,T16>S16,T17>S17,T18>S18),1,0)","v":0},{"$f":"IF(BL47=0,\"\",BG47)","v":""}]
[]
[]
[]
[]
[]
[]
[]
[]
[]
[]
[]
[null,null,null,null,null,null,null,null,null,null,null,null,null,null,null,null,null,null,null,null,null,null,null,null,null,null,null,null,null,null,null,null,null,null,null,null,null,null,null,null,null,null,null,null,null,null,null,null,null,null,null,null,null,null,null,null,null,null," Fladelaste",null,null,"gk","gfri,k","qk","yq1/yq2","yq2","Kategori"]
[null,null,null,null,null,null,null,null,null,null,null,null,null,null,null,null,null,null,null,null,null,null,null,null,null,null,null,null,null,null,null,null,null,null,null,null,null,null,null,null,null,null,null,null,null,null,null,null,null,null,null,null,null,null,null,null,null,null,"F0",null,null,0,0,0]
[null,null,null,null,null,null,null,null,null,null,null,null,null,null,null,null,null,null,null,null,null,null,null,null,null,null,null,null,null,null,null,null,null,null,null,null,null,null,null,null,null,null,null,null,null,null,null,null,null,null,null,null,null,null,null,null,null,null,{"$f":"Kold!M10","v":"F1"},{"$f":"Kold!N10","v":"Tagflade, sne"},{"$f":"Kold!O10","v":0},{"$f":"Kold!P10","v":3.1},{"$f":"Kold!Q10","v":1},{"$f":"Kold!R10","v":0.8},{"$f":"S10","v":0},{"$f":"T10","v":0},{"$f":"INDEX($BG$9:$BG$16,BI10,1)","v":{"$error":"#VALUE!"}}]
[null,null,null,null,null,null,null,null,null,null,null,null,null,null,null,null,null,null,null,null,null,null,null,null,null,null,null,null,null,null,null,null,null,null,null,null,null,null,null,null,null,null,null,null,null,null,null,null,null,null,null,null,null,null,null,null,null,null,{"$f":"Kold!M11","v":"F2"},{"$f":"Kold!N11","v":"Boligarealer"},{"$f":"Kold!O11","v":0},{"$f":"Kold!P11","v":3.65},{"$f":"Kold!Q11","v":1.5},{"$f":"Kold!R11","v":1.5},{"$f":"S11","v":0},0,{"$f":"INDEX($BG$9:$BG$16,BI11,1)","v":{"$error":"#VALUE!"}}]
[null,null,null,null,null,null,null,null,null,null,null,null,null,null,null,null,null,null,null,null,null,null,null,null,null,null,null,null,null,null,null,null,null,null,null,null,null,null,null,null,null,null,null,null,null,null,null,null,null,null,null,null,null,null,null,null,null,null,{"$f":"Kold!M12","v":"F3"},{"$f":"Kold!N12","v":"Kontorer"},{"$f":"Kold!O12","v":0},{"$f":"Kold!P12","v":3.65},{"$f":"Kold!Q12","v":2},{"$f":"Kold!R12","v":2.5},0,0,{"$error":"#VALUE!"}]
[null,null,null,null,null,null,null,null,null,null,null,null,null,null,null,null,null,null,null,null,null,null,null,null,null,null,null,null,null,null,null,null,null,null,null,null,null,null,null,null,null,null,null,null,null,null,null,null,null,null,null,null,null,null,null,null,null,null,{"$f":"Kold!M13","v":"F4"},{"$f":"Kold!N13","v":"Kontor med arkiv"},{"$f":"Kold!O13","v":0},{"$f":"Kold!P13","v":3.65},{"$f":"Kold!Q13","v":2},{"$f":"Kold!R13","v":7.5},0,0,{"$error":"#VALUE!"}]
[null,null,null,null,null,null,null,null,null,null,null,null,null,null,null,null,null,null,null,null,null,null,null,null,null,null,null,null,null,null,null,null,null,null,null,null,null,null,null,null,null,null,null,null,null,null,null,null,null,null,null,null,null,null,null,null,null,null,{"$f":"Kold!M14","v":"F5"},{"$f":"Kold!N14","v":"Kontorer"},{"$f":"Kold!O14","v":0},{"$f":"Kold!P14","v":4.1500000000000004},{"$f":"Kold!Q14","v":4},{"$f":"Kold!R14","v":4},0,0,{"$error":"#VALUE!"}]
[null,null,null,null,null,null,null,null,null,null,null,null,null,null,null,null,null,null,null,null,null,null,null,null,null,null,null,null,null,null,null,null,null,null,null,null,null,null,null,null,null,null,null,null,null,null,null,null,null,null,null,null,null,null,null,null,null,null,{"$f":"Kold!M15","v":"F6"},{"$f":"Kold!N15","v":"Kontorer"},{"$f":"Kold!O15","v":0},{"$f":"Kold!P15","v":3.65},{"$f":"Kold!Q15","v":2},{"$f":"Kold!R15","v":3.3},0,0,{"$error":"#VALUE!"}]
[null,null,null,null,null,null,null,null,null,null,null,null,null,null,null,null,null,null,null,null,null,null,null,null,null,null,null,null,null,null,null,null,null,null,null,null,null,null,null,null,null,null,null,null,null,null,null,null,null,null,null,null,null,null,null,null,null,null,{"$f":"Kold!M16","v":"F7"},{"$f":"Kold!N16","v":"Undervisning"},{"$f":"Kold!O16","v":0},{"$f":"Kold!P16","v":3.65},{"$f":"Kold!Q16","v":2},{"$f":"Kold!R16","v":4.8},0,0,{"$error":"#VALUE!"}]
[null,null,null,null,null,null,null,null,null,null,null,null,null,null,null,null,null,null,null,null,null,null,null,null,null,null,null,null,null,null,null,null,null,null,null,null,null,null,null,null,null,null,null,null,null,null,null,null,null,null,null,null,null,null,null,null,null,null,{"$f":"Kold!M17","v":"F8"},{"$f":"Kold!N17","v":"Værksted"},{"$f":"Kold!O17","v":0},{"$f":"Kold!P17","v":3.65},{"$f":"Kold!Q17","v":2},{"$f":"Kold!R17","v":8.3000000000000007},0,0,{"$error":"#VALUE!"}]
[null,null,null,null,null,null,null,null,null,null,null,null,null,null,null,null,null,null,null,null,null,null,null,null,null,null,null,null,null,null,null,null,null,null,null,null,null,null,null,null,null,null,null,null,null,null,null,null,null,null,null,null,null,null,null,null,null,null,{"$f":"Kold!M18","v":"F9"},{"$f":"Kold!N18","v":"Butiksarealer"},{"$f":"Kold!O18","v":0},{"$f":"Kold!P18","v":3.65},{"$f":"Kold!Q18","v":2},{"$f":"Kold!R18","v":3.3},0,0,{"$error":"#VALUE!"}]
[null,null,null,null,null,null,null,null,null,null,null,null,null,null,null,null,null,null,null,null,null,null,null,null,null,null,null,null,null,null,null,null,null,null,null,null,null,null,null,null,null,null,null,null,null,null,null,null,null,null,null,null,null,null,null,null,null,null,"Linielaste",null,null,"gk","gfri,k","qk","yq1/yq2","yq2","Kategori"]
[null,null,null,null,null,null,null,null,null,null,null,null,null,null,null,null,null,null,null,null,null,null,null,null,null,null,null,null,null,null,null,null,null,null,null,null,null,null,null,null,null,null,null,null,null,null,null,null,null,null,null,null,null,null,null,null,null,null,"L0",null,null,0,0,0]
[null,null,null,null,null,null,null,null,null,null,null,null,null,null,null,null,null,null,null,null,null,null,null,null,null,null,null,null,null,null,null,null,null,null,null,null,null,null,null,null,null,null,null,null,null,null,null,null,null,null,null,null,null,null,null,null,null,null,{"$f":"Kold!M21","v":"L1"},{"$f":"Kold!N21","v":"Badeværelser"},{"$f":"Kold!O21","v":0},{"$f":"Kold!P21","v":8},{"$f":"Kold!Q21","v":4},{"$f":"Kold!R21","v":6},{"$f":"S21","v":0},{"$f":"T21","v":0},{"$f":"INDEX($BG$9:$BG$16,BI21,1)","v":{"$error":"#VALUE!"}}]
[null,null,null,null,null,null,null,null,null,null,null,null,null,null,null,null,null,null,null,null,null,null,null,null,null,null,null,null,null,null,null,null,null,null,null,null,null,null,null,null,null,null,null,null,null,null,null,null,null,null,null,null,null,null,null,null,null,null,{"$f":"Kold!M22","v":"L2"},{"$f":"Kold!N22","v":"Komprimator"},{"$f":"Kold!O22","v":0},{"$f":"Kold!P22","v":0},{"$f":"Kold!Q22","v":8},{"$f":"Kold!R22","v":10},{"$f":"S22","v":0},{"$f":"T22","v":0},{"$f":"INDEX($BG$9:$BG$16,BI22,1)","v":{"$error":"#VALUE!"}}]

{"sheet":"Geometri","index":3,"n_rows":39,"n_cols":81,"rows_kept":39,"cut":false,"hidden":false,"merged":[[1,3,1,4]]}
[null,null,1,null,null,1,2,null,2,{"$f":"G1+1","v":3},null,{"$f":"J1","v":3},{"$f":"J1+1","v":4},null,{"$f":"M1","v":4},{"$f":"M1+1","v":5},null,{"$f":"P1","v":5},{"$f":"P1+1","v":6},null,{"$f":"S1","v":6},{"$f":"S1+1","v":7},null,{"$f":"V1","v":7},{"$f":"V1+1","v":8},null,{"$f":"Y1","v":8},{"$f":"Y1+1","v":9},null,{"$f":"AB1","v":9},{"$f":"AB1+1","v":10},null,{"$f":"AE1","v":10},{"$f":"AE1+1","v":11},null,{"$f":"AH1","v":11},{"$f":"AH1+1","v":12},null,{"$f":"AK1","v":12},{"$f":"AK1+1","v":13},null,{"$f":"AN1","v":13},{"$f":"AN1+1","v":14},null,{"$f":"AQ1","v":14},{"$f":"AQ1+1","v":15},null,{"$f":"AT1","v":15},null,null,null,1,2,3,4,5,6,7,8,9,10,11,12,13,14,15,1,2,3,4,5,6,7,8,9,10,11,12,13,14,15]
[null,null,1,"Tag",null,3,1,{"$f":"15-G1&\". Sal\"","v":"13. Sal"},3,1,{"$f":"15-J1&\". Sal\"","v":"12. Sal"},3,1,{"$f":"15-M1&\". Sal\"","v":"11. Sal"},3,1,{"$f":"15-P1&\". Sal\"","v":"10. Sal"},3,1,{"$f":"15-S1&\". Sal\"","v":"9. Sal"},3,1,{"$f":"15-V1&\". Sal\"","v":"8. Sal"},3,1,{"$f":"15-Y1&\". Sal\"","v":"7. Sal"},3,1,{"$f":"15-AB1&\". Sal\"","v":"6. Sal"},3,1,{"$f":"15-AE1&\". Sal\"","v":"5. Sal"},3,1,{"$f":"15-AH1&\". Sal\"","v":"4. Sal"},3,1,{"$f":"15-AK1&\". Sal\"","v":"3. Sal"},3,1,{"$f":"15-AN1&\". Sal\"","v":"2. Sal"},3,1,{"$f":"15-AQ1&\". Sal\"","v":"1. Sal"},3,1,"Stuen",3,null,"Kælder",null,2,2,2,2,2,2,2,2,2,2,2,2,2,2,2,4,{"$f":"BO2","v":4},{"$f":"BP2","v":4},4,4,4,4,4,4,4,4,4,4,4,4]
[null,null,{"$f":"-INDEX(Kold!$BG$27:$BJ$41,C1,C2)","v":-6.0000099999999996},0,0,{"$f":"INDEX(Kold!$BG$27:$BJ$41,F1,F2)","v":13.00001},{"$f":"-INDEX(Kold!$BG$27:$BJ$41,G1,G2)","v":-6.0000099999999996},0,{"$f":"INDEX(Kold!$BG$27:$BJ$41,I1,I2)","v":13.00001},{"$f":"-INDEX(Kold!$BG$27:$BJ$41,J1,J2)","v":-6.0000099999999996},0,{"$f":"INDEX(Kold!$BG$27:$BJ$41,L1,L2)","v":13.00001},{"$f":"-INDEX(Kold!$BG$27:$BJ$41,M1,M2)","v":-6.0000099999999996},0,{"$f":"INDEX(Kold!$BG$27:$BJ$41,O1,O2)","v":13.00001},{"$f":"-INDEX(Kold!$BG$27:$BJ$41,P1,P2)","v":-6.0000099999999996},0,{"$f":"INDEX(Kold!$BG$27:$BJ$41,R1,R2)","v":13.00001},{"$f":"-INDEX(Kold!$BG$27:$BJ$41,S1,S2)","v":-6.0000099999999996},0,{"$f":"INDEX(Kold!$BG$27:$BJ$41,U1,U2)","v":13.00001},{"$f":"-INDEX(Kold!$BG$27:$BJ$41,V1,V2)","v":-6.0000099999999996},0,{"$f":"INDEX(Kold!$BG$27:$BJ$41,X1,X2)","v":13.00001},{"$f":"-INDEX(Kold!$BG$27:$BJ$41,Y1,Y2)","v":-6.0000099999999996},0,{"$f":"INDEX(Kold!$BG$27:$BJ$41,AA1,AA2)","v":13.00001},{"$f":"-INDEX(Kold!$BG$27:$BJ$41,AB1,AB2)","v":-6.0000099999999996},0,{"$f":"INDEX(Kold!$BG$27:$BJ$41,AD1,AD2)","v":13.00001},{"$f":"-INDEX(Kold!$BG$27:$BJ$41,AE1,AE2)","v":-6.0000099999999996},0,{"$f":"INDEX(Kold!$BG$27:$BJ$41,AG1,AG2)","v":13.00001},{"$f":"-INDEX(Kold!$BG$27:$BJ$41,AH1,AH2)","v":-6.0000099999999996},0,{"$f":"INDEX(Kold!$BG$27:$BJ$41,AJ1,AJ2)","v":13.00001},{"$f":"-INDEX(Kold!$BG$27:$BJ$41,AK1,AK2)","v":-6.0000099999999996},0,{"$f":"INDEX(Kold!$BG$27:$BJ$41,AM1,AM2)","v":13.00001},{"$f":"-INDEX(Kold!$BG$27:$BJ$41,AN1,AN2)","v":-6.0000099999999996},0,{"$f":"INDEX(Kold!$BG$27:$BJ$41,AP1,AP2)","v":13.00001},{"$f":"-INDEX(Kold!$BG$27:$BJ$41,AQ1,AQ2)","v":-6.0000099999999996},0,{"$f":"INDEX(Kold!$BG$27:$BJ$41,AS1,AS2)","v":13.00001},{"$f":"-INDEX(Kold!$BG$27:$BJ$41,AT1,AT2)","v":-6.0000099999999996},0,{"$f":"INDEX(Kold!$BG$27:$BJ$41,AV1,AV2)","v":13.00001},{"$f":"-1","v":-1},0,1,{"$f":"-INDEX(Kold!$BG$27:$BJ$41,AZ1,AZ2)","v":-5},{"$f":"-INDEX(Kold!$BG$27:$BJ$41,BA1,BA2)","v":-2},{"$f":"-INDEX(Kold!$BG$27:$BJ$41,BB1,BB2)","v":-5},{"$f":"-INDEX(Kold!$BG$27:$BJ$41,BC1,BC2)","v":-2},{"$f":"-INDEX(Kold!$BG$27:$BJ$41,BD1,BD2)","v":-2},{"$f":"-INDEX(Kold!$BG$27:$BJ$41,BE1,BE2)","v":-2},{"$f":"-INDEX(Kold!$BG$27:$BJ$41,BF1,BF2)","v":-2},{"$f":"-INDEX(Kold!$BG$27:$BJ$41,BG1,BG2)","v":-2},{"$f":"-INDEX(Kold!$BG$27:$BJ$41,BH1,BH2)","v":-2},{"$f":"-INDEX(Kold!$BG$27:$BJ$41,BI1,BI2)","v":-2},{"$f":"-INDEX(Kold!$BG$27:$BJ$41,BJ1,BJ2)","v":-2},{"$f":"-INDEX(Kold!$BG$27:$BJ$41,BK1,BK2)","v":-2},{"$f":"-INDEX(Kold!$BG$27:$BJ$41,BL1,BL2)","v":-2},{"$f":"-INDEX(Kold!$BG$27:$BJ$41,BM1,BM2)","v":-2},{"$f":"-INDEX(Kold!$BG$27:$BJ$41,BN1,BN2)","v":-2},{"$f":"INDEX(Kold!$BG$27:$BJ$41,BO1,BO2)","v":2},{"$f":"INDEX(Kold!$BG$27:$BJ$41,BP1,BP2)","v":2},{"$f":"INDEX(Kold!$BG$27:$BJ$41,BQ1,BQ2)","v":2},{"$f":"INDEX(Kold!$BG$27:$BJ$41,BR1,BR2)","v":2},{"$f":"INDEX(Kold!$BG$27:$BJ$41,BS1,BS2)","v":2},{"$f":"INDEX(Kold!$BG$27:$BJ$41,BT1,BT2)","v":2},{"$f":"INDEX(Kold!$BG$27:$BJ$41,BU1,BU2)","v":2},{"$f":"INDEX(Kold!$BG$27:$BJ$41,BV1,BV2)","v":2},{"$f":"INDEX(Kold!$BG$27:$BJ$41,BW1,BW2)","v":2},{"$f":"INDEX(Kold!$BG$27:$BJ$41,BX1,BX2)","v":2},{"$f":"INDEX(Kold!$BG$27:$BJ$41,BY1,BY2)","v":2},{"$f":"INDEX(Kold!$BG$27:$BJ$41,BZ1,BZ2)","v":2},{"$f":"INDEX(Kold!$BG$27:$BJ$41,CA1,CA2)","v":2},{"$f":"INDEX(Kold!$BG$27:$BJ$41,CB1,CB2)","v":2},{"$f":"INDEX(Kold!$BG$27:$BJ$41,CC1,CC2)","v":2}]
[null,"Geometri",null,0,{"$f":"IF(AND(INDEX(Kold!$E$26:$E$40,C1)=0,INDEX(Kold!$I$26:$I$40,C1)=0),H4,H4+3)","v":45},null,null,{"$f":"IF(AND(INDEX(Kold!$E$26:$E$40,G1)=0,INDEX(Kold!$I$26:$I$40,G1)=0),K4,K4+3)","v":42},null,null,{"$f":"IF(AND(INDEX(Kold!$E$26:$E$40,J1)=0,INDEX(Kold!$I$26:$I$40,J1)=0),N4,N4+3)","v":39},null,null,{"$f":"IF(AND(INDEX(Kold!$E$26:$E$40,M1)=0,INDEX(Kold!$I$26:$I$40,M1)=0),Q4,Q4+3)","v":36},null,null,{"$f":"IF(AND(INDEX(Kold!$E$26:$E$40,P1)=0,INDEX(Kold!$I$26:$I$40,P1)=0),T4,T4+3)","v":33},null,null,{"$f":"IF(AND(INDEX(Kold!$E$26:$E$40,S1)=0,INDEX(Kold!$I$26:$I$40,S1)=0),W4,W4+3)","v":30},null,null,{"$f":"IF(AND(INDEX(Kold!$E$26:$E$40,V1)=0,INDEX(Kold!$I$26:$I$40,V1)=0),Z4,Z4+3)","v":27},null,null,{"$f":"IF(AND(INDEX(Kold!$E$26:$E$40,Y1)=0,INDEX(Kold!$I$26:$I$40,Y1)=0),AC4,AC4+3)","v":24},null,null,{"$f":"IF(AND(INDEX(Kold!$E$26:$E$40,AB1)=0,INDEX(Kold!$I$26:$I$40,AB1)=0),AF4,AF4+3)","v":21},null,null,{"$f":"IF(AND(INDEX(Kold!$E$26:$E$40,AE1)=0,INDEX(Kold!$I$26:$I$40,AE1)=0),AI4,AI4+3)","v":18},null,null,{"$f":"IF(AND(INDEX(Kold!$E$26:$E$40,AH1)=0,INDEX(Kold!$I$26:$I$40,AH1)=0),AL4,AL4+3)","v":15},null,null,{"$f":"IF(AND(INDEX(Kold!$E$26:$E$40,AK1)=0,INDEX(Kold!$I$26:$I$40,AK1)=0),AO4,AO4+3)","v":12},null,null,{"$f":"IF(AND(INDEX(Kold!$E$26:$E$40,AN1)=0,INDEX(Kold!$I$26:$I$40,AN1)=0),AR4,AR4+3)","v":9},null,null,{"$f":"IF(AND(INDEX(Kold!$E$26:$E$40,AQ1)=0,INDEX(Kold!$I$26:$I$40,AQ1)=0),AU4,AU4+3)","v":6},null,null,{"$f":"IF(AND(INDEX(Kold!$E$26:$E$40,AT1)=0,INDEX(Kold!$I$26:$I$40,AT1)=0),AX4,AX4+3)","v":3},null,null,0]
[null,{"$f":"Kold!B26&\"-v   \"&Kold!$F26","v":"Tag-v   F3"},{"$f":"E$4+IF(INDEX(Kold!$E$26:$E$40,C$1)=0,-100,0)","v":45},{"$f":"C5","v":45}]
[null,{"$f":"Kold!$J26&\"   \"&Kold!B26&\"-h\"","v":"F3   Tag-h"},null,null,{"$f":"E$4+IF(INDEX(Kold!$I$26:$I$40,C$1)=0,-100,0)","v":45},{"$f":"E6","v":45}]
[null,{"$f":"Kold!B27&\"-v   \"&Kold!$F27","v":"13. sal-v   F6"},null,null,null,null,{"$f":"H$4+IF(INDEX(Kold!$E$26:$E$40,G$1)=0,-100,0)","v":42},{"$f":"G7","v":42}]
[null,{"$f":"Kold!$J27&\"   \"&Kold!B27&\"-h\"","v":"F1   13. sal-h"},null,null,null,null,null,{"$f":"H$4+IF(INDEX(Kold!$I$26:$I$40,G$1)=0,-100,0)","v":42},{"$f":"H8","v":42}]
[null,{"$f":"Kold!B28&\"-v   \"&Kold!$F28","v":"12. sal-v   F5"},null,null,null,null,null,null,null,{"$f":"K$4+IF(INDEX(Kold!$E$26:$E$40,J$1)=0,-100,0)","v":39},{"$f":"J9","v":39}]
[null,{"$f":"Kold!$J28&\"   \"&Kold!B28&\"-h\"","v":"F2   12. sal-h"},null,null,null,null,null,null,null,null,{"$f":"K$4+IF(INDEX(Kold!$I$26:$I$40,J$1)=0,-100,0)","v":39},{"$f":"K10","v":39}]
[null,{"$f":"Kold!B29&\"-v   \"&Kold!$F29","v":"11. sal-v   F3"},null,null,null,null,null,null,null,null,null,null,{"$f":"N$4+IF(INDEX(Kold!$E$26:$E$40,M$1)=0,-100,0)","v":36},{"$f":"M11","v":36}]
[null,{"$f":"Kold!$J29&\"   \"&Kold!B29&\"-h\"","v":"F2   11. sal-h"},null,null,null,null,null,null,null,null,null,null,null,{"$f":"N$4+IF(INDEX(Kold!$I$26:$I$40,M$1)=0,-100,0)","v":36},{"$f":"N12","v":36}]
[null,{"$f":"Kold!B30&\"-v   \"&Kold!$F30","v":"10. sal-v   F5"},null,null,null,null,null,null,null,null,null,null,null,null,null,{"$f":"Q$4+IF(INDEX(Kold!$E$26:$E$40,P$1)=0,-100,0)","v":33},{"$f":"P13","v":33}]
[null,{"$f":"Kold!$J30&\"   \"&Kold!B30&\"-h\"","v":"F5   10. sal-h"},null,null,null,null,null,null,null,null,null,null,null,null,null,null,{"$f":"Q$4+IF(INDEX(Kold!$I$26:$I$40,P$1)=0,-100,0)","v":33},{"$f":"Q14","v":33}]
[null,{"$f":"Kold!B31&\"-v   \"&Kold!$F31","v":"9. sal-v   F2"},null,null,null,null,null,null,null,null,null,null,null,null,null,null,null,null,{"$f":"T$4+IF(INDEX(Kold!$E$26:$E$40,S$1)=0,-100,0)","v":30},{"$f":"S15","v":30}]
[null,{"$f":"Kold!$J31&\"   \"&Kold!B31&\"-h\"","v":"F3   9. sal-h"},null,null,null,null,null,null,null,null,null,null,null,null,null,null,null,null,null,{"$f":"T$4+IF(INDEX(Kold!$I$26:$I$40,S$1)=0,-100,0)","v":30},{"$f":"T16","v":30}]
[null,{"$f":"Kold!B32&\"-v   \"&Kold!$F32","v":"8. sal-v   F6"},null,null,null,null,null,null,null,null,null,null,null,null,null,null,null,null,null,null,null,{"$f":"W$4+IF(INDEX(Kold!$E$26:$E$40,V$1)=0,-100,0)","v":27},{"$f":"V17","v":27}]
[null,{"$f":"Kold!$J32&\"   \"&Kold!B32&\"-h\"","v":"F3   8. sal-h"},null,null,null,null,null,null,null,null,null,null,null,null,null,null,null,null,null,null,null,null,{"$f":"W$4+IF(INDEX(Kold!$I$26:$I$40,V$1)=0,-100,0)","v":27},{"$f":"W18","v":27}]
[null,{"$f":"Kold!B33&\"-v   \"&Kold!$F33","v":"7. sal-v   F1"},null,null,null,null,null,null,null,null,null,null,null,null,null,null,null,null,null,null,null,null,null,null,{"$f":"Z$4+IF(INDEX(Kold!$E$26:$E$40,Y$1)=0,-100,0)","v":24},{"$f":"Y19","v":24}]
[null,{"$f":"Kold!$J33&\"   \"&Kold!B33&\"-h\"","v":"F5   7. sal-h"},null,null,null,null,null,null,null,null,null,null,null,null,null,null,null,null,null,null,null,null,null,null,null,{"$f":"Z$4+IF(INDEX(Kold!$I$26:$I$40,Y$1)=0,-100,0)","v":24},{"$f":"Z20","v":24}]
[null,{"$f":"Kold!B34&\"-v   \"&Kold!$F34","v":"6. sal-v   F6"},null,null,null,null,null,null,null,null,null,null,null,null,null,null,null,null,null,null,null,null,null,null,null,null,null,{"$f":"AC$4+IF(INDEX(Kold!$E$26:$E$40,AB$1)=0,-100,0)","v":21},{"$f":"AB21","v":21}]
[null,{"$f":"Kold!$J34&\"   \"&Kold!B34&\"-h\"","v":"F4   6. sal-h"},null,null,null,null,null,null,null,null,null,null,null,null,null,null,null,null,null,null,null,null,null,null,null,null,null,null,{"$f":"AC$4+IF(INDEX(Kold!$I$26:$I$40,AB$1)=0,-100,0)","v":21},{"$f":"AC22","v":21}]
[null,{"$f":"Kold!B35&\"-v   \"&Kold!$F35","v":"5. sal-v   F6"},null,null,null,null,null,null,null,null,null,null,null,null,null,null,null,null,null,null,null,null,null,null,null,null,null,null,null,null,{"$f":"AF$4+IF(INDEX(Kold!$E$26:$E$40,AE$1)=0,-100,0)","v":18},{"$f":"AE23","v":18}]
[null,{"$f":"Kold!$J35&\"   \"&Kold!B35&\"-h\"","v":"F7   5. sal-h"},null,null,null,null,null,null,null,null,null,null,null,null,null,null,null,null,null,null,null,null,null,null,null,null,null,null,null,null,null,{"$f":"AF$4+IF(INDEX(Kold!$I$26:$I$40,AE$1)=0,-100,0)","v":18},{"$f":"AF24","v":18}]
[null,{"$f":"Kold!B36&\"-v   \"&Kold!$F36","v":"4. sal-v   F6"},null,null,null,null,null,null,null,null,null,null,null,null,null,null,null,null,null,null,null,null,null,null,null,null,null,null,null,null,null,null,null,{"$f":"AI$4+IF(INDEX(Kold!$E$26:$E$40,AH$1)=0,-100,0)","v":15},{"$f":"AH25","v":15}]
[null,{"$f":"Kold!$J36&\"   \"&Kold!B36&\"-h\"","v":"F2   4. sal-h"},null,null,null,null,null,null,null,null,null,null,null,null,null,null,null,null,null,null,null,null,null,null,null,null,null,null,null,null,null,null,null,null,{"$f":"AI$4+IF(INDEX(Kold!$I$26:$I$40,AH$1)=0,-100,0)","v":15},{"$f":"AI26","v":15}]
[null,{"$f":"Kold!B37&\"-v   \"&Kold!$F37","v":"3. sal-v   F5"},null,null,null,null,null,null,null,null,null,null,null,null,null,null,null,null,null,null,null,null,null,null,null,null,null,null,null,null,null,null,null,null,null,null,{"$f":"AL$4+IF(INDEX(Kold!$E$26:$E$40,AK$1)=0,-100,0)","v":12},{"$f":"AK27","v":12}]
[null,{"$f":"Kold!$J37&\"   \"&Kold!B37&\"-h\"","v":"F2   3. sal-h"},null,null,null,null,null,null,null,null,null,null,null,null,null,null,null,null,null,null,null,null,null,null,null,null,null,null,null,null,null,null,null,null,null,null,null,{"$f":"AL$4+IF(INDEX(Kold!$I$26:$I$40,AK$1)=0,-100,0)","v":12},{"$f":"AL28","v":12}]
[null,{"$f":"Kold!B38&\"-v   \"&Kold!$F38","v":"2. sal-v   F5"},null,null,null,null,null,null,null,null,null,null,null,null,null,null,null,null,null,null,null,null,null,null,null,null,null,null,null,null,null,null,null,null,null,null,null,null,null,{"$f":"AO$4+IF(INDEX(Kold!$E$26:$E$40,AN$1)=0,-100,0)","v":9},{"$f":"AN29","v":9}]
[null,{"$f":"Kold!$J38&\"   \"&Kold!B38&\"-h\"","v":"F3   2. sal-h"},null,null,null,null,null,null,null,null,null,null,null,null,null,null,null,null,null,null,null,null,null,null,null,null,null,null,null,null,null,null,null,null,null,null,null,null,null,null,{"$f":"AO$4+IF(INDEX(Kold!$I$26:$I$40,AN$1)=0,-100,0)","v":9},{"$f":"AO30","v":9}]
[null,{"$f":"Kold!B39&\"-v   \"&Kold!$F39","v":"1. sal-v   F4"},null,null,null,null,null,null,null,null,null,null,null,null,null,null,null,null,null,null,null,null,null,null,null,null,null,null,null,null,null,null,null,null,null,null,null,null,null,null,null,null,{"$f":"AR$4+IF(INDEX(Kold!$E$26:$E$40,AQ$1)=0,-100,0)","v":6},{"$f":"AQ31","v":6}]
[null,{"$f":"Kold!$J39&\"   \"&Kold!B39&\"-h\"","v":"F5   1. sal-h"},null,null,null,null,null,null,null,null,null,null,null,null,null,null,null,null,null,null,null,null,null,null,null,null,null,null,null,null,null,null,null,null,null,null,null,null,null,null,null,null,null,{"$f":"AR$4+IF(INDEX(Kold!$I$26:$I$40,AQ$1)=0,-100,0)","v":6},{"$f":"AR32","v":6}]
[null,{"$f":"Kold!B40&\"-v   \"&Kold!$F40","v":"Stue-v   F3"},null,null,null,null,null,null,null,null,null,null,null,null,null,null,null,null,null,null,null,null,null,null,null,null,null,null,null,null,null,null,null,null,null,null,null,null,null,null,null,null,null,null,null,{"$f":"AU$4+IF(INDEX(Kold!$E$26:$E$40,AT$1)=0,-100,0)","v":3},{"$f":"AT33","v":3}]
[null,{"$f":"Kold!$J40&\"   \"&Kold!B40&\"-h\"","v":"F6   Stue-h"},null,null,null,null,null,null,null,null,null,null,null,null,null,null,null,null,null,null,null,null,null,null,null,null,null,null,null,null,null,null,null,null,null,null,null,null,null,null,null,null,null,null,null,null,{"$f":"AU$4+IF(INDEX(Kold!$I$26:$I$40,AT$1)=0,-100,0)","v":3},{"$f":"AU34","v":3}]
[null,{"$f":"Kold!B41","v":"Kld."},null,null,null,null,null,null,null,null,null,null,null,null,null,null,null,null,null,null,null,null,null,null,null,null,null,null,null,null,null,null,null,null,null,null,null,null,null,null,null,null,null,null,null,null,null,null,0,{"$f":"AW35","v":0}]
[null,null,null,null,null,null,null,null,null,null,null,null,null,null,null,null,null,null,null,null,null,null,null,null,null,null,null,null,null,null,null,null,null,null,null,null,null,null,null,null,null,null,null,null,null,null,null,null,null,0,{"$f":"AX36","v":0}]
[null,"L1",null,null,null,null,null,null,null,null,null,null,null,null,null,null,null,null,null,null,null,null,null,null,null,null,null,null,null,null,null,null,null,null,null,null,null,null,null,null,null,null,null,null,null,null,null,null,null,null,null,{"$f":"IF(INDEX(Kold!$BR$27:$BR$41,Geometri!AZ$1)=2,INDEX($D$4:$AY$4,1,AZ$1*3-1)+1,-100)","v":-100},{"$f":"IF(INDEX(Kold!$BR$27:$BR$41,Geometri!BA$1)=2,INDEX($D$4:$AY$4,1,BA$1*3-1)+1,-100)","v":43},{"$f":"IF(INDEX(Kold!$BR$27:$BR$41,Geometri!BB$1)=2,INDEX($D$4:$AY$4,1,BB$1*3-1)+1,-100)","v":-100},{"$f":"IF(INDEX(Kold!$BR$27:$BR$41,Geometri!BC$1)=2,INDEX($D$4:$AY$4,1,BC$1*3-1)+1,-100)","v":37},{"$f":"IF(INDEX(Kold!$BR$27:$BR$41,Geometri!BD$1)=2,INDEX($D$4:$AY$4,1,BD$1*3-1)+1,-100)","v":-100},{"$f":"IF(INDEX(Kold!$BR$27:$BR$41,Geometri!BE$1)=2,INDEX($D$4:$AY$4,1,BE$1*3-1)+1,-100)","v":-100},{"$f":"IF(INDEX(Kold!$BR$27:$BR$41,Geometri!BF$1)=2,INDEX($D$4:$AY$4,1,BF$1*3-1)+1,-100)","v":28},{"$f":"IF(INDEX(Kold!$BR$27:$BR$41,Geometri!BG$1)=2,INDEX($D$4:$AY$4,1,BG$1*3-1)+1,-100)","v":25},{"$f":"IF(INDEX(Kold!$BR$27:$BR$41,Geometri!BH$1)=2,INDEX($D$4:$AY$4,1,BH$1*3-1)+1,-100)","v":22},{"$f":"IF(INDEX(Kold!$BR$27:$BR$41,Geometri!BI$1)=2,INDEX($D$4:$AY$4,1,BI$1*3-1)+1,-100)","v":19},{"$f":"IF(INDEX(Kold!$BR$27:$BR$41,Geometri!BJ$1)=2,INDEX($D$4:$AY$4,1,BJ$1*3-1)+1,-100)","v":-100},{"$f":"IF(INDEX(Kold!$BR$27:$BR$41,Geometri!BK$1)=2,INDEX($D$4:$AY$4,1,BK$1*3-1)+1,-100)","v":13},{"$f":"IF(INDEX(Kold!$BR$27:$BR$41,Geometri!BL$1)=2,INDEX($D$4:$AY$4,1,BL$1*3-1)+1,-100)","v":10},{"$f":"IF(INDEX(Kold!$BR$27:$BR$41,Geometri!BM$1)=2,INDEX($D$4:$AY$4,1,BM$1*3-1)+1,-100)","v":7},{"$f":"IF(INDEX(Kold!$BR$27:$BR$41,Geometri!BN$1)=2,INDEX($D$4:$AY$4,1,BN$1*3-1)+1,-100)","v":-100},{"$f":"IF(INDEX(Kold!$CF$27:$CF$41,Geometri!BO$1)=2,INDEX($D$4:$AY$4,1,BO$1*3-1)+1,-100)","v":46},{"$f":"IF(INDEX(Kold!$CF$27:$CF$41,Geometri!BP$1)=2,INDEX($D$4:$AY$4,1,BP$1*3-1)+1,-100)","v":-100},{"$f":"IF(INDEX(Kold!$CF$27:$CF$41,Geometri!BQ$1)=2,INDEX($D$4:$AY$4,1,BQ$1*3-1)+1,-100)","v":40},{"$f":"IF(INDEX(Kold!$CF$27:$CF$41,Geometri!BR$1)=2,INDEX($D$4:$AY$4,1,BR$1*3-1)+1,-100)","v":-100},{"$f":"IF(INDEX(Kold!$CF$27:$CF$41,Geometri!BS$1)=2,INDEX($D$4:$AY$4,1,BS$1*3-1)+1,-100)","v":34},{"$f":"IF(INDEX(Kold!$CF$27:$CF$41,Geometri!BT$1)=2,INDEX($D$4:$AY$4,1,BT$1*3-1)+1,-100)","v":-100},{"$f":"IF(INDEX(Kold!$CF$27:$CF$41,Geometri!BU$1)=2,INDEX($D$4:$AY$4,1,BU$1*3-1)+1,-100)","v":-100},{"$f":"IF(INDEX(Kold!$CF$27:$CF$41,Geometri!BV$1)=2,INDEX($D$4:$AY$4,1,BV$1*3-1)+1,-100)","v":25},{"$f":"IF(INDEX(Kold!$CF$27:$CF$41,Geometri!BW$1)=2,INDEX($D$4:$AY$4,1,BW$1*3-1)+1,-100)","v":22},{"$f":"IF(INDEX(Kold!$CF$27:$CF$41,Geometri!BX$1)=2,INDEX($D$4:$AY$4,1,BX$1*3-1)+1,-100)","v":19},{"$f":"IF(INDEX(Kold!$CF$27:$CF$41,Geometri!BY$1)=2,INDEX($D$4:$AY$4,1,BY$1*3-1)+1,-100)","v":16},{"$f":"IF(INDEX(Kold!$CF$27:$CF$41,Geometri!BZ$1)=2,INDEX($D$4:$AY$4,1,BZ$1*3-1)+1,-100)","v":-100},{"$f":"IF(INDEX(Kold!$CF$27:$CF$41,Geometri!CA$1)=2,INDEX($D$4:$AY$4,1,CA$1*3-1)+1,-100)","v":10},{"$f":"IF(INDEX(Kold!$CF$27:$CF$41,Geometri!CB$1)=2,INDEX($D$4:$AY$4,1,CB$1*3-1)+1,-100)","v":7},{"$f":"IF(INDEX(Kold!$CF$27:$CF$41,Geometri!CC$1)=2,INDEX($D$4:$AY$4,1,CC$1*3-1)+1,-100)","v":-100}]
[null,"L2",null,null,null,null,null,null,null,null,null,null,null,null,null,null,null,null,null,null,null,null,null,null,null,null,null,null,null,null,null,null,null,null,null,null,null,null,null,null,null,null,null,null,null,null,null,null,null,null,null,{"$f":"IF(INDEX(Kold!$BR$27:$BR$41,Geometri!AZ$1)=3,INDEX($D$4:$AY$4,1,AZ$1*3-1)+1,-100)","v":46},{"$f":"IF(INDEX(Kold!$BR$27:$BR$41,Geometri!BA$1)=3,INDEX($D$4:$AY$4,1,BA$1*3-1)+1,-100)","v":-100},{"$f":"IF(INDEX(Kold!$BR$27:$BR$41,Geometri!BB$1)=3,INDEX($D$4:$AY$4,1,BB$1*3-1)+1,-100)","v":40},{"$f":"IF(INDEX(Kold!$BR$27:$BR$41,Geometri!BC$1)=3,INDEX($D$4:$AY$4,1,BC$1*3-1)+1,-100)","v":-100},{"$f":"IF(INDEX(Kold!$BR$27:$BR$41,Geometri!BD$1)=3,INDEX($D$4:$AY$4,1,BD$1*3-1)+1,-100)","v":34},{"$f":"IF(INDEX(Kold!$BR$27:$BR$41,Geometri!BE$1)=3,INDEX($D$4:$AY$4,1,BE$1*3-1)+1,-100)","v":31},{"$f":"IF(INDEX(Kold!$BR$27:$BR$41,Geometri!BF$1)=3,INDEX($D$4:$AY$4,1,BF$1*3-1)+1,-100)","v":-100},{"$f":"IF(INDEX(Kold!$BR$27:$BR$41,Geometri!BG$1)=3,INDEX($D$4:$AY$4,1,BG$1*3-1)+1,-100)","v":-100},{"$f":"IF(INDEX(Kold!$BR$27:$BR$41,Geometri!BH$1)=3,INDEX($D$4:$AY$4,1,BH$1*3-1)+1,-100)","v":-100},{"$f":"IF(INDEX(Kold!$BR$27:$BR$41,Geometri!BI$1)=3,INDEX($D$4:$AY$4,1,BI$1*3-1)+1,-100)","v":-100},{"$f":"IF(INDEX(Kold!$BR$27:$BR$41,Geometri!BJ$1)=3,INDEX($D$4:$AY$4,1,BJ$1*3-1)+1,-100)","v":16},{"$f":"IF(INDEX(Kold!$BR$27:$BR$41,Geometri!BK$1)=3,INDEX($D$4:$AY$4,1,BK$1*3-1)+1,-100)","v":-100},{"$f":"IF(INDEX(Kold!$BR$27:$BR$41,Geometri!BL$1)=3,INDEX($D$4:$AY$4,1,BL$1*3-1)+1,-100)","v":-100},{"$f":"IF(INDEX(Kold!$BR$27:$BR$41,Geometri!BM$1)=3,INDEX($D$4:$AY$4,1,BM$1*3-1)+1,-100)","v":-100},{"$f":"IF(INDEX(Kold!$BR$27:$BR$41,Geometri!BN$1)=3,INDEX($D$4:$AY$4,1,BN$1*3-1)+1,-100)","v":4},{"$f":"IF(INDEX(Kold!$CF$27:$CF$41,Geometri!BO$1)=3,INDEX($D$4:$AY$4,1,BO$1*3-1)+1,-100)","v":-100},{"$f":"IF(INDEX(Kold!$CF$27:$CF$41,Geometri!BP$1)=3,INDEX($D$4:$AY$4,1,BP$1*3-1)+1,-100)","v":43},{"$f":"IF(INDEX(Kold!$CF$27:$CF$41,Geometri!BQ$1)=3,INDEX($D$4:$AY$4,1,BQ$1*3-1)+1,-100)","v":-100},{"$f":"IF(INDEX(Kold!$CF$27:$CF$41,Geometri!BR$1)=3,INDEX($D$4:$AY$4,1,BR$1*3-1)+1,-100)","v":37},{"$f":"IF(INDEX(Kold!$CF$27:$CF$41,Geometri!BS$1)=3,INDEX($D$4:$AY$4,1,BS$1*3-1)+1,-100)","v":-100},{"$f":"IF(INDEX(Kold!$CF$27:$CF$41,Geometri!BT$1)=3,INDEX($D$4:$AY$4,1,BT$1*3-1)+1,-100)","v":31},{"$f":"IF(INDEX(Kold!$CF$27:$CF$41,Geometri!BU$1)=3,INDEX($D$4:$AY$4,1,BU$1*3-1)+1,-100)","v":28},{"$f":"IF(INDEX(Kold!$CF$27:$CF$41,Geometri!BV$1)=3,INDEX($D$4:$AY$4,1,BV$1*3-1)+1,-100)","v":-100},{"$f":"IF(INDEX(Kold!$CF$27:$CF$41,Geometri!BW$1)=3,INDEX($D$4:$AY$4,1,BW$1*3-1)+1,-100)","v":-100},{"$f":"IF(INDEX(Kold!$CF$27:$CF$41,Geometri!BX$1)=3,INDEX($D$4:$AY$4,1,BX$1*3-1)+1,-100)","v":-100},{"$f":"IF(INDEX(Kold!$CF$27:$CF$41,Geometri!BY$1)=3,INDEX($D$4:$AY$4,1,BY$1*3-1)+1,-100)","v":-100},{"$f":"IF(INDEX(Kold!$CF$27:$CF$41,Geometri!BZ$1)=3,INDEX($D$4:$AY$4,1,BZ$1*3-1)+1,-100)","v":13},{"$f":"IF(INDEX(Kold!$CF$27:$CF$41,Geometri!CA$1)=3,INDEX($D$4:$AY$4,1,CA$1*3-1)+1,-100)","v":-100},{"$f":"IF(INDEX(Kold!$CF$27:$CF$41,Geometri!CB$1)=3,INDEX($D$4:$AY$4,1,CB$1*3-1)+1,-100)","v":-100},{"$f":"IF(INDEX(Kold!$CF$27:$CF$41,Geometri!CC$1)=3,INDEX($D$4:$AY$4,1,CC$1*3-1)+1,-100)","v":4}]
[null,"Labels",{"$f":"IF(C3<>0,MAX(C5:C36),-100)","v":45},{"$f":"IF(D3<>0,MAX(D5:D36),-100)","v":-100},-100,45,42,-100,42,39,-100,39,36,-100,36,33,-100,33,30,-100,30,27,-100,27,24,-100,24,21,-100,21,18,-100,18,15,-100,15,12,-100,12,9,-100,9,6,-100,6,3,-100,3,0,-100,0]

{"sheet":"Makro","index":4,"n_rows":20,"n_cols":5,"rows_kept":20,"cut":false,"hidden":false,"merged":[]}
["Fladelast ven","Linielast ven","Fladelast høj","Linielast høj","Lastkat"]
[4,3,4,2,8]
[7,2,2,3,1]
[6,3,3,2,2]
[4,2,3,3,4]
[6,3,6,2,4]
[3,3,4,3,7]
[7,2,4,3,4]
[2,2,6,2,4]
[7,2,5,2,8]
[7,2,8,2]
[7,3,3,2]
[6,2,3,3,1]
[6,2,4,2,4]
[5,2,6,2]
[4,3,7,3]
[3,null,3]
[]
[]
[{"$f":"IF(E20=1,0,1000000)","v":0},1,null,null,1]