{"text_format":"1","workbook":"xlsx","n_sheets":5,"sheets":["Kold","Brand","610a","Geometri","Makro"],"not_rendered":{"charts":3,"images":5,"macros":1,"external_links":0,"defined_names":12,"comments":0,"pivot_tables":0},"unopened":[],"bounds":{"document_bytes":16777216,"sheet_cells":100000,"rows_first":2000,"rows_last":500,"rows_between":2000,"halvings":0,"cell_chars":16384,"cell_head_chars":4096},"cells_cut":0,"cells_raw":0,"read":"whole","date_system":"1900"}

{"sheet":"Kold","index":0,"n_rows":52,"n_cols":124,"rows_kept":52,"cut":false,"hidden":false,"merged":[[7,58,7,60],[23,83,23,89],[19,13,19,14],[22,18,22,20],[15,13,15,14],[16,13,16,14],[17,13,17,14],[22,15,22,17],[23,115,23,122],[23,91,23,98],[23,99,23,106],[23,107,23,114],[2,3,2,8],[3,3,3,8],[5,15,6,15],[4,12,4,20],[23,58,23,61],[23,62,23,68],[23,69,23,75],[23,76,23,82],[5,16,6,16],[2,10,2,11],[22,2,22,3],[22,8,22,11],[37,22,38,25],[40,22,40,25],[1,3,1,10],[4,10,4,11],[3,10,3,11],[22,4,22,7],[22,12,22,14],[5,12,6,13],[5,14,6,14],[2,12,2,20],[5,20,6,20],[5,17,6,19]]}
[]
[null,"Bruger:",null,{"$f":"Makro!D20","v":0},null,null,null,null,null,null,null,null,"Lastnedføring - 15 etager",null,null,null,null,null,null,null,"Betonelement-Foreningen feb 2019"]
[null,"Sagsnavn:",null,"Test projekt",null,null,null,null,null,"Sag nr.:","23 - 4545",null,{"$f":"BM44","v":"For ny bruger: Klik på knappen 'angiv nyt brugernavn' for ibrugtagning."}]
[null,"Bygningsdel:",null,"Test bygningsdel",null,null,null,null,null,"Dato:","2008-03-01"]
[null,"Emne:",null,"Vedvarende dimensioneringstilstand, 6.10b",null,null,null,null,null,"Init:","JFJ"]
[null,null,null,null,null,null,null,null,null,null,null,null," Egenvægt, gg,sup =",null,1,"gg,inf  =",0.9," Konsekvensklasse:  KFI =",null,null,1.1000000000000001]
[]
[null,null,null,null,null,null,null,null,null,null,null,null," Fladelaste  (kN/m2)",null,null,"gk","gfri,k","qk","gq","y0","Kategori",null,null,null,null,null,null,null,null,null,null,null,null,null,null,null,null,null,null,null,null,null,null,null,null,null,null,null,null,null,null,null,null,null,null,null,null,null,"Lastkategorier",null,null,"y0","y1","y2",null,"y0","y1","y2","Kontrol for E","Kontrol Sne"]
[null,null,null,null,null,null,null,null,null,null,null,null,"F0",null,null,0,0,0,null,null,null,null,null,null,null,null,null,null,null,null,null,null,null,null,null,null,null,null,null,null,null,null,null,null,null,null,null,null,null,null,null,null,null,null,null,null,null,null,"A",null,null,1,2,3,"A",0.5,0.3,0.2,{"$f":"MIN(MAX(BQ10:BQ22),MIN(1,SUM(COUNTIF(BQ27:BQ41,\"=E\"),COUNTIF(BX27:BX41,\"=E\"),COUNTIF(CE27:CE41,\"=E\"),COUNTIF(CL27:CL41,\"=E\"))))","v":0}]
[null,null,null,null,null,null,null,null,null,null,null,null,"F1","Tagflade, sne",null,3.1,1,0.8,1.5,0.3,{"$f":"INDEX($BG$9:$BG$16,BI10,1)","v":"N"},null,null,null,null,null,null,null,null,null,null,null,null,null,null,null,null,null,null,null,null,null,null,null,null,null,null,null,null,null,null,null,null,null,null,null,null,null,"B",{"$f":"M10","v":"F1"},{"$f":"Makro!E2","v":8},{"$f":"INDEX(psi,$BI10,BJ$9)","v":0.3},0.2,0,"B",0.6,0.4,0.2,{"$f":"IF(BI10=5,1,0)","v":0},{"$f":"IF(AND(BI10=8,T10<>BJ10,MIN(1,SUM(COUNTIF(BQ27:BQ41,\"=N\"),COUNTIF(BX27:BX41,\"=N\"),COUNTIF(CE27:CE41,\"=N\"),COUNTIF(CL27:CL41,\"=N\")))=1),1,0)","v":0}]
[null,null,null,null,null,null,null,null,null,null,null,null,"F2","Boligarealer",null,3.65,1.5,1.5,1.5,0.5,"A",null,null,null,null,null,null,null,null,null,null,null,null,null,null,null,null,null,null,null,null,null,null,null,null,null,null,null,null,null,null,null,null,null,null,null,null,null,"C",{"$f":"M11","v":"F2"},{"$f":"Makro!E3","v":1},0.5,0.3,0.2,"C",0.6,0.6,0.5,0]
[null,null,null,null,null,null,null,null,null,null,null,null,"F3","Kontorer",null,3.65,2,2.5,1.5,0.6,"B",null,null,null,null,null,null,null,null,null,null,null,null,null,null,null,null,null,null,null,null,null,null,null,null,null,null,null,null,null,null,null,null,null,null,null,null,null,"D","F3",{"$f":"Makro!E4","v":2},0.6,0.4,0.2,"D",0.6,0.6,0.5,0]
[null,null,null,null,null,null,null,null,null,null,null,null,"F4","Kontor med arkiv",null,3.65,2,7.5,1.5,0.6,"D",null,null,null,null,null,null,null,null,null,null,null,null,null,null,null,null,null,null,null,null,null,null,null,null,null,null,null,null,null,null,null,null,null,null,null,null,null,"E","F4",{"$f":"Makro!E5","v":4},0.6,0.6,0.5,"E",1,0.8,0.7,0]
[null,null,null,null,null,null,null,null,null,null,null,null,"F5","Kontorer",null,4.1500000000000004,4,4,1.5,0.6,"D",null,null,null,null,null,null,null,null,null,null,null,null,null,null,null,null,null,null,null,null,null,null,null,null,null,null,null,null,null,null,null,null,null,null,null,null,null,"F","F5",{"$f":"Makro!E6","v":4},0.6,0.6,0.5,"F",1,0.6,0.5,0]
[null,null,null,null,null,null,null,null,null,null,null,null,"F6","Kontorer",null,3.65,2,3.3,1.5,1,"G",null,null,null,null,null,null,null,null,null,null,null,null,null,null,null,null,null,null,null,null,null,null,null,null,null,null,null,null,null,null,null,null,null,null,null,null,null,"G","F6",{"$f":"Makro!E7","v":7},1,0.4,0.2,"G",1,0.4,0.2,0]
[null,null,null,null,null,null,null,null,null,null,null,null,"F7","Undervisning",null,3.65,2,4.8,1.5,0.6,"D",null,null,null,null,null,null,null,null,null,null,null,null,null,null,null,null,null,null,null,null,null,null,null,null,null,null,null,null,null,null,null,null,null,null,null,null,null,"N","F7",{"$f":"Makro!E8","v":4},0.6,0.6,0.5,"N",{"$f":"IF(BQ9=1,0.6,0.3)","v":0.3},0.2,0,0]
[null,null,null,null,null,null,null,null,null,null,null,null,"F8","Værksted",null,3.65,2,8.3000000000000007,1.5,0.6,"D",null,null,null,null,null,null,null,null,null,null,null,null,null,null,null,null,null,null,null,null,null,null,null,null,null,null,null,null,null,null,null,null,null,null,null,null,null,null,"F8",{"$f":"Makro!E9","v":4},0.6,0.6,0.5,null,null,null,null,0]
[null,null,null,null,null,null,null,null,null,null,null,null,"F9","Butiksarealer",null,3.65,2,3.3,1.5,0.3,"N",null,null,null,null,null,null,null,null,null,null,null,null,null,null,null,null,null,null,null,null,null,null,null,null,null,null,null,null,null,null,null,null,null,null,null,null,null,null,"F9",{"$f":"Makro!E10","v":8},0.3,0.2,0,null,null,null,null,0]
[null,null,null,null,null,null,null,null,null,null,null,null,"Linielaste (kN/m)",null,null,"gk","gfri,k","qk","gq","y0","Kategori"]
[null,null,null,null,null,null,null,null,null,null,null,null,"L0",null,null,0,0,0]
{"$rows_left_out":33}
{"sheet":"Brand","index":1,"n_rows":73,"n_cols":124,"rows_kept":73,"cut":false,"hidden":false,"merged":[[15,13,15,14],[16,13,16,14],[17,13,17,14],[9,13,9,14],[10,13,10,14],[11,13,11,14],[12,13,12,14],[13,13,13,14],[22,4,22,7],[22,12,22,14],[22,18,22,20],[22,2,22,3],[22,8,22,11],[22,15,22,17],[2,10,2,11],[3,10,3,11],[2,3,2,8],[3,3,3,8],[5,15,6,15],[2,12,3,20],[4,12,4,20],[5,12,6,13],[5,14,6,14],[5,20,6,20],[5,17,6,19],[5,16,6,16],[37,22,38,25],[40,22,40,25],[4,10,4,11],[19,13,19,14],[23,115,23,122],[23,91,23,98],[23,99,23,106],[23,107,23,114],[23,83,23,89],[23,69,23,75],[23,76,23,82],[23,58,23,61],[23,62,23,68],[20,13,20,14],[21,13,21,14],[14,13,14,14]]}
[]
[null,"Bruger:",null,{"$f":"Kold!D2","v":0},null,null,null,null,null,null,null,null,{"$f":"Kold!M2","v":"Lastnedføring - 15 etager"},null,null,null,null,null,null,null,{"$f":"Kold!U2","v":"Betonelement-Foreningen feb 2019"}]
[null,"Sagsnavn:",null,{"$f":"Kold!D3","v":"Test projekt"},null,null,null,null,null,"Sag nr.:",{"$f":"Kold!K3","v":"23 - 4545"},null,{"$f":"BM44","v":""}]
[null,"Bygningsdel:",null,{"$f":"Kold!D4","v":"Test bygningsdel"},null,null,null,null,null,"Dato:",{"$f":"Kold!K4","v":"2008-03-01"}]
[null,"Emne:",null,"Branddimensioneringstilstande",null,null,null,null,null,"Init:",{"$f":"Kold!K5","v":"JFJ"}]
[null,null,null,null,null,null,null,null,null,null,null,null," Egenvægt, gg,sup =",null,1,"gg,inf  =",1," Konsekvensklasse:  KFI =",null,null,1]
[]
[null,null,null,null,null,null,null,null,null,null,null,null," Fladelaste  (kN/m2)",null,null,"gk","gfri,k","qk","y1","y2","Kategori",null,null,null,null,null,null,null,null,null,null,null,null,null,null,null,null,null,null,null,null,null,null,null,null,null,null,null,null,null,null,null,null,null,null,null,null,null,"Lastkategorier",null,null,"y0","y1","y2"]
[null,null,null,null,null,null,null,null,null,null,null,null,"F0",null,null,0,0,0,null,null,null,null,null,null,null,null,null,null,null,null,null,null,null,null,null,null,null,null,null,null,null,null,null,null,null,null,null,null,null,null,null,null,null,null,null,null,null,null,"A",null,null,1,2,3]
[null,null,null,null,null,null,null,null,null,null,null,null,{"$f":"BG61","v":"F1"},{"$f":"BH61","v":"Tagflade, sne"},null,{"$f":"BJ61","v":3.1},{"$f":"BK61","v":1},{"$f":"BL61","v":0.8},0.2,0,{"$f":"BO61","v":"N"},null,null,null,null,null,null,null,null,null,null,null,null,null,null,null,null,null,null,null,null,null,null,null,null,null,null,null,null,null,null,null,null,null,null,null,null,null,"B","F1",{"$f":"Kold!BI10","v":8},{"$f":"INDEX(psi,$BI10,BJ$9)","v":0.3},{"$f":"INDEX(psi,$BI10,BK$9)","v":0.2},0]
[null,null,null,null,null,null,null,null,null,null,null,null,{"$f":"BG62","v":"F2"},{"$f":"BH62","v":"Boligarealer"},null,{"$f":"BJ62","v":3.65},{"$f":"BK62","v":1.5},{"$f":"BL62","v":1.5},0.3,0.2,{"$f":"BO62","v":"A"},null,null,null,null,null,null,null,null,null,null,null,null,null,null,null,null,null,null,null,null,null,null,null,null,null,null,null,null,null,null,null,null,null,null,null,null,null,"C","F2",{"$f":"Kold!BI11","v":1},0.5,0.3,0.2]
[null,null,null,null,null,null,null,null,null,null,null,null,"F3",{"$f":"BH63","v":"Kontorer"},null,3.65,2,2.5,0.4,0.2,"B",null,null,null,null,null,null,null,null,null,null,null,null,null,null,null,null,null,null,null,null,null,null,null,null,null,null,null,null,null,null,null,null,null,null,null,null,null,"D","F3",{"$f":"Kold!BI12","v":2},0.6,0.4,0.2]
[null,null,null,null,null,null,null,null,null,null,null,null,"F4",{"$f":"BH64","v":"Kontor med arkiv"},null,3.65,2,7.5,0.6,0.5,"D",null,null,null,null,null,null,null,null,null,null,null,null,null,null,null,null,null,null,null,null,null,null,null,null,null,null,null,null,null,null,null,null,null,null,null,null,null,"E","F4",{"$f":"Kold!BI13","v":4},0.6,0.6,0.5]
[null,null,null,null,null,null,null,null,null,null,null,null,"F5",{"$f":"BH65","v":"Kontorer"},null,4.1500000000000004,4,4,0.6,0.5,"D",null,null,null,null,null,null,null,null,null,null,null,null,null,null,null,null,null,null,null,null,null,null,null,null,null,null,null,null,null,null,null,null,null,null,null,null,null,"F","F5",{"$f":"Kold!BI14","v":4},0.6,0.6,0.5]
[null,null,null,null,null,null,null,null,null,null,null,null,"F6",{"$f":"BH66","v":"Kontorer"},null,3.65,2,3.3,0.4,0.2,"G",null,null,null,null,null,null,null,null,null,null,null,null,null,null,null,null,null,null,null,null,null,null,null,null,null,null,null,null,null,null,null,null,null,null,null,null,null,"G","F6",{"$f":"Kold!BI15","v":7},1,0.4,0.2]
[null,null,null,null,null,null,null,null,null,null,null,null,"F7",{"$f":"BH67","v":"Undervisning"},null,3.65,2,4.8,0.6,0.5,"D",null,null,null,null,null,null,null,null,null,null,null,null,null,null,null,null,null,null,null,null,null,null,null,null,null,null,null,null,null,null,null,null,null,null,null,null,null,"N","F7",{"$f":"Kold!BI16","v":4},{"$f":"INDEX(psi,$BI16,BJ$9)","v":0.6},0.6,0.5]
[null,null,null,null,null,null,null,null,null,null,null,null,"F8",{"$f":"BH68","v":"Værksted"},null,3.65,2,8.3000000000000007,0.6,0.5,"D",null,null,null,null,null,null,null,null,null,null,null,null,null,null,null,null,null,null,null,null,null,null,null,null,null,null,null,null,null,null,null,null,null,null,null,null,null,null,"F8",{"$f":"Kold!BI17","v":4},0.6,0.6,0.5]
[null,null,null,null,null,null,null,null,null,null,null,null,"F9",{"$f":"BH69","v":"Butiksarealer"},null,3.65,2,3.3,0.2,0,"N",null,null,null,null,null,null,null,null,null,null,null,null,null,null,null,null,null,null,null,null,null,null,null,null,null,null,null,null,null,null,null,null,null,null,null,null,null,null,"F9",{"$f":"Kold!BI18","v":8},0.3,0.2,0]
[null,null,null,null,null,null,null,null,null,null,null,null,"Linielaste (kN/m)",null,null,"gk","gfri,k","qk","y1","y2","Kategori"]
[null,null,null,null,null,null,null,null,null,null,null,null,"L0",null,null,0,0,0]
{"$rows_left_out":54}
{"sheet":"610a","index":2,"n_rows":73,"n_cols":91,"rows_kept":73,"cut":false,"hidden":false,"merged":[[23,99,23,106],[23,107,23,114],[23,115,23,122],[23,58,23,61],[23,62,23,68],[23,69,23,75],[23,76,23,82],[23,83,23,89],[23,91,23,98],[22,2,22,3],[22,4,22,7],[22,8,22,11],[22,12,22,14],[22,15,22,17],[22,18,22,20],[15,13,15,14],[16,13,16,14],[17,13,17,14],[19,13,19,14],[20,13,20,14],[21,13,21,14],[2,3,2,8],[2,10,2,11],[2,12,3,20],[3,3,3,8],[3,10,3,11],[37,22,38,25],[40,22,40,25],[4,10,4,11],[5,17,6,19],[5,20,6,20],[4,12,4,20],[14,13,14,14],[5,12,6,13],[5,14,6,14],[5,15,6,15],[5,16,6,16],[9,13,9,14],[10,13,10,14],[11,13,11,14],[12,13,12,14],[13,13,13,14]]}
[]
[null,"Bruger:",null,{"$f":"Kold!D2","v":0},null,null,null,null,null,null,null,null,{"$f":"Kold!M2","v":"Lastnedføring - 15 etager"},null,null,null,null,null,null,null,{"$f":"Kold!U2","v":"Betonelement-Foreningen feb 2019"}]
[null,"Sagsnavn:",null,{"$f":"Kold!D3","v":"Test projekt"},null,null,null,null,null,"Sag nr.:",{"$f":"Kold!K3","v":"23 - 4545"},null,{"$f":"BM44","v":""}]
[null,"Bygningsdel:",null,{"$f":"Kold!D4","v":"Test bygningsdel"},null,null,null,null,null,"Dato:",{"$f":"Kold!K4","v":"2008-03-01"}]
[null,"Emne:",null,"Branddimensioneringstilstande",null,null,null,null,null,"Init:",{"$f":"Kold!K5","v":"JFJ"}]
[null,null,null,null,null,null,null,null,null,null,null,null," Egenvægt, gg,sup =",null,1.2,"gg,inf  =",1," Konsekvensklasse:  KFI =",null,null,{"$f":"Kold!U6","v":1.1000000000000001}]
[]
[null,null,null,null,null,null,null,null,null,null,null,null," Fladelaste  (kN/m2)",null,null,"gk","gfri,k"]
[null,null,null,null,null,null,null,null,null,null,null,null,"F0",null,null,0,0]
[null,null,null,null,null,null,null,null,null,null,null,null,{"$f":"BG61","v":"F1"},{"$f":"BH61","v":"Tagflade, sne"},null,{"$f":"BJ61","v":3.1},{"$f":"BK61","v":1}]
[null,null,null,null,null,null,null,null,null,null,null,null,{"$f":"BG62","v":"F2"},"Boligarealer",null,{"$f":"BJ62","v":3.65},1.5]
[null,null,null,null,null,null,null,null,null,null,null,null,"F3","Kontorer",null,3.65,2]
[null,null,null,null,null,null,null,null,null,null,null,null,"F4","Kontor med arkiv",null,3.65,2]
[null,null,null,null,null,null,null,null,null,null,null,null,"F5","Kontorer",null,4.1500000000000004,4]
[null,null,null,null,null,null,null,null,null,null,null,null,"F6","Kontorer",null,3.65,2]
[null,null,null,null,null,null,null,null,null,null,null,null,"F7","Undervisning",null,3.65,2]
[null,null,null,null,null,null,null,null,null,null,null,null,"F8","Værksted",null,3.65,2]
[null,null,null,null,null,null,null,null,null,null,null,null,"F9","Butiksarealer",null,3.65,2]
[null,null,null,null,null,null,null,null,null,null,null,null,"Linielaste (kN/m)",null,null,"gk","gfri,k"]
[null,null,null,null,null,null,null,null,null,null,null,null,"L0",null,null,0,0]
{"$rows_left_out":54}
{"sheet":"Geometri","index":3,"n_rows":39,"n_cols":81,"rows_kept":39,"cut":false,"hidden":false,"merged":[[1,3,1,4]]}
[null,null,1,null,null,1,2,null,2,{"$f":"G1+1","v":3},null,{"$f":"J1","v":3},{"$f":"J1+1","v":4},null,{"$f":"M1","v":4},{"$f":"M1+1","v":5},null,{"$f":"P1","v":5},{"$f":"P1+1","v":6},null,{"$f":"S1","v":6},{"$f":"S1+1","v":7},null,{"$f":"V1","v":7},{"$f":"V1+1","v":8},null,{"$f":"Y1","v":8},{"$f":"Y1+1","v":9},null,{"$f":"AB1","v":9},{"$f":"AB1+1","v":10},null,{"$f":"AE1","v":10},{"$f":"AE1+1","v":11},null,{"$f":"AH1","v":11},{"$f":"AH1+1","v":12},null,{"$f":"AK1","v":12},{"$f":"AK1+1","v":13},null,{"$f":"AN1","v":13},{"$f":"AN1+1","v":14},null,{"$f":"AQ1","v":14},{"$f":"AQ1+1","v":15},null,{"$f":"AT1","v":15},null,null,null,1,2,3,4,5,6,7,8,9,10,11,12,13,14,15,1,2,3,4,5,6,7,8,9,10,11,12,13,14,15]
[null,null,1,"Tag",null,3,1,{"$f":"15-G1&\". Sal\"","v":"13. Sal"},3,1,{"$f":"15-J1&\". Sal\"","v":"12. Sal"},3,1,{"$f":"15-M1&\". Sal\"","v":"11. Sal"},3,1,{"$f":"15-P1&\". Sal\"","v":"10. Sal"},3,1,{"$f":"15-S1&\". Sal\"","v":"9. Sal"},3,1,{"$f":"15-V1&\". Sal\"","v":"8. Sal"},3,1,{"$f":"15-Y1&\". Sal\"","v":"7. Sal"},3,1,{"$f":"15-AB1&\". Sal\"","v":"6. Sal"},3,1,{"$f":"15-AE1&\". Sal\"","v":"5. Sal"},3,1,{"$f":"15-AH1&\". Sal\"","v":"4. Sal"},3,1,{"$f":"15-AK1&\". Sal\"","v":"3. Sal"},3,1,{"$f":"15-AN1&\". Sal\"","v":"2. Sal"},3,1,{"$f":"15-AQ1&\". Sal\"","v":"1. Sal"},3,1,"Stuen",3,null,"Kælder",null,2,2,2,2,2,2,2,2,2,2,2,2,2,2,2,4,{"$f":"BO2","v":4},{"$f":"BP2","v":4},4,4,4,4,4,4,4,4,4,4,4,4]
[null,null,{"$f":"-INDEX(Kold!$BG$27:$BJ$41,C1,C2)","v":-6.0000099999999996},0,0,{"$f":"INDEX(Kold!$BG$27:$BJ$41,F1,F2)","v":13.00001},{"$f":"-INDEX(Kold!$BG$27:$BJ$41,G1,G2)","v":-6.0000099999999996},0,{"$f":"INDEX(Kold!$BG$27:$BJ$41,I1,I2)","v":13.00001},{"$f":"-INDEX(Kold!$BG$27:$BJ$41,J1,J2)","v":-6.0000099999999996},0,{"$f":"INDEX(Kold!$BG$27:$BJ$41,L1,L2)","v":13.00001},{"$f":"-INDEX(Kold!$BG$27:$BJ$41,M1,M2)","v":-6.0000099999999996},0,{"$f":"INDEX(Kold!$BG$27:$BJ$41,O1,O2)","v":13.00001},{"$f":"-INDEX(Kold!$BG$27:$BJ$41,P1,P2)","v":-6.0000099999999996},0,{"$f":"INDEX(Kold!$BG$27:$BJ$41,R1,R2)","v":13.00001},{"$f":"-INDEX(Kold!$BG$27:$BJ$41,S1,S2)","v":-6.0000099999999996},0,{"$f":"INDEX(Kold!$BG$27:$BJ$41,U1,U2)","v":13.00001},{"$f":"-INDEX(Kold!$BG$27:$BJ$41,V1,V2)","v":-6.0000099999999996},0,{"$f":"INDEX(Kold!$BG$27:$BJ$41,X1,X2)","v":13.00001},{"$f":"-INDEX(Kold!$BG$27:$BJ$41,Y1,Y2)","v":-6.0000099999999996},0,{"$f":"INDEX(Kold!$BG$27:$BJ$41,AA1,AA2)","v":13.00001},{"$f":"-INDEX(Kold!$BG$27:$BJ$41,AB1,AB2)","v":-6.0000099999999996},0,{"$f":"INDEX(Kold!$BG$27:$BJ$41,AD1,AD2)","v":13.00001},{"$f":"-INDEX(Kold!$BG$27:$BJ$41,AE1,AE2)","v":-6.0000099999999996},0,{"$f":"INDEX(Kold!$BG$27:$BJ$41,AG1,AG2)","v":13.00001},{"$f":"-INDEX(Kold!$BG$27:$BJ$41,AH1,AH2)","v":-6.0000099999999996},0,{"$f":"INDEX(Kold!$BG$27:$BJ$41,AJ1,AJ2)","v":13.00001},{"$f":"-INDEX(Kold!$BG$27:$BJ$41,AK1,AK2)","v":-6.0000099999999996},0,{"$f":"INDEX(Kold!$BG$27:$BJ$41,AM1,AM2)","v":13.00001},{"$f":"-INDEX(Kold!$BG$27:$BJ$41,AN1,AN2)","v":-6.0000099999999996},0,{"$f":"INDEX(Kold!$BG$27:$BJ$41,AP1,AP2)","v":13.00001},{"$f":"-INDEX(Kold!$BG$27:$BJ$41,AQ1,AQ2)","v":-6.0000099999999996},0,{"$f":"INDEX(Kold!$BG$27:$BJ$41,AS1,AS2)","v":13.00001},{"$f":"-INDEX(Kold!$BG$27:$BJ$41,AT1,AT2)","v":-6.0000099999999996},0,{"$f":"INDEX(Kold!$BG$27:$BJ$41,AV1,AV2)","v":13.00001},{"$f":"-1","v":-1},0,1,{"$f":"-INDEX(Kold!$BG$27:$BJ$41,AZ1,AZ2)","v":-5},{"$f":"-INDEX(Kold!$BG$27:$BJ$41,BA1,BA2)","v":-2},{"$f":"-INDEX(Kold!$BG$27:$BJ$41,BB1,BB2)","v":-5},{"$f":"-INDEX(Kold!$BG$27:$BJ$41,BC1,BC2)","v":-2},{"$f":"-INDEX(Kold!$BG$27:$BJ$41,BD1,BD2)","v":-2},{"$f":"-INDEX(Kold!$BG$27:$BJ$41,BE1,BE2)","v":-2},{"$f":"-INDEX(Kold!$BG$27:$BJ$41,BF1,BF2)","v":-2},{"$f":"-INDEX(Kold!$BG$27:$BJ$41,BG1,BG2)","v":-2},{"$f":"-INDEX(Kold!$BG$27:$BJ$41,BH1,BH2)","v":-2},{"$f":"-INDEX(Kold!$BG$27:$BJ$41,BI1,BI2)","v":-2},{"$f":"-INDEX(Kold!$BG$27:$BJ$41,BJ1,BJ2)","v":-2},{"$f":"-INDEX(Kold!$BG$27:$BJ$41,BK1,BK2)","v":-2},{"$f":"-INDEX(Kold!$BG$27:$BJ$41,BL1,BL2)","v":-2},{"$f":"-INDEX(Kold!$BG$27:$BJ$41,BM1,BM2)","v":-2},{"$f":"-INDEX(Kold!$BG$27:$BJ$41,BN1,BN2)","v":-2},{"$f":"INDEX(Kold!$BG$27:$BJ$41,BO1,BO2)","v":2},{"$f":"INDEX(Kold!$BG$27:$BJ$41,BP1,BP2)","v":2},{"$f":"INDEX(Kold!$BG$27:$BJ$41,BQ1,BQ2)","v":2},{"$f":"INDEX(Kold!$BG$27:$BJ$41,BR1,BR2)","v":2},{"$f":"INDEX(Kold!$BG$27:$BJ$41,BS1,BS2)","v":2},{"$f":"INDEX(Kold!$BG$27:$BJ$41,BT1,BT2)","v":2},{"$f":"INDEX(Kold!$BG$27:$BJ$41,BU1,BU2)","v":2},{"$f":"INDEX(Kold!$BG$27:$BJ$41,BV1,BV2)","v":2},{"$f":"INDEX(Kold!$BG$27:$BJ$41,BW1,BW2)","v":2},{"$f":"INDEX(Kold!$BG$27:$BJ$41,BX1,BX2)","v":2},{"$f":"INDEX(Kold!$BG$27:$BJ$41,BY1,BY2)","v":2},{"$f":"INDEX(Kold!$BG$27:$BJ$41,BZ1,BZ2)","v":2},{"$f":"INDEX(Kold!$BG$27:$BJ$41,CA1,CA2)","v":2},{"$f":"INDEX(Kold!$BG$27:$BJ$41,CB1,CB2)","v":2},{"$f":"INDEX(Kold!$BG$27:$BJ$41,CC1,CC2)","v":2}]
[null,"Geometri",null,0,{"$f":"IF(AND(INDEX(Kold!$E$26:$E$40,C1)=0,INDEX(Kold!$I$26:$I$40,C1)=0),H4,H4+3)","v":45},null,null,{"$f":"IF(AND(INDEX(Kold!$E$26:$E$40,G1)=0,INDEX(Kold!$I$26:$I$40,G1)=0),K4,K4+3)","v":42},null,null,{"$f":"IF(AND(INDEX(Kold!$E$26:$E$40,J1)=0,INDEX(Kold!$I$26:$I$40,J1)=0),N4,N4+3)","v":39},null,null,{"$f":"IF(AND(INDEX(Kold!$E$26:$E$40,M1)=0,INDEX(Kold!$I$26:$I$40,M1)=0),Q4,Q4+3)","v":36},null,null,{"$f":"IF(AND(INDEX(Kold!$E$26:$E$40,P1)=0,INDEX(Kold!$I$26:$I$40,P1)=0),T4,T4+3)","v":33},null,null,{"$f":"IF(AND(INDEX(Kold!$E$26:$E$40,S1)=0,INDEX(Kold!$I$26:$I$40,S1)=0),W4,W4+3)","v":30},null,null,{"$f":"IF(AND(INDEX(Kold!$E$26:$E$40,V1)=0,INDEX(Kold!$I$26:$I$40,V1)=0),Z4,Z4+3)","v":27},null,null,{"$f":"IF(AND(INDEX(Kold!$E$26:$E$40,Y1)=0,INDEX(Kold!$I$26:$I$40,Y1)=0),AC4,AC4+3)","v":24},null,null,{"$f":"IF(AND(INDEX(Kold!$E$26:$E$40,AB1)=0,INDEX(Kold!$I$26:$I$40,AB1)=0),AF4,AF4+3)","v":21},null,null,{"$f":"IF(AND(INDEX(Kold!$E$26:$E$40,AE1)=0,INDEX(Kold!$I$26:$I$40,AE1)=0),AI4,AI4+3)","v":18},null,null,{"$f":"IF(AND(INDEX(Kold!$E$26:$E$40,AH1)=0,INDEX(Kold!$I$26:$I$40,AH1)=0),AL4,AL4+3)","v":15},null,null,{"$f":"IF(AND(INDEX(Kold!$E$26:$E$40,AK1)=0,INDEX(Kold!$I$26:$I$40,AK1)=0),AO4,AO4+3)","v":12},null,null,{"$f":"IF(AND(INDEX(Kold!$E$26:$E$40,AN1)=0,INDEX(Kold!$I$26:$I$40,AN1)=0),AR4,AR4+3)","v":9},null,null,{"$f":"IF(AND(INDEX(Kold!$E$26:$E$40,AQ1)=0,INDEX(Kold!$I$26:$I$40,AQ1)=0),AU4,AU4+3)","v":6},null,null,{"$f":"IF(AND(INDEX(Kold!$E$26:$E$40,AT1)=0,INDEX(Kold!$I$26:$I$40,AT1)=0),AX4,AX4+3)","v":3},null,null,0]
[null,{"$f":"Kold!B26&\"-v   \"&Kold!$F26","v":"Tag-v   F3"},{"$f":"E$4+IF(INDEX(Kold!$E$26:$E$40,C$1)=0,-100,0)","v":45},{"$f":"C5","v":45}]
[null,{"$f":"Kold!$J26&\"   \"&Kold!B26&\"-h\"","v":"F3   Tag-h"},null,null,{"$f":"E$4+IF(INDEX(Kold!$I$26:$I$40,C$1)=0,-100,0)","v":45},{"$f":"E6","v":45}]
[null,{"$f":"Kold!B27&\"-v   \"&Kold!$F27","v":"13. sal-v   F6"},null,null,null,null,{"$f":"H$4+IF(INDEX(Kold!$E$26:$E$40,G$1)=0,-100,0)","v":42},{"$f":"G7","v":42}]
[null,{"$f":"Kold!$J27&\"   \"&Kold!B27&\"-h\"","v":"F1   13. sal-h"},null,null,null,null,null,{"$f":"H$4+IF(INDEX(Kold!$I$26:$I$40,G$1)=0,-100,0)","v":42},{"$f":"H8","v":42}]
[null,{"$f":"Kold!B28&\"-v   \"&Kold!$F28","v":"12. sal-v   F5"},null,null,null,null,null,null,null,{"$f":"K$4+IF(INDEX(Kold!$E$26:$E$40,J$1)=0,-100,0)","v":39},{"$f":"J9","v":39}]
[null,{"$f":"Kold!$J28&\"   \"&Kold!B28&\"-h\"","v":"F2   12. sal-h"},null,null,null,null,null,null,null,null,{"$f":"K$4+IF(INDEX(Kold!$I$26:$I$40,J$1)=0,-100,0)","v":39},{"$f":"K10","v":39}]
[null,{"$f":"Kold!B29&\"-v   \"&Kold!$F29","v":"11. sal-v   F3"},null,null,null,null,null,null,null,null,null,null,{"$f":"N$4+IF(INDEX(Kold!$E$26:$E$40,M$1)=0,-100,0)","v":36},{"$f":"M11","v":36}]
[null,{"$f":"Kold!$J29&\"   \"&Kold!B29&\"-h\"","v":"F2   11. sal-h"},null,null,null,null,null,null,null,null,null,null,null,{"$f":"N$4+IF(INDEX(Kold!$I$26:$I$40,M$1)=0,-100,0)","v":36},{"$f":"N12","v":36}]
[null,{"$f":"Kold!B30&\"-v   \"&Kold!$F30","v":"10. sal-v   F5"},null,null,null,null,null,null,null,null,null,null,null,null,null,{"$f":"Q$4+IF(INDEX(Kold!$E$26:$E$40,P$1)=0,-100,0)","v":33},{"$f":"P13","v":33}]
[null,{"$f":"Kold!$J30&\"   \"&Kold!B30&\"-h\"","v":"F5   10. sal-h"},null,null,null,null,null,null,null,null,null,null,null,null,null,null,{"$f":"Q$4+IF(INDEX(Kold!$I$26:$I$40,P$1)=0,-100,0)","v":33},{"$f":"Q14","v":33}]
[null,{"$f":"Kold!B31&\"-v   \"&Kold!$F31","v":"9. sal-v   F2"},null,null,null,null,null,null,null,null,null,null,null,null,null,null,null,null,{"$f":"T$4+IF(INDEX(Kold!$E$26:$E$40,S$1)=0,-100,0)","v":30},{"$f":"S15","v":30}]
[null,{"$f":"Kold!$J31&\"   \"&Kold!B31&\"-h\"","v":"F3   9. sal-h"},null,null,null,null,null,null,null,null,null,null,null,null,null,null,null,null,null,{"$f":"T$4+IF(INDEX(Kold!$I$26:$I$40,S$1)=0,-100,0)","v":30},{"$f":"T16","v":30}]
[null,{"$f":"Kold!B32&\"-v   \"&Kold!$F32","v":"8. sal-v   F6"},null,null,null,null,null,null,null,null,null,null,null,null,null,null,null,null,null,null,null,{"$f":"W$4+IF(INDEX(Kold!$E$26:$E$40,V$1)=0,-100,0)","v":27},{"$f":"V17","v":27}]
[null,{"$f":"Kold!$J32&\"   \"&Kold!B32&\"-h\"","v":"F3   8. sal-h"},null,null,null,null,null,null,null,null,null,null,null,null,null,null,null,null,null,null,null,null,{"$f":"W$4+IF(INDEX(Kold!$I$26:$I$40,V$1)=0,-100,0)","v":27},{"$f":"W18","v":27}]
[null,{"$f":"Kold!B33&\"-v   \"&Kold!$F33","v":"7. sal-v   F1"},null,null,null,null,null,null,null,null,null,null,null,null,null,null,null,null,null,null,null,null,null,null,{"$f":"Z$4+IF(INDEX(Kold!$E$26:$E$40,Y$1)=0,-100,0)","v":24},{"$f":"Y19","v":24}]
[null,{"$f":"Kold!$J33&\"   \"&Kold!B33&\"-h\"","v":"F5   7. sal-h"},null,null,null,null,null,null,null,null,null,null,null,null,null,null,null,null,null,null,null,null,null,null,null,{"$f":"Z$4+IF(INDEX(Kold!$I$26:$I$40,Y$1)=0,-100,0)","v":24},{"$f":"Z20","v":24}]
{"$rows_left_out":20}
{"sheet":"Makro","index":4,"n_rows":20,"n_cols":5,"rows_kept":20,"cut":false,"hidden":false,"merged":[]}
["Fladelast ven","Linielast ven","Fladelast høj","Linielast høj","Lastkat"]
[4,3,4,2,8]
[7,2,2,3,1]
[6,3,3,2,2]
[4,2,3,3,4]
[6,3,6,2,4]
[3,3,4,3,7]
[7,2,4,3,4]
[2,2,6,2,4]
[7,2,5,2,8]
[7,2,8,2]
[7,3,3,2]
[6,2,3,3,1]
[6,2,4,2,4]
[5,2,6,2]
[4,3,7,3]
[3,null,3]
[]
[]
[{"$f":"IF(E20=1,0,1000000)","v":0},1,null,null,1]