{"text_format":"1","workbook":"xlsx","n_sheets":14,"sheets":["Inddata","System","Vægskiver","Vægplan","Kontur","Laste","E1","E2","E3","E4","E5","E6","Skala","Trig"],"not_rendered":{"charts":37,"images":1,"macros":1,"external_links":0,"defined_names":92,"comments":3,"pivot_tables":0},"unopened":[],"bounds":{"document_bytes":16777216,"sheet_cells":100000,"rows_first":2000,"rows_last":500,"rows_between":2000,"halvings":0,"cell_chars":16384,"cell_head_chars":4096},"cells_cut":0,"cells_raw":0,"read":"whole","date_system":"1900"}

{"sheet":"Inddata","index":0,"n_rows":77,"n_cols":213,"rows_kept":77,"cut":false,"hidden":false,"merged":[[1,19,1,21],[34,13,34,15],[19,65,19,68],[3,2,3,3],[3,4,3,5],[3,15,3,18],[1,14,1,17]]}
[]
[null,"Opgave:","BEF's prøvehus, ULS lastkomb. 6.10b",null,null,null,null,null,null,null,null,null,null,"Bruger:",{"$f":"HD9","v":"Bruger skal registreres"},null,null,null,"sag nr.:","21-101",null,null,"init:","NNN"]
[null,null,null,null,null,null,null,null,null,null,null,null,null,null,null,null,null,null,null,null,null,null,null,null,null,null,null,null,null,null,null,null,null,null,null,null,null,null,null,null,null,null,null,null,null,null,null,null,null,null,null,null,null,null,6,2,{"$f":"IF(SUM(BE27:BE30)>0,5,IF(SUM(BE21:BE26)>0,4,IF(SUM(BE15:BE20)>0,3,IF(SUM(BE9:BE14)>0,2,1))))","v":1}]
[null,"Væg","1. endepunkt",null,"2. endepunkt",null,"dim.",null,null,"væghøjde","rel. stivh.",null,null,"Etage","Højde","Laste på dækskiver over etager",null,null,null,null,null,null,null,null,null,null,null,null,null,null,null,null,null,null,null,null,null,null,null,null,null,null,null,null,null,null,null,null,null,null,null,null,null,null,"Etage 6",1,{"$f":"IF(INDEX(vægstabilitet,11+12*(BD4-1),2)=0,0,1)","v":1}]
[null,null,"x1","y1","x2","y2","t",null,null,"etager","a0","Ankre",null,null,"h_etg","y_Wx","W_x","x_Wy","W_y",null,null,null,null,null,null,null,null,null,null,null,null,null,null,null,null,null,null,null,null,null,null,null,null,null,null,null,null,null,null,null,null,null,null,null,"Etage 5",2,1,"Væg",null,null,null,"Etage","h","t","r_1","r_2","L_eff","V_i","Q","G","p","P1","P2","T","N","b_1","b_2","n","n_max",null,null,null,"Etager:",6,null,null,null,null,null,null,null,null,null,null,null,null,null,"Hjørnepunkter i vægopstalt",null,null,null,null,null,null,null,null,null,null,null,null,null,null,null,null,null,null,null,null,null,null,null,null,null,null,null,null,null,null,null,"vægcheck"]
[null,"nr.","(m)","(m)","(m)","(m)","(m)",null,null,"(antal)",null,"til basis",null,null,"(m)","(m)","(KN)","(m)","(KN)",null,null,null,null,null,null,null,null,null,null,null,null,null,null,null,null,null,null,null,null,null,null,null,null,null,null,null,null,null,null,null,null,null,null,null,"Etage 4",3,1,{"$f":"gv","v":2},null,null,null,null,"(m)","(m)","(m)","(m)","(m)","(kN)","(kN)","(kN)","(kN/m)","(kN)","(kN)","(kN)","(kN)","(m)","(m)","(kN/m)","(kN/m)"]
[null,1,10,10,15,10,0.2,null,null,6,1,{"$f":"IF(B7=gv,$V$43,INDEX(ankre,11+12*(B7-1),1))","v":58.278931684871097},{"$f":"IF(OR(INDEX(vægstabilitet,11+12*(B7-1),19)=\"!\",INDEX(vægstabilitet,10+12*(B7-1),19)=\"!\",INDEX(vægstabilitet,9+12*(B7-1),19)=\"!\",INDEX(vægstabilitet,8+12*(B7-1),19)=\"!\",INDEX(vægstabilitet,7+12*(B7-1),19)=\"!\",INDEX(vægstabilitet,6+12*(B7-1),19)=\"!\"),1,0)","v":0},6,3,{"$f":"INDEX(Resultlast,(LT-1)*6+(7-N7),1)","v":16},{"$f":"INDEX(Resultlast,(LT-1)*6+(7-N7),2)","v":23.587199999999996},{"$f":"INDEX(Resultlast,(LT-1)*6+(7-N7),3)","v":19.999999999999996},{"$f":"INDEX(Resultlast,(LT-1)*6+(7-N7),4)","v":62.622},null,null,null,null,null,null,null,null,null,null,null,null,null,null,null,null,null,null,null,null,null,null,null,null,null,null,null,null,null,null,null,null,null,null,null,"Etage 3",4,1,null,null,null,null,null,null,null,null,null,null,null,null,null,null,null,null,null,null,null,null,null,null,null,null,null,"s_1","s_2","x_1","y_1","x_2","y_2","cos(a)","sin(a)","s_1_e","s_2_e","s_N","N_0","n","T_1","T_2",0,0,{"$f":"CF14","v":5.0000999999999998},{"$f":"CF14","v":5.0000999999999998},{"$f":"CT7","v":0},{"$f":"CE13","v":0},{"$f":"CE13","v":0},{"$f":"CF13","v":5.0000999999999998},{"$f":"CF13","v":5.0000999999999998},{"$f":"CY7","v":0},{"$f":"CE12","v":0},{"$f":"CE12","v":0},{"$f":"CF12","v":5.0000999999999998},{"$f":"CF12","v":5.0000999999999998},{"$f":"DD7","v":0},{"$f":"CE11","v":0},{"$f":"CE11","v":0},{"$f":"CF11","v":5.0000999999999998},{"$f":"CF11","v":5.0000999999999998},{"$f":"DI7","v":0},{"$f":"CE10","v":0},{"$f":"CE10","v":0},{"$f":"CF10","v":5.0000999999999998},{"$f":"CF10","v":5.0000999999999998},{"$f":"DN7","v":0},{"$f":"CE9","v":0},{"$f":"CE9","v":0},{"$f":"CF9","v":5.0000999999999998},{"$f":"CF9","v":5.0000999999999998},{"$f":"DS7","v":0},{"$f":"DX15","v":20},null,{"$f":"IF(AND(INDEX(vægstabilitet,11+12*(B7-1),14)<>0,K7*J7*G7*SQRT((E7-C7)^2+(F7-D7)^2)=0),0,B7)","v":1}]
[null,2,25,10,30,10,0.2,null,null,6,1,{"$f":"IF(B8=gv,$V$43,INDEX(ankre,11+12*(B8-1),1))","v":58.278931684871097},{"$f":"IF(OR(INDEX(vægstabilitet,11+12*(B8-1),19)=\"!\",INDEX(vægstabilitet,10+12*(B8-1),19)=\"!\",INDEX(vægstabilitet,9+12*(B8-1),19)=\"!\",INDEX(vægstabilitet,8+12*(B8-1),19)=\"!\",INDEX(vægstabilitet,7+12*(B8-1),19)=\"!\",INDEX(vægstabilitet,6+12*(B8-1),19)=\"!\"),1,0)","v":0},5,3,16,32.10479999999999,20.000000000000004,82.277999999999992,null,null,null,null,null,null,null,null,null,null,null,null,null,null,null,null,null,null,null,null,null,null,null,null,null,null,null,null,null,null,null,null,null,null,null,"Etage 2",5,0,null,null,null,null,null,null,null,null,null,null,null,null,null,null,null,null,null,null,null,null,null,null,null,null,null,null,null,null,null,null,null,null,null,null,null,null,null,null,null,null,null,null,null,null,null,null,null,null,null,null,null,null,null,null,null,null,null,null,null,null,null,null,null,null,null,null,null,null,null,null,null,null,{"$f":"IF(AND(INDEX(vægstabilitet,11+12*(B8-1),14)<>0,K8*J8*G8*SQRT((E8-C8)^2+(F8-D8)^2)=0),0,B8)","v":2}]
{"$rows_left_out":70}
{"sheet":"System","index":1,"n_rows":63,"n_cols":19,"rows_kept":63,"cut":false,"hidden":false,"merged":[[1,13,1,15],[17,2,17,3],[17,4,17,5],[17,10,17,15],[5,1,5,2],[5,3,5,6],[15,10,15,15]]}
[]
[null,{"$f":"Inddata!C2","v":"BEF's prøvehus, ULS lastkomb. 6.10b"},null,null,null,null,null,null,null,null,null,null,"sag nr.:",{"$f":"Inddata!T2","v":"21-101"}]
[null,{"$f":"\"Lasttilfælde \"&Inddata!BM75","v":"Lasttilfælde 7a, Vind:  + W_y  og  + W_x*       (+ imperfektionsbidrag / masselast i vindretning)"},null,null,null,null,null,null,null,null,null,null,"init:",{"$f":"Inddata!X2","v":"NNN"}," ref. nr.:",{"$f":"Inddata!BT56","v":"7a"}]
[null,{"$f":"\"Bruger: \"&Inddata!O2","v":"Bruger: Bruger skal registreres"}]
[]
[null,"ETAGEHØJDER",null,"RESULTERENDE LASTE  PÅ\nDÆKSKIVER  OVER  ETAGER",null,null,null,null,null,null,"For hver væg defineres systemdata :"]
[null,"Etage","h_etg","y_Wx","W_x0","x_Wy","W_y0",null,null,null,"(x1 , y1)",null,"endepunkt 1"]
[null,null,"(m)","(m)","(KN)","(m)","(KN)",null,null,null,"(x2 , y2)",null,"endepunkt 2"]
{"$rows_left_out":56}
{"sheet":"Vægskiver","index":2,"n_rows":348,"n_cols":86,"rows_kept":348,"cut":false,"hidden":false,"merged":[[1,1,1,18],[2,1,2,18],[2,20,2,22],[1,20,1,22]]}
[]
[null,{"$f":"System!B2","v":"BEF's prøvehus, ULS lastkomb. 6.10b"},null,null,null,null,null,null,null,null,null,null,null,null,null,null,null,null,null,"sag nr.",{"$f":"System!$N$2","v":"21-101"}]
[null,{"$f":"System!B3","v":"Lasttilfælde 7a, Vind:  + W_y  og  + W_x*       (+ imperfektionsbidrag / masselast i vindretning)"},null,null,null,null,null,null,null,null,null,null,null,null,null,null,null,null,null,{"$f":"System!N3","v":"NNN"},{"$f":"\"ref. nr.:  \"&System!$P$3&\" - 1\"","v":"ref. nr.:  7a - 1"}]
[null,{"$f":"\"Bruger: \"&Inddata!O2","v":"Bruger: Bruger skal registreres"}]
[]
[]
[null,null,"V_i+1",null,null,null,null,null,null,null,null,null,"Lastvirkningerne V_i regnes positive i retningen fra væggens endepunkt"]
[null,null,null,null,null,null,null,null,null,null,null,null,"(x1, y1) mod endepunkt (x2, y2)"]
{"$rows_left_out":341}
{"sheet":"Vægplan","index":3,"n_rows":10,"n_cols":14,"rows_kept":10,"cut":false,"hidden":false,"merged":[[1,13,1,15],[2,13,2,15],[1,1,1,11],[2,1,2,11]]}
[]
[null,{"$f":"System!B2","v":"BEF's prøvehus, ULS lastkomb. 6.10b"},null,null,null,null,null,null,null,null,null,null,"sag nr.",{"$f":"System!$N$2","v":"21-101"}]
[null,{"$f":"System!B3","v":"Lasttilfælde 7a, Vind:  + W_y  og  + W_x*       (+ imperfektionsbidrag / masselast i vindretning)"},null,null,null,null,null,null,null,null,null,null,{"$f":"System!N3","v":"NNN"},{"$f":"\"ref. nr.:  \"&System!$P$3&\" - 2\"","v":"ref. nr.:  7a - 2"}]
[null,{"$f":"\"Bruger: \"&Inddata!O2","v":"Bruger: Bruger skal registreres"}]
[]
[]
[]
[]
{"$rows_left_out":3}
{"sheet":"Kontur","index":4,"n_rows":192,"n_cols":63,"rows_kept":192,"cut":false,"hidden":false,"merged":[[12,1,13,1],[2,1,3,1],[4,1,5,1],[2,40,3,40],[6,1,7,1],[8,1,9,1],[10,1,11,1]]}
[]
[null,"KONTURER",null,1,2,3,4,5,6,7,8,9,10,11,12,13,14,15,16,17,18,19,20,null,null,null,null,null,null,null,null,null,null,null,null,null,null,null,null,null,"KONTUR - hjørnepunkter:",null,1,2,3,4,5,6,7,8,9,10,11,12,13,14,15,16,17,18,19,20]
[null,"Etage 6","x (m) ",9.5,30.5,30.5,9.5,null,null,null,null,null,null,null,null,null,null,null,null,null,null,null,null,null,null,null,null,null,null,null,null,null,null,null,null,null,null,null,null,null,"Etage 6","x (m)",{"$f":"INDEX(kontur,1+2*(6-$AO$5),AQ$2)","v":9.5},{"$f":"IF(INDEX(kontur,1+2*(6-$AO$5),AR$2)=\"\",AQ3,INDEX(kontur,1+2*(6-$AO$5),AR$2))","v":30.5},30.5,9.5,9.5,9.5,9.5,9.5,9.5,9.5,9.5,9.5,9.5,9.5,9.5,9.5,9.5,9.5,9.5,9.5,{"$f":"AQ3","v":9.5}]
[null,null,"y(m) ",9.5,9.5,22.5,22.5,null,null,null,null,null,null,null,null,null,null,null,null,null,null,null,null,null,null,null,null,null,null,null,null,null,null,null,null,null,null,null,null,null,null,"y(m)",{"$f":"INDEX(kontur,2+2*(6-$AO$5),AQ$2)","v":9.5},{"$f":"IF(INDEX(kontur,2+2*(6-$AO$5),AR$2)=\"\",AQ4,INDEX(kontur,2+2*(6-$AO$5),AR$2))","v":9.5},22.5,22.5,22.5,22.5,22.5,22.5,22.5,22.5,22.5,22.5,22.5,22.5,22.5,22.5,22.5,22.5,22.5,22.5,{"$f":"AQ4","v":9.5}]
[null,"Etage 5","x (m) ",9.5,30.5,30.5,9.5,null,null,null,null,null,null,null,null,null,null,null,null,null,null,null,null,null,null,null,null,null,null,null,null,null,null,null,null,null,null,null,null,null,{"$f":"7-ge","v":1}]
[null,null,"y(m) ",9.5,9.5,22.5,22.5]
[null,"Etage 4","x (m) ",9.5,30.5,30.5,9.5]
[null,null,"y(m) ",9.5,9.5,22.5,22.5]
{"$rows_left_out":185}
{"sheet":"Laste","index":5,"n_rows":189,"n_cols":33,"rows_kept":189,"cut":false,"hidden":false,"merged":[[1,4,1,5],[2,8,2,17],[83,1,88,1],[13,5,13,6],[29,5,29,6],[13,12,13,13],[73,1,78,1],[13,16,13,17],[29,12,29,13],[29,16,29,17],[73,10,78,10],[83,10,88,10]]}
[null,null,null,null,null,null,null,null,null,null,null,null,null,null,null,null,null,null,null,null,null,null,null,null,null,null,null,null,null,null,"Topetage",null,{"$f":"MAX(Inddata!J7:J33)","v":6}]
[null,null,"Højde","Stern","Lodret last",null,"Vind"]
[null,null,"h_etg","h_s","q_flade","q_ækv","w",null,"Vindlasttilfælde suppleres i programmet med to undertilfælde svarende til vindsug på én gavl, eksempelvis :"]
[null,null,"(m)","(m)","(kN/m2)","(kN/m2)","(kN/m2)",null,null,"W_y",null,null,"W_y",null,null,null,"W_y"]
[null,6,{"$f":"Inddata!O7","v":3},0.6,10,2,1.2,null,null,null,null,null,null,null,null,null,null,null,null,null,null,null,null,null,null,null,null,null,null,null,6,{"$f":"IF(OR(AND(AE5<>topetg,D5<>0),AND(AE5>topetg,OR(D5<>0,E5<>0,F5<>0,G5<>0))),1,0)","v":0}]
[null,5,{"$f":"Inddata!O8","v":3},null,10,2,1.2,null,null,null,null,null,null,null,null,null,null,null,null,null,null,null,null,null,null,null,null,null,null,null,5,0]
[null,4,{"$f":"Inddata!O9","v":3},null,10,2,1.2,null,null,null,null,null,null,"W_x*",null,"-W_x*",null,null,null,null,null,null,null,null,null,null,null,null,null,null,4,0]
[null,3,{"$f":"Inddata!O10","v":3},null,10,2,1.2,null,null,null,null,null,null,null,null,null,null,null,null,null,null,null,null,null,null,null,null,null,null,null,3,0]
{"$rows_left_out":182}
{"sheet":"E1","index":6,"n_rows":46,"n_cols":17,"rows_kept":46,"cut":false,"hidden":false,"merged":[]}
[]
[]
[]
[]
["Etage:",1,null,null,null,null,null,null,null,null,null,null,null,null,"System:","x_0",{"$f":"(Q7*(-SUMPRODUCT(a_1,yacc)+SUMPRODUCT(a_1,xacs))+(-SUMPRODUCT(a_1,yacs)+SUMPRODUCT(a_1,xass)))/Q10","v":19.999999489897977}]
[null,null,null,null,null,null,null,null,null,null,null,null,null,null,null,"y_0",{"$f":"-(-SUMPRODUCT(a_1,yacc)+SUMPRODUCT(a_1,xacs)+Q8*(-SUMPRODUCT(a_1,yacs)+SUMPRODUCT(a_1,xass)))/Q9","v":9.9999992002000422}]
["Totallaste - incl. bidrag fra ovenliggende etager:",null,null,null,null,null,"W_x",{"$f":"INDEX(Last,7-$B$5,1)","v":203.11199999999994},"kN",null,null,null,null,null,null,"Dx",{"$f":"-SUMPRODUCT(a_1,acs)/SUMPRODUCT(a_1,acc)","v":1.999999920000004E-8}]
[null,null,null,null,null,null,"y_Wx",{"$f":"INDEX(Last,7-$B$5,2)","v":16},"m",null,null,null,null,null,null,"Dy",{"$f":"-SUMPRODUCT(a_1,acs)/SUMPRODUCT(a_1,ass)","v":1.0204081424406508E-8}]
{"$rows_left_out":39}
{"sheet":"E2","index":7,"n_rows":46,"n_cols":17,"rows_kept":46,"cut":false,"hidden":false,"merged":[]}
[]
[]
[]
[]
["Etage:",2,null,null,null,null,null,null,null,null,null,null,null,null,"System:","x_0",{"$f":"(Q7*(-SUMPRODUCT(a_2,yacc)+SUMPRODUCT(a_2,xacs))+(-SUMPRODUCT(a_2,yacs)+SUMPRODUCT(a_2,xass)))/Q10","v":19.999999489897977}]
[null,null,null,null,null,null,null,null,null,null,null,null,null,null,null,"y_0",{"$f":"-(-SUMPRODUCT(a_2,yacc)+SUMPRODUCT(a_2,xacs)+Q8*(-SUMPRODUCT(a_2,yacs)+SUMPRODUCT(a_2,xass)))/Q9","v":9.9999992002000422}]
["Totallaste - incl. bidrag fra ovenliggende etager:",null,null,null,null,null,"W_x",{"$f":"INDEX(Last,7-$B$5,1)","v":162.16199999999995},"kN",null,null,null,null,null,null,"Dx",{"$f":"-SUMPRODUCT(a_2,acs)/SUMPRODUCT(a_2,acc)","v":1.999999920000004E-8}]
[null,null,null,null,null,null,"y_Wx",{"$f":"INDEX(Last,7-$B$5,2)","v":16},"m",null,null,null,null,null,null,"Dy",{"$f":"-SUMPRODUCT(a_2,acs)/SUMPRODUCT(a_2,ass)","v":1.0204081424406508E-8}]
{"$rows_left_out":39}
{"sheet":"E3","index":8,"n_rows":46,"n_cols":17,"rows_kept":46,"cut":false,"hidden":false,"merged":[]}
[]
[]
[]
[]
["Etage:",3,null,null,null,null,null,null,null,null,null,null,null,null,"System:","x_0",{"$f":"(Q7*(-SUMPRODUCT(a_3,yacc)+SUMPRODUCT(a_3,xacs))+(-SUMPRODUCT(a_3,yacs)+SUMPRODUCT(a_3,xass)))/Q10","v":19.999999489897977}]
[null,null,null,null,null,null,null,null,null,null,null,null,null,null,null,"y_0",{"$f":"-(-SUMPRODUCT(a_3,yacc)+SUMPRODUCT(a_3,xacs)+Q8*(-SUMPRODUCT(a_3,yacs)+SUMPRODUCT(a_3,xass)))/Q9","v":9.9999992002000422}]
["Totallaste - incl. bidrag fra ovenliggende etager:",null,null,null,null,null,"W_x",{"$f":"INDEX(Last,7-$B$5,1)","v":121.21199999999996},"kN",null,null,null,null,null,null,"Dx",{"$f":"-SUMPRODUCT(a_3,acs)/SUMPRODUCT(a_3,acc)","v":1.999999920000004E-8}]
[null,null,null,null,null,null,"y_Wx",{"$f":"INDEX(Last,7-$B$5,2)","v":16},"m",null,null,null,null,null,null,"Dy",{"$f":"-SUMPRODUCT(a_3,acs)/SUMPRODUCT(a_3,ass)","v":1.0204081424406508E-8}]
{"$rows_left_out":39}
{"sheet":"E4","index":9,"n_rows":46,"n_cols":17,"rows_kept":46,"cut":false,"hidden":false,"merged":[]}
[]
[]
[]
[]
["Etage:",4,null,null,null,null,null,null,null,null,null,null,null,null,"System:","x_0",{"$f":"(Q7*(-SUMPRODUCT(a_4,yacc)+SUMPRODUCT(a_4,xacs))+(-SUMPRODUCT(a_4,yacs)+SUMPRODUCT(a_4,xass)))/Q10","v":19.999999489897977}]
[null,null,null,null,null,null,null,null,null,null,null,null,null,null,null,"y_0",{"$f":"-(-SUMPRODUCT(a_4,yacc)+SUMPRODUCT(a_4,xacs)+Q8*(-SUMPRODUCT(a_4,yacs)+SUMPRODUCT(a_4,xass)))/Q9","v":9.9999992002000422}]
["Totallaste - incl. bidrag fra ovenliggende etager:",null,null,null,null,null,"W_x",{"$f":"INDEX(Last,7-$B$5,1)","v":88.45199999999997},"kN",null,null,null,null,null,null,"Dx",{"$f":"-SUMPRODUCT(a_4,acs)/SUMPRODUCT(a_4,acc)","v":1.999999920000004E-8}]
[null,null,null,null,null,null,"y_Wx",{"$f":"INDEX(Last,7-$B$5,2)","v":16},"m",null,null,null,null,null,null,"Dy",{"$f":"-SUMPRODUCT(a_4,acs)/SUMPRODUCT(a_4,ass)","v":1.0204081424406508E-8}]
{"$rows_left_out":39}
{"sheet":"E5","index":10,"n_rows":46,"n_cols":17,"rows_kept":46,"cut":false,"hidden":false,"merged":[]}
[]
[]
[]
[]
["Etage:",5,null,null,null,null,null,null,null,null,null,null,null,null,"System:","x_0",{"$f":"(Q7*(-SUMPRODUCT(a_5,yacc)+SUMPRODUCT(a_5,xacs))+(-SUMPRODUCT(a_5,yacs)+SUMPRODUCT(a_5,xass)))/Q10","v":19.999999489897977}]
[null,null,null,null,null,null,null,null,null,null,null,null,null,null,null,"y_0",{"$f":"-(-SUMPRODUCT(a_5,yacc)+SUMPRODUCT(a_5,xacs)+Q8*(-SUMPRODUCT(a_5,yacs)+SUMPRODUCT(a_5,xass)))/Q9","v":9.9999992002000422}]
["Totallaste - incl. bidrag fra ovenliggende etager:",null,null,null,null,null,"W_x",{"$f":"INDEX(Last,7-$B$5,1)","v":55.691999999999986},"kN",null,null,null,null,null,null,"Dx",{"$f":"-SUMPRODUCT(a_5,acs)/SUMPRODUCT(a_5,acc)","v":1.999999920000004E-8}]
[null,null,null,null,null,null,"y_Wx",{"$f":"INDEX(Last,7-$B$5,2)","v":16},"m",null,null,null,null,null,null,"Dy",{"$f":"-SUMPRODUCT(a_5,acs)/SUMPRODUCT(a_5,ass)","v":1.0204081424406508E-8}]
{"$rows_left_out":39}
{"sheet":"E6","index":11,"n_rows":46,"n_cols":17,"rows_kept":46,"cut":false,"hidden":false,"merged":[]}
[]
[]
[]
[]
["Etage:",6,null,null,null,null,null,null,null,null,null,null,null,null,"System:","x_0",{"$f":"(Q7*(-SUMPRODUCT(a_6,yacc)+SUMPRODUCT(a_6,xacs))+(-SUMPRODUCT(a_6,yacs)+SUMPRODUCT(a_6,xass)))/Q10","v":19.999999489897977}]
[null,null,null,null,null,null,null,null,null,null,null,null,null,null,null,"y_0",{"$f":"-(-SUMPRODUCT(a_6,yacc)+SUMPRODUCT(a_6,xacs)+Q8*(-SUMPRODUCT(a_6,yacs)+SUMPRODUCT(a_6,xass)))/Q9","v":9.9999992002000422}]
["Totallaste - incl. bidrag fra ovenliggende etager:",null,null,null,null,null,"W_x",{"$f":"INDEX(Last,7-$B$5,1)","v":23.587199999999996},"kN",null,null,null,null,null,null,"Dx",{"$f":"-SUMPRODUCT(a_6,acs)/SUMPRODUCT(a_6,acc)","v":1.999999920000004E-8}]
[null,null,null,null,null,null,"y_Wx",{"$f":"INDEX(Last,7-$B$5,2)","v":16},"m",null,null,null,null,null,null,"Dy",{"$f":"-SUMPRODUCT(a_6,acs)/SUMPRODUCT(a_6,ass)","v":1.0204081424406508E-8}]
{"$rows_left_out":39}
{"sheet":"Skala","index":12,"n_rows":48,"n_cols":115,"rows_kept":48,"cut":false,"hidden":false,"merged":[]}
[]
["TOTALER",null,null,null,null,null,"SKALERING",null,null,null,null,null,null,null,null,null,null,null,null,null,null,null,null,null,null,null,null,null,null,null,null,null,null,null,null,null,null,null,null,null,null,null,null,null,null,null,null,null,null,null,null,null,null,null,null,null,null,null,null,null,null,null,null,null,null,null,null,null,null,null,null,null,null,null,null,null,null,null,null,{"$f":"'E6'!Q5","v":19.999999489897977},{"$f":"'E6'!Q6","v":9.9999992002000422}]
["Etage","W_x","y_Wx","W_y","x_Wy",null,null,null,"s_xy",1.5,null,null,null,null,null,null,null,null,null,null,null,null,null,null,null,null,null,null,null,null,null,null,null,null,null,null,null,null,null,null,null,null,null,null,null,null,null,null,null,null,null,null,null,null,null,null,null,null,null,null,null,null,null,null,null,null,null,null,null,null,null,null,null,null,null,null,null,null,null,{"$f":"'E5'!Q5","v":19.999999489897977},{"$f":"'E5'!Q6","v":9.9999992002000422}]
[6,{"$f":"System!E9","v":23.587199999999996},{"$f":"System!D9","v":16},{"$f":"System!G9","v":62.622},{"$f":"System!F9","v":19.999999999999996},null,"min_x",{"$f":"MIN(System!C22:C48,System!E22:E48)","v":0},"L_x",{"$f":"H5-H4","v":30},null,null,null,null,null,null,null,null,null,null,null,null,null,null,null,null,null,null,null,null,null,null,null,null,null,null,null,null,null,null,null,null,null,null,null,null,null,null,null,null,null,null,null,null,null,null,null,null,null,null,null,null,null,null,null,null,null,null,null,null,null,null,null,null,null,null,null,null,null,{"$f":"'E4'!Q5","v":19.999999489897977},{"$f":"'E4'!Q6","v":9.9999992002000422}]
[5,{"$f":"B4+System!E10","v":55.691999999999986},{"$f":"IF(B5=0,System!D10,(B4*C4+System!E10*System!D10)/B5)","v":16},{"$f":"D4+System!G10","v":144.89999999999998},{"$f":"IF(D5=0,System!F10,(D4*E4+System!G10*System!F10)/D5)","v":20.000000000000004},null,"max_x",{"$f":"MAX(System!C22:C48,System!E22:E48,minx+10)","v":30},"L_y",{"$f":"H7-H6","v":22},null,null,null,null,null,null,null,null,null,null,null,null,null,null,null,null,null,null,null,null,null,null,null,null,null,null,null,null,null,null,null,null,null,null,null,null,null,null,null,null,null,null,null,null,null,null,null,null,null,null,null,null,null,null,null,null,null,null,null,null,null,null,null,null,null,null,null,null,null,{"$f":"'E3'!Q5","v":19.999999489897977},{"$f":"'E3'!Q6","v":9.9999992002000422}]
[4,{"$f":"B5+System!E11","v":88.45199999999997},{"$f":"IF(B6=0,System!D11,(B5*C5+System!E11*System!D11)/B6)","v":16},{"$f":"D5+System!G11","v":228.68999999999997},{"$f":"IF(D6=0,System!F11,(D5*E5+System!G11*System!F11)/D6)","v":20},null,"min_y",{"$f":"MIN(System!D22:D48,System!F22:F48)","v":0},"L_xx",{"$f":"IF(J4/J5<=J3,J5*J3,J4)+10","v":43},null,null,null,null,null,null,null,null,null,null,null,null,null,null,null,null,null,null,null,null,null,null,null,null,null,null,null,null,null,null,null,null,null,null,null,null,null,null,null,null,null,null,null,null,null,null,null,null,null,null,null,null,null,null,null,null,null,null,null,null,null,null,null,null,null,null,null,null,null,{"$f":"'E2'!Q5","v":19.999999489897977},{"$f":"'E2'!Q6","v":9.9999992002000422},null,null,null,null,{"$f":"COLUMN()-19","v":67},null,null,null,null,null,null,null,null,{"$f":"ge","v":6}]
[3,{"$f":"B6+System!E12","v":121.21199999999996},{"$f":"IF(B7=0,System!D12,(B6*C6+System!E12*System!D12)/B7)","v":16},{"$f":"D6+System!G12","v":312.47999999999996},{"$f":"IF(D7=0,System!F12,(D6*E6+System!G12*System!F12)/D7)","v":19.999999999999996},null,"max_y",{"$f":"MAX(System!D22:D48,System!F22:F48,miny+10)","v":22},"L_yy",{"$f":"IF(J4/J5<=J3,J5,J4/J3)+10/J3","v":28.666666666666668},null,null,null,null,null,null,null,null,null,null,null,null,null,null,null,null,null,null,null,null,null,null,null,null,null,null,null,null,null,null,null,null,null,null,null,null,null,null,null,null,null,null,null,null,null,null,null,null,null,null,null,null,null,null,null,null,null,null,null,null,null,null,null,null,null,null,null,null,null,{"$f":"'E1'!Q5","v":19.999999489897977},{"$f":"'E1'!Q6","v":9.9999992002000422}]
[2,{"$f":"B7+System!E13","v":162.16199999999995},{"$f":"IF(B8=0,System!D13,(B7*C7+System!E13*System!D13)/B8)","v":16},{"$f":"D7+System!G13","v":415.16999999999996},{"$f":"IF(D8=0,System!F13,(D7*E7+System!G13*System!F13)/D8)","v":19.999999999999996},null,null,null,null,null,null,null,null,null,null,null,null,null,null,null,null,null,null,null,null,null,null,null,null,null,null,null,null,null,null,null,null,null,null,null,null,null,null,null,null,null,null,null,null,null,null,null,null,null,null,null,null,null,null,null,null,null,null,null,null,null,null,null,null,null,null,null,null,null,null,null,null,null,null,null,null,null,null,null,{"$f":"INDEX(wind,ge,4)","v":102.69}]
{"$rows_left_out":41}
{"sheet":"Trig","index":13,"n_rows":44,"n_cols":20,"rows_kept":44,"cut":false,"hidden":false,"merged":[]}
[]
[]
[]
[]
[]
[]
[]
[]
{"$rows_left_out":36}